Bonjour, j'essai de compiler le wrap OgreOde avec Ogre V1.6.2 et Ode V0.11.1.

Lors de la génération Cmake, aucun problème, j'ai configurer Mingw pour C::B. J'ai donc un projet C::B qui est généré et lorsque je tente de le compiler j'obtiens ce log :

Code : Sélectionner tout - Visualiser dans une fenêtre à part
1
2
3
4
5
6
7
8
9
10
11
12
13
14
15
16
17
18
19
20
21
22
23
24
25
26
27
28
29
30
31
32
33
34
35
36
37
38
39
40
41
42
43
44
45
46
47
48
49
50
51
52
53
54
55
56
57
58
59
60
61
62
63
64
65
66
67
68
69
70
71
72
73
74
75
76
77
78
79
80
81
82
83
84
85
86
87
88
89
90
91
92
93
94
95
96
97
98
99
100
101
102
103
104
105
106
107
108
109
110
111
112
113
114
115
116
117
118
119
120
121
122
123
124
125
126
127
128
129
130
131
132
133
134
135
136
137
138
139
140
141
142
143
144
145
146
147
148
149
150
151
152
153
154
155
156
157
158
159
160
161
162
163
164
165
166
167
168
169
170
171
172
173
174
175
176
177
178
179
180
181
182
183
184
185
186
187
188
189
190
191
192
193
194
195
196
197
198
199
200
201
202
203
204
205
206
207
208
209
210
211
212
213
214
215
216
217
218
219
220
221
222
223
224
225
226
227
228
229
230
231
232
233
234
235
236
237
238
239
240
241
242
243
244
245
246
247
248
249
250
251
252
253
254
255
256
257
258
259
260
261
262
263
264
265
266
267
268
269
270
271
272
273
274
275
276
277
278
279
280
281
282
283
284
285
286
287
288
289
290
291
292
293
294
295
296
297
298
299
300
301
302
303
304
305
306
307
308
309
310
311
312
313
314
315
316
317
318
319
320
321
322
323
324
325
326
327
328
329
330
331
332
333
334
335
336
337
338
339
340
341
342
343
344
345
346
347
348
349
350
351
352
353
354
355
356
357
358
359
360
361
362
363
364
365
366
367
368
369
370
371
372
373
374
375
376
377
378
379
380
381
382
383
384
385
386
387
388
389
"C:\Program Files\CMake 2.8\bin\cmake.exe" -H"E:\Program Files\CodeBlocks\OgreSDK\ogreaddons\ogreode" -B"E:\Program Files\CodeBlocks\OgreSDK\ogreaddons\ogreode" --check-build-system CMakeFiles\Makefile.cmake 0
"C:\Program Files\CMake 2.8\bin\cmake.exe" -E cmake_progress_start "E:\Program Files\CodeBlocks\OgreSDK\ogreaddons\ogreode\CMakeFiles" "E:\Program Files\CodeBlocks\OgreSDK\ogreaddons\ogreode\CMakeFiles\progress.marks"
C:/MinGW/bin/mingw32-make.exe -f CMakeFiles\Makefile2 all
mingw32-make.exe[1]: Entering directory `E:/Program Files/CodeBlocks/OgreSDK/ogreaddons/ogreode'
C:/MinGW/bin/mingw32-make.exe -f tinyxml\CMakeFiles\tinyxml.dir\build.make tinyxml/CMakeFiles/tinyxml.dir/depend
mingw32-make.exe[2]: Entering directory `E:/Program Files/CodeBlocks/OgreSDK/ogreaddons/ogreode'
"C:\Program Files\CMake 2.8\bin\cmake.exe" -E cmake_depends "MinGW Makefiles" "E:\Program Files\CodeBlocks\OgreSDK\ogreaddons\ogreode" "E:\Program Files\CodeBlocks\OgreSDK\ogreaddons\ogreode\tinyxml" "E:\Program Files\CodeBlocks\OgreSDK\ogreaddons\ogreode" "E:\Program Files\CodeBlocks\OgreSDK\ogreaddons\ogreode\tinyxml" "E:\Program Files\CodeBlocks\OgreSDK\ogreaddons\ogreode\tinyxml\CMakeFiles\tinyxml.dir\DependInfo.cmake" --color=
Scanning dependencies of target tinyxml
mingw32-make.exe[2]: Leaving directory `E:/Program Files/CodeBlocks/OgreSDK/ogreaddons/ogreode'
C:/MinGW/bin/mingw32-make.exe -f tinyxml\CMakeFiles\tinyxml.dir\build.make tinyxml/CMakeFiles/tinyxml.dir/build
mingw32-make.exe[2]: Entering directory `E:/Program Files/CodeBlocks/OgreSDK/ogreaddons/ogreode'
"C:\Program Files\CMake 2.8\bin\cmake.exe" -E cmake_progress_report "E:\Program Files\CodeBlocks\OgreSDK\ogreaddons\ogreode\CMakeFiles" 26
[  3%] 
Building CXX object tinyxml/CMakeFiles/tinyxml.dir/tinystr.cpp.obj
cd E:\PROGRA~1\CODEBL~1\OgreSDK\OGREAD~1\ogreode\tinyxml && C:\MinGW\bin\g++.exe    -O3 -DNDEBUG -IE:\PROGRA~1\CODEBL~1\OgreSDK\OGREAD~1\ogreode\ode\include -I"E:\Program Files\CodeBlocks\OgreSDK\Samples\Common\include" -IE:\PROGRA~1\CODEBL~1\OgreSDK -IE:\PROGRA~1\CODEBL~1\OgreSDK\include   -o CMakeFiles\tinyxml.dir\tinystr.cpp.obj -c "E:\Program Files\CodeBlocks\OgreSDK\ogreaddons\ogreode\tinyxml\tinystr.cpp"
"C:\Program Files\CMake 2.8\bin\cmake.exe" -E cmake_progress_report "E:\Program Files\CodeBlocks\OgreSDK\ogreaddons\ogreode\CMakeFiles" 27
[  6%] 
Building CXX object tinyxml/CMakeFiles/tinyxml.dir/tinyxml.cpp.obj
cd E:\PROGRA~1\CODEBL~1\OgreSDK\OGREAD~1\ogreode\tinyxml && C:\MinGW\bin\g++.exe    -O3 -DNDEBUG -IE:\PROGRA~1\CODEBL~1\OgreSDK\OGREAD~1\ogreode\ode\include -I"E:\Program Files\CodeBlocks\OgreSDK\Samples\Common\include" -IE:\PROGRA~1\CODEBL~1\OgreSDK -IE:\PROGRA~1\CODEBL~1\OgreSDK\include   -o CMakeFiles\tinyxml.dir\tinyxml.cpp.obj -c "E:\Program Files\CodeBlocks\OgreSDK\ogreaddons\ogreode\tinyxml\tinyxml.cpp"
"C:\Program Files\CMake 2.8\bin\cmake.exe" -E cmake_progress_report "E:\Program Files\CodeBlocks\OgreSDK\ogreaddons\ogreode\CMakeFiles" 28
[ 10%] Building CXX object tinyxml/CMakeFiles/tinyxml.dir/tinyxmlerror.cpp.obj
cd E:\PROGRA~1\CODEBL~1\OgreSDK\OGREAD~1\ogreode\tinyxml && C:\MinGW\bin\g++.exe    -O3 -DNDEBUG -IE:\PROGRA~1\CODEBL~1\OgreSDK\OGREAD~1\ogreode\ode\include -I"E:\Program Files\CodeBlocks\OgreSDK\Samples\Common\include" -IE:\PROGRA~1\CODEBL~1\OgreSDK -IE:\PROGRA~1\CODEBL~1\OgreSDK\include   -o CMakeFiles\tinyxml.dir\tinyxmlerror.cpp.obj -c "E:\Program Files\CodeBlocks\OgreSDK\ogreaddons\ogreode\tinyxml\tinyxmlerror.cpp"
"C:\Program Files\CMake 2.8\bin\cmake.exe" -E cmake_progress_report "E:\Program Files\CodeBlocks\OgreSDK\ogreaddons\ogreode\CMakeFiles" 29
[ 13%] 
Building CXX object tinyxml/CMakeFiles/tinyxml.dir/tinyxmlparser.cpp.obj
cd E:\PROGRA~1\CODEBL~1\OgreSDK\OGREAD~1\ogreode\tinyxml && C:\MinGW\bin\g++.exe    -O3 -DNDEBUG -IE:\PROGRA~1\CODEBL~1\OgreSDK\OGREAD~1\ogreode\ode\include -I"E:\Program Files\CodeBlocks\OgreSDK\Samples\Common\include" -IE:\PROGRA~1\CODEBL~1\OgreSDK -IE:\PROGRA~1\CODEBL~1\OgreSDK\include   -o CMakeFiles\tinyxml.dir\tinyxmlparser.cpp.obj -c "E:\Program Files\CodeBlocks\OgreSDK\ogreaddons\ogreode\tinyxml\tinyxmlparser.cpp"
Linking CXX static library libtinyxml.a
cd E:\PROGRA~1\CODEBL~1\OgreSDK\OGREAD~1\ogreode\tinyxml && "C:\Program Files\CMake 2.8\bin\cmake.exe" -P CMakeFiles\tinyxml.dir\cmake_clean_target.cmake
cd E:\PROGRA~1\CODEBL~1\OgreSDK\OGREAD~1\ogreode\tinyxml && "C:\Program Files\CMake 2.8\bin\cmake.exe" -E cmake_link_script CMakeFiles\tinyxml.dir\link.txt --verbose=1
C:\MinGW\bin\ar.exe cr libtinyxml.a  CMakeFiles\tinyxml.dir\tinystr.cpp.obj CMakeFiles\tinyxml.dir\tinyxml.cpp.obj CMakeFiles\tinyxml.dir\tinyxmlerror.cpp.obj CMakeFiles\tinyxml.dir\tinyxmlparser.cpp.obj
C:\MinGW\bin\ranlib.exe libtinyxml.a
mingw32-make.exe[2]: Leaving directory `E:/Program Files/CodeBlocks/OgreSDK/ogreaddons/ogreode'
"C:\Program Files\CMake 2.8\bin\cmake.exe" -E cmake_progress_report "E:\Program Files\CodeBlocks\OgreSDK\ogreaddons\ogreode\CMakeFiles"  26 27 28 29
[ 13%] 
Built target tinyxml
C:/MinGW/bin/mingw32-make.exe -f Core\CMakeFiles\OgreOde_Core.dir\build.make Core/CMakeFiles/OgreOde_Core.dir/depend
mingw32-make.exe[2]: Entering directory `E:/Program Files/CodeBlocks/OgreSDK/ogreaddons/ogreode'
"C:\Program Files\CMake 2.8\bin\cmake.exe" -E cmake_depends "MinGW Makefiles" "E:\Program Files\CodeBlocks\OgreSDK\ogreaddons\ogreode" "E:\Program Files\CodeBlocks\OgreSDK\ogreaddons\ogreode\Core" "E:\Program Files\CodeBlocks\OgreSDK\ogreaddons\ogreode" "E:\Program Files\CodeBlocks\OgreSDK\ogreaddons\ogreode\Core" "E:\Program Files\CodeBlocks\OgreSDK\ogreaddons\ogreode\Core\CMakeFiles\OgreOde_Core.dir\DependInfo.cmake" --color=
Scanning dependencies of target OgreOde_Core
mingw32-make.exe[2]: Leaving directory `E:/Program Files/CodeBlocks/OgreSDK/ogreaddons/ogreode'
C:/MinGW/bin/mingw32-make.exe -f Core\CMakeFiles\OgreOde_Core.dir\build.make Core/CMakeFiles/OgreOde_Core.dir/build
mingw32-make.exe[2]: Entering directory `E:/Program Files/CodeBlocks/OgreSDK/ogreaddons/ogreode'
"C:\Program Files\CMake 2.8\bin\cmake.exe" -E cmake_progress_report "E:\Program Files\CodeBlocks\OgreSDK\ogreaddons\ogreode\CMakeFiles" 5
[ 17%] 
Building CXX object Core/CMakeFiles/OgreOde_Core.dir/src/OgreOdeBody.cpp.obj
cd E:\PROGRA~1\CODEBL~1\OgreSDK\OGREAD~1\ogreode\Core && C:\MinGW\bin\g++.exe   -DOgreOde_Core_EXPORTS -DOGREODE_EXPORTS -DdSINGLE -O3 -DNDEBUG -IE:\PROGRA~1\CODEBL~1\OgreSDK\OGREAD~1\ogreode\ode\include -I"E:\Program Files\CodeBlocks\OgreSDK\Samples\Common\include" -IE:\PROGRA~1\CODEBL~1\OgreSDK -IE:\PROGRA~1\CODEBL~1\OgreSDK\include -IE:\PROGRA~1\CODEBL~1\OgreSDK\OGREAD~1\ogreode\Core\include   -o CMakeFiles\OgreOde_Core.dir\src\OgreOdeBody.cpp.obj -c "E:\Program Files\CodeBlocks\OgreSDK\ogreaddons\ogreode\Core\src\OgreOdeBody.cpp"
In file included from E:/PROGRA~1/CODEBL~1/OgreSDK/include/OgreTimer.h:37,
                 from E:/PROGRA~1/CODEBL~1/OgreSDK/include/OgreRenderTarget.h:37,
                 from E:/PROGRA~1/CODEBL~1/OgreSDK/include/OgreRenderSystem.h:42,
                 from E:/PROGRA~1/CODEBL~1/OgreSDK/include/Ogre.h:88,
                 from E:/PROGRA~1/CODEBL~1/OgreSDK/OGREAD~1/ogreode/Core/include/OgreOdePreReqs.h:4,
                 from E:/PROGRA~1/CODEBL~1/OgreSDK/OGREAD~1/ogreode/Core/include/OgreOdeWorld.h:4,
                 from E:\Program Files\CodeBlocks\OgreSDK\ogreaddons\ogreode\Core\src\OgreOdeBody.cpp:4:
E:/PROGRA~1/CODEBL~1/OgreSDK/include/WIN32/OgreTimerImp.h:33:1: warning: "NOMINMAX" redefined
In file included from C:/MinGW/bin/../lib/gcc/mingw32/3.4.2/../../../../include/c++/3.4.2/mingw32/bits/c++config.h:35,
                 from C:/MinGW/bin/../lib/gcc/mingw32/3.4.2/../../../../include/c++/3.4.2/string:45,
                 from E:/PROGRA~1/CODEBL~1/OgreSDK/include/OgrePrerequisites.h:32,
                 from E:/PROGRA~1/CODEBL~1/OgreSDK/include/Ogre.h:32,
                 from E:/PROGRA~1/CODEBL~1/OgreSDK/OGREAD~1/ogreode/Core/include/OgreOdePreReqs.h:4,
                 from E:/PROGRA~1/CODEBL~1/OgreSDK/OGREAD~1/ogreode/Core/include/OgreOdeWorld.h:4,
                 from E:\Program Files\CodeBlocks\OgreSDK\ogreaddons\ogreode\Core\src\OgreOdeBody.cpp:4:
C:/MinGW/bin/../lib/gcc/mingw32/3.4.2/../../../../include/c++/3.4.2/mingw32/bits/os_defines.h:46:1: warning: this is the location of the previous definition
E:\Program Files\CodeBlocks\OgreSDK\ogreaddons\ogreode\Core\src\OgreOdeBody.cpp:857:2: warning: no newline at end of file
"C:\Program Files\CMake 2.8\bin\cmake.exe" -E cmake_progress_report "E:\Program Files\CodeBlocks\OgreSDK\ogreaddons\ogreode\CMakeFiles" 6
[ 20%] Building CXX object Core/CMakeFiles/OgreOde_Core.dir/src/OgreOdeCollision.cpp.obj
cd E:\PROGRA~1\CODEBL~1\OgreSDK\OGREAD~1\ogreode\Core && C:\MinGW\bin\g++.exe   -DOgreOde_Core_EXPORTS -DOGREODE_EXPORTS -DdSINGLE -O3 -DNDEBUG -IE:\PROGRA~1\CODEBL~1\OgreSDK\OGREAD~1\ogreode\ode\include -I"E:\Program Files\CodeBlocks\OgreSDK\Samples\Common\include" -IE:\PROGRA~1\CODEBL~1\OgreSDK -IE:\PROGRA~1\CODEBL~1\OgreSDK\include -IE:\PROGRA~1\CODEBL~1\OgreSDK\OGREAD~1\ogreode\Core\include   -o CMakeFiles\OgreOde_Core.dir\src\OgreOdeCollision.cpp.obj -c "E:\Program Files\CodeBlocks\OgreSDK\ogreaddons\ogreode\Core\src\OgreOdeCollision.cpp"
In file included from E:/PROGRA~1/CODEBL~1/OgreSDK/include/OgreTimer.h:37,
                 from E:/PROGRA~1/CODEBL~1/OgreSDK/include/OgreRenderTarget.h:37,
                 from E:/PROGRA~1/CODEBL~1/OgreSDK/include/OgreRenderSystem.h:42,
                 from E:/PROGRA~1/CODEBL~1/OgreSDK/include/Ogre.h:88,
                 from E:/PROGRA~1/CODEBL~1/OgreSDK/OGREAD~1/ogreode/Core/include/OgreOdePreReqs.h:4,
                 from E:/PROGRA~1/CODEBL~1/OgreSDK/OGREAD~1/ogreode/Core/include/OgreOdeCollision.h:4,
                 from E:\Program Files\CodeBlocks\OgreSDK\ogreaddons\ogreode\Core\src\OgreOdeCollision.cpp:4:
E:/PROGRA~1/CODEBL~1/OgreSDK/include/WIN32/OgreTimerImp.h:33:1: warning: "NOMINMAX" redefined
In file included from C:/MinGW/bin/../lib/gcc/mingw32/3.4.2/../../../../include/c++/3.4.2/mingw32/bits/c++config.h:35,
                 from C:/MinGW/bin/../lib/gcc/mingw32/3.4.2/../../../../include/c++/3.4.2/string:45,
                 from E:/PROGRA~1/CODEBL~1/OgreSDK/include/OgrePrerequisites.h:32,
                 from E:/PROGRA~1/CODEBL~1/OgreSDK/include/Ogre.h:32,
                 from E:/PROGRA~1/CODEBL~1/OgreSDK/OGREAD~1/ogreode/Core/include/OgreOdePreReqs.h:4,
                 from E:/PROGRA~1/CODEBL~1/OgreSDK/OGREAD~1/ogreode/Core/include/OgreOdeCollision.h:4,
                 from E:\Program Files\CodeBlocks\OgreSDK\ogreaddons\ogreode\Core\src\OgreOdeCollision.cpp:4:
C:/MinGW/bin/../lib/gcc/mingw32/3.4.2/../../../../include/c++/3.4.2/mingw32/bits/os_defines.h:46:1: warning: this is the location of the previous definition
E:\Program Files\CodeBlocks\OgreSDK\ogreaddons\ogreode\Core\src\OgreOdeCollision.cpp:323:99: warning: no newline at end of file
"C:\Program Files\CMake 2.8\bin\cmake.exe" -E cmake_progress_report "E:\Program Files\CodeBlocks\OgreSDK\ogreaddons\ogreode\CMakeFiles" 7
[ 24%] 
Building CXX object Core/CMakeFiles/OgreOde_Core.dir/src/OgreOdeDebugContact.cpp.obj
cd E:\PROGRA~1\CODEBL~1\OgreSDK\OGREAD~1\ogreode\Core && C:\MinGW\bin\g++.exe   -DOgreOde_Core_EXPORTS -DOGREODE_EXPORTS -DdSINGLE -O3 -DNDEBUG -IE:\PROGRA~1\CODEBL~1\OgreSDK\OGREAD~1\ogreode\ode\include -I"E:\Program Files\CodeBlocks\OgreSDK\Samples\Common\include" -IE:\PROGRA~1\CODEBL~1\OgreSDK -IE:\PROGRA~1\CODEBL~1\OgreSDK\include -IE:\PROGRA~1\CODEBL~1\OgreSDK\OGREAD~1\ogreode\Core\include   -o CMakeFiles\OgreOde_Core.dir\src\OgreOdeDebugContact.cpp.obj -c "E:\Program Files\CodeBlocks\OgreSDK\ogreaddons\ogreode\Core\src\OgreOdeDebugContact.cpp"
In file included from E:/PROGRA~1/CODEBL~1/OgreSDK/include/OgreTimer.h:37,
                 from E:/PROGRA~1/CODEBL~1/OgreSDK/include/OgreRenderTarget.h:37,
                 from E:/PROGRA~1/CODEBL~1/OgreSDK/include/OgreRenderSystem.h:42,
                 from E:/PROGRA~1/CODEBL~1/OgreSDK/include/Ogre.h:88,
                 from E:\Program Files\CodeBlocks\OgreSDK\ogreaddons\ogreode\Core\src\OgreOdeDebugContact.cpp:12:
E:/PROGRA~1/CODEBL~1/OgreSDK/include/WIN32/OgreTimerImp.h:33:1: warning: "NOMINMAX" redefined
In file included from C:/MinGW/bin/../lib/gcc/mingw32/3.4.2/../../../../include/c++/3.4.2/mingw32/bits/c++config.h:35,
                 from C:/MinGW/bin/../lib/gcc/mingw32/3.4.2/../../../../include/c++/3.4.2/string:45,
                 from E:/PROGRA~1/CODEBL~1/OgreSDK/include/OgrePrerequisites.h:32,
                 from E:/PROGRA~1/CODEBL~1/OgreSDK/include/Ogre.h:32,
                 from E:\Program Files\CodeBlocks\OgreSDK\ogreaddons\ogreode\Core\src\OgreOdeDebugContact.cpp:12:
C:/MinGW/bin/../lib/gcc/mingw32/3.4.2/../../../../include/c++/3.4.2/mingw32/bits/os_defines.h:46:1: warning: this is the location of the previous definition
In file included from E:\Program Files\CodeBlocks\OgreSDK\ogreaddons\ogreode\Core\src\OgreOdeDebugContact.cpp:15:
E:/PROGRA~1/CODEBL~1/OgreSDK/OGREAD~1/ogreode/Core/include/OgreOdeDebugContact.h:154:7: warning: no newline at end of file
E:\Program Files\CodeBlocks\OgreSDK\ogreaddons\ogreode\Core\src\OgreOdeDebugContact.cpp: In member function `void OgreOde::DebugContactText::_setupGeometry()':
E:\Program Files\CodeBlocks\OgreSDK\ogreaddons\ogreode\Core\src\OgreOdeDebugContact.cpp:328: warning: converting to `unsigned int' from `double'
"C:\Program Files\CMake 2.8\bin\cmake.exe" -E cmake_progress_report "E:\Program Files\CodeBlocks\OgreSDK\ogreaddons\ogreode\CMakeFiles" 8
[ 27%] 
Building CXX object Core/CMakeFiles/OgreOde_Core.dir/src/OgreOdeDebugObject.cpp.obj
cd E:\PROGRA~1\CODEBL~1\OgreSDK\OGREAD~1\ogreode\Core && C:\MinGW\bin\g++.exe   -DOgreOde_Core_EXPORTS -DOGREODE_EXPORTS -DdSINGLE -O3 -DNDEBUG -IE:\PROGRA~1\CODEBL~1\OgreSDK\OGREAD~1\ogreode\ode\include -I"E:\Program Files\CodeBlocks\OgreSDK\Samples\Common\include" -IE:\PROGRA~1\CODEBL~1\OgreSDK -IE:\PROGRA~1\CODEBL~1\OgreSDK\include -IE:\PROGRA~1\CODEBL~1\OgreSDK\OGREAD~1\ogreode\Core\include   -o CMakeFiles\OgreOde_Core.dir\src\OgreOdeDebugObject.cpp.obj -c "E:\Program Files\CodeBlocks\OgreSDK\ogreaddons\ogreode\Core\src\OgreOdeDebugObject.cpp"
In file included from E:/PROGRA~1/CODEBL~1/OgreSDK/include/OgreTimer.h:37,
                 from E:/PROGRA~1/CODEBL~1/OgreSDK/include/OgreRenderTarget.h:37,
                 from E:/PROGRA~1/CODEBL~1/OgreSDK/include/OgreRenderSystem.h:42,
                 from E:/PROGRA~1/CODEBL~1/OgreSDK/include/Ogre.h:88,
                 from E:/PROGRA~1/CODEBL~1/OgreSDK/OGREAD~1/ogreode/Core/include/OgreOdePreReqs.h:4,
                 from E:/PROGRA~1/CODEBL~1/OgreSDK/OGREAD~1/ogreode/Core/include/OgreOdeDebugObject.h:4,
                 from E:\Program Files\CodeBlocks\OgreSDK\ogreaddons\ogreode\Core\src\OgreOdeDebugObject.cpp:4:
E:/PROGRA~1/CODEBL~1/OgreSDK/include/WIN32/OgreTimerImp.h:33:1: warning: "NOMINMAX" redefined
In file included from C:/MinGW/bin/../lib/gcc/mingw32/3.4.2/../../../../include/c++/3.4.2/mingw32/bits/c++config.h:35,
                 from C:/MinGW/bin/../lib/gcc/mingw32/3.4.2/../../../../include/c++/3.4.2/string:45,
                 from E:/PROGRA~1/CODEBL~1/OgreSDK/include/OgrePrerequisites.h:32,
                 from E:/PROGRA~1/CODEBL~1/OgreSDK/include/Ogre.h:32,
                 from E:/PROGRA~1/CODEBL~1/OgreSDK/OGREAD~1/ogreode/Core/include/OgreOdePreReqs.h:4,
                 from E:/PROGRA~1/CODEBL~1/OgreSDK/OGREAD~1/ogreode/Core/include/OgreOdeDebugObject.h:4,
                 from E:\Program Files\CodeBlocks\OgreSDK\ogreaddons\ogreode\Core\src\OgreOdeDebugObject.cpp:4:
C:/MinGW/bin/../lib/gcc/mingw32/3.4.2/../../../../include/c++/3.4.2/mingw32/bits/os_defines.h:46:1: warning: this is the location of the previous definition
"C:\Program Files\CMake 2.8\bin\cmake.exe" -E cmake_progress_report "E:\Program Files\CodeBlocks\OgreSDK\ogreaddons\ogreode\CMakeFiles" 9
[ 31%] 
Building CXX object Core/CMakeFiles/OgreOde_Core.dir/src/OgreOdeEigenSolver.cpp.obj
cd E:\PROGRA~1\CODEBL~1\OgreSDK\OGREAD~1\ogreode\Core && C:\MinGW\bin\g++.exe   -DOgreOde_Core_EXPORTS -DOGREODE_EXPORTS -DdSINGLE -O3 -DNDEBUG -IE:\PROGRA~1\CODEBL~1\OgreSDK\OGREAD~1\ogreode\ode\include -I"E:\Program Files\CodeBlocks\OgreSDK\Samples\Common\include" -IE:\PROGRA~1\CODEBL~1\OgreSDK -IE:\PROGRA~1\CODEBL~1\OgreSDK\include -IE:\PROGRA~1\CODEBL~1\OgreSDK\OGREAD~1\ogreode\Core\include   -o CMakeFiles\OgreOde_Core.dir\src\OgreOdeEigenSolver.cpp.obj -c "E:\Program Files\CodeBlocks\OgreSDK\ogreaddons\ogreode\Core\src\OgreOdeEigenSolver.cpp"
In file included from E:/PROGRA~1/CODEBL~1/OgreSDK/include/OgreTimer.h:37,
"C:\Program Files\CMake 2.8\bin\cmake.exe" -E cmake_progress_report "E:\Program Files\CodeBlocks\OgreSDK\ogreaddons\ogreode\CMakeFiles" 10
                 from E:/PROGRA~1/CODEBL~1/OgreSDK/include/OgreRenderTarget.h:37,
                 from E:/PROGRA~1/CODEBL~1/OgreSDK/include/OgreRenderSystem.h:42,
                 from E:/PROGRA~1/CODEBL~1/OgreSDK/include/Ogre.h:88,
                 from E:/PROGRA~1/CODEBL~1/OgreSDK/OGREAD~1/ogreode/Core/include/OgreOdePreReqs.h:4,
                 from E:/PROGRA~1/CODEBL~1/OgreSDK/OGREAD~1/ogreode/Core/include/OgreOdeEigenSolver.h:4,
                 from E:\Program Files\CodeBlocks\OgreSDK\ogreaddons\ogreode\Core\src\OgreOdeEigenSolver.cpp:4:
E:/PROGRA~1/CODEBL~1/OgreSDK/include/WIN32/OgreTimerImp.h:33:1: warning: "NOMINMAX" redefined
In file included from C:/MinGW/bin/../lib/gcc/mingw32/3.4.2/../../../../include/c++/3.4.2/mingw32/bits/c++config.h:35,
                 from C:/MinGW/bin/../lib/gcc/mingw32/3.4.2/../../../../include/c++/3.4.2/string:45,
                 from E:/PROGRA~1/CODEBL~1/OgreSDK/include/OgrePrerequisites.h:32,
                 from E:/PROGRA~1/CODEBL~1/OgreSDK/include/Ogre.h:32,
                 from E:/PROGRA~1/CODEBL~1/OgreSDK/OGREAD~1/ogreode/Core/include/OgreOdePreReqs.h:4,
                 from E:/PROGRA~1/CODEBL~1/OgreSDK/OGREAD~1/ogreode/Core/include/OgreOdeEigenSolver.h:4,
                 from E:\Program Files\CodeBlocks\OgreSDK\ogreaddons\ogreode\Core\src\OgreOdeEigenSolver.cpp:4:
C:/MinGW/bin/../lib/gcc/mingw32/3.4.2/../../../../include/c++/3.4.2/mingw32/bits/os_defines.h:46:1: warning: this is the location of the previous definition
[ 34%] 
Building CXX object Core/CMakeFiles/OgreOde_Core.dir/src/OgreOdeEntityInformer.cpp.obj
cd E:\PROGRA~1\CODEBL~1\OgreSDK\OGREAD~1\ogreode\Core && C:\MinGW\bin\g++.exe   -DOgreOde_Core_EXPORTS -DOGREODE_EXPORTS -DdSINGLE -O3 -DNDEBUG -IE:\PROGRA~1\CODEBL~1\OgreSDK\OGREAD~1\ogreode\ode\include -I"E:\Program Files\CodeBlocks\OgreSDK\Samples\Common\include" -IE:\PROGRA~1\CODEBL~1\OgreSDK -IE:\PROGRA~1\CODEBL~1\OgreSDK\include -IE:\PROGRA~1\CODEBL~1\OgreSDK\OGREAD~1\ogreode\Core\include   -o CMakeFiles\OgreOde_Core.dir\src\OgreOdeEntityInformer.cpp.obj -c "E:\Program Files\CodeBlocks\OgreSDK\ogreaddons\ogreode\Core\src\OgreOdeEntityInformer.cpp"
In file included from E:/PROGRA~1/CODEBL~1/OgreSDK/include/OgreTimer.h:37,
"C:\Program Files\CMake 2.8\bin\cmake.exe" -E cmake_progress_report "E:\Program Files\CodeBlocks\OgreSDK\ogreaddons\ogreode\CMakeFiles" 11
                 from E:/PROGRA~1/CODEBL~1/OgreSDK/include/OgreRenderTarget.h:37,
                 from E:/PROGRA~1/CODEBL~1/OgreSDK/include/OgreRenderSystem.h:42,
                 from E:/PROGRA~1/CODEBL~1/OgreSDK/include/Ogre.h:88,
                 from E:/PROGRA~1/CODEBL~1/OgreSDK/OGREAD~1/ogreode/Core/include/OgreOdePreReqs.h:4,
                 from E:/PROGRA~1/CODEBL~1/OgreSDK/OGREAD~1/ogreode/Core/include/OgreOdeEntityInformer.h:4,
                 from E:\Program Files\CodeBlocks\OgreSDK\ogreaddons\ogreode\Core\src\OgreOdeEntityInformer.cpp:3:
E:/PROGRA~1/CODEBL~1/OgreSDK/include/WIN32/OgreTimerImp.h:33:1: warning: "NOMINMAX" redefined
In file included from C:/MinGW/bin/../lib/gcc/mingw32/3.4.2/../../../../include/c++/3.4.2/mingw32/bits/c++config.h:35,
                 from C:/MinGW/bin/../lib/gcc/mingw32/3.4.2/../../../../include/c++/3.4.2/string:45,
                 from E:/PROGRA~1/CODEBL~1/OgreSDK/include/OgrePrerequisites.h:32,
                 from E:/PROGRA~1/CODEBL~1/OgreSDK/include/Ogre.h:32,
                 from E:/PROGRA~1/CODEBL~1/OgreSDK/OGREAD~1/ogreode/Core/include/OgreOdePreReqs.h:4,
                 from E:/PROGRA~1/CODEBL~1/OgreSDK/OGREAD~1/ogreode/Core/include/OgreOdeEntityInformer.h:4,
                 from E:\Program Files\CodeBlocks\OgreSDK\ogreaddons\ogreode\Core\src\OgreOdeEntityInformer.cpp:3:
C:/MinGW/bin/../lib/gcc/mingw32/3.4.2/../../../../include/c++/3.4.2/mingw32/bits/os_defines.h:46:1: warning: this is the location of the previous definition
[ 37%] Building CXX object Core/CMakeFiles/OgreOde_Core.dir/src/OgreOdeGeometry.cpp.obj
cd E:\PROGRA~1\CODEBL~1\OgreSDK\OGREAD~1\ogreode\Core && C:\MinGW\bin\g++.exe   -DOgreOde_Core_EXPORTS -DOGREODE_EXPORTS -DdSINGLE -O3 -DNDEBUG -IE:\PROGRA~1\CODEBL~1\OgreSDK\OGREAD~1\ogreode\ode\include -I"E:\Program Files\CodeBlocks\OgreSDK\Samples\Common\include" -IE:\PROGRA~1\CODEBL~1\OgreSDK -IE:\PROGRA~1\CODEBL~1\OgreSDK\include -IE:\PROGRA~1\CODEBL~1\OgreSDK\OGREAD~1\ogreode\Core\include   -o CMakeFiles\OgreOde_Core.dir\src\OgreOdeGeometry.cpp.obj -c "E:\Program Files\CodeBlocks\OgreSDK\ogreaddons\ogreode\Core\src\OgreOdeGeometry.cpp"
In file included from E:/PROGRA~1/CODEBL~1/OgreSDK/include/OgreTimer.h:37,
                 from E:/PROGRA~1/CODEBL~1/OgreSDK/include/OgreRenderTarget.h:37,
                 from E:/PROGRA~1/CODEBL~1/OgreSDK/include/OgreRenderSystem.h:42,
                 from E:/PROGRA~1/CODEBL~1/OgreSDK/include/Ogre.h:88,
                 from E:/PROGRA~1/CODEBL~1/OgreSDK/OGREAD~1/ogreode/Core/include/OgreOdePreReqs.h:4,
                 from E:/PROGRA~1/CODEBL~1/OgreSDK/OGREAD~1/ogreode/Core/include/OgreOdeGeometry.h:4,
                 from E:\Program Files\CodeBlocks\OgreSDK\ogreaddons\ogreode\Core\src\OgreOdeGeometry.cpp:4:
E:/PROGRA~1/CODEBL~1/OgreSDK/include/WIN32/OgreTimerImp.h:33:1: warning: "NOMINMAX" redefined
In file included from C:/MinGW/bin/../lib/gcc/mingw32/3.4.2/../../../../include/c++/3.4.2/mingw32/bits/c++config.h:35,
                 from C:/MinGW/bin/../lib/gcc/mingw32/3.4.2/../../../../include/c++/3.4.2/string:45,
                 from E:/PROGRA~1/CODEBL~1/OgreSDK/include/OgrePrerequisites.h:32,
                 from E:/PROGRA~1/CODEBL~1/OgreSDK/include/Ogre.h:32,
                 from E:/PROGRA~1/CODEBL~1/OgreSDK/OGREAD~1/ogreode/Core/include/OgreOdePreReqs.h:4,
                 from E:/PROGRA~1/CODEBL~1/OgreSDK/OGREAD~1/ogreode/Core/include/OgreOdeGeometry.h:4,
                 from E:\Program Files\CodeBlocks\OgreSDK\ogreaddons\ogreode\Core\src\OgreOdeGeometry.cpp:4:
C:/MinGW/bin/../lib/gcc/mingw32/3.4.2/../../../../include/c++/3.4.2/mingw32/bits/os_defines.h:46:1: warning: this is the location of the previous definition
In file included from E:\Program Files\CodeBlocks\OgreSDK\ogreaddons\ogreode\Core\src\OgreOdeGeometry.cpp:10:
E:/PROGRA~1/CODEBL~1/OgreSDK/OGREAD~1/ogreode/Core/include/OgreOdeDebugContact.h:154:7: warning: no newline at end of file
"C:\Program Files\CMake 2.8\bin\cmake.exe" -E cmake_progress_report "E:\Program Files\CodeBlocks\OgreSDK\ogreaddons\ogreode\CMakeFiles" 12
[ 41%] Building CXX object Core/CMakeFiles/OgreOde_Core.dir/src/OgreOdeJoint.cpp.obj
cd E:\PROGRA~1\CODEBL~1\OgreSDK\OGREAD~1\ogreode\Core && C:\MinGW\bin\g++.exe   -DOgreOde_Core_EXPORTS -DOGREODE_EXPORTS -DdSINGLE -O3 -DNDEBUG -IE:\PROGRA~1\CODEBL~1\OgreSDK\OGREAD~1\ogreode\ode\include -I"E:\Program Files\CodeBlocks\OgreSDK\Samples\Common\include" -IE:\PROGRA~1\CODEBL~1\OgreSDK -IE:\PROGRA~1\CODEBL~1\OgreSDK\include -IE:\PROGRA~1\CODEBL~1\OgreSDK\OGREAD~1\ogreode\Core\include   -o CMakeFiles\OgreOde_Core.dir\src\OgreOdeJoint.cpp.obj -c "E:\Program Files\CodeBlocks\OgreSDK\ogreaddons\ogreode\Core\src\OgreOdeJoint.cpp"
In file included from E:/PROGRA~1/CODEBL~1/OgreSDK/include/OgreTimer.h:37,
                 from E:/PROGRA~1/CODEBL~1/OgreSDK/include/OgreRenderTarget.h:37,
                 from E:/PROGRA~1/CODEBL~1/OgreSDK/include/OgreRenderSystem.h:42,
                 from E:/PROGRA~1/CODEBL~1/OgreSDK/include/Ogre.h:88,
                 from E:/PROGRA~1/CODEBL~1/OgreSDK/OGREAD~1/ogreode/Core/include/OgreOdePreReqs.h:4,
                 from E:/PROGRA~1/CODEBL~1/OgreSDK/OGREAD~1/ogreode/Core/include/OgreOdeGeometry.h:4,
                 from E:\Program Files\CodeBlocks\OgreSDK\ogreaddons\ogreode\Core\src\OgreOdeJoint.cpp:4:
E:/PROGRA~1/CODEBL~1/OgreSDK/include/WIN32/OgreTimerImp.h:33:1: warning: "NOMINMAX" redefined
In file included from C:/MinGW/bin/../lib/gcc/mingw32/3.4.2/../../../../include/c++/3.4.2/mingw32/bits/c++config.h:35,
                 from C:/MinGW/bin/../lib/gcc/mingw32/3.4.2/../../../../include/c++/3.4.2/string:45,
                 from E:/PROGRA~1/CODEBL~1/OgreSDK/include/OgrePrerequisites.h:32,
                 from E:/PROGRA~1/CODEBL~1/OgreSDK/include/Ogre.h:32,
                 from E:/PROGRA~1/CODEBL~1/OgreSDK/OGREAD~1/ogreode/Core/include/OgreOdePreReqs.h:4,
                 from E:/PROGRA~1/CODEBL~1/OgreSDK/OGREAD~1/ogreode/Core/include/OgreOdeGeometry.h:4,
                 from E:\Program Files\CodeBlocks\OgreSDK\ogreaddons\ogreode\Core\src\OgreOdeJoint.cpp:4:
C:/MinGW/bin/../lib/gcc/mingw32/3.4.2/../../../../include/c++/3.4.2/mingw32/bits/os_defines.h:46:1: warning: this is the location of the previous definition
E:\Program Files\CodeBlocks\OgreSDK\ogreaddons\ogreode\Core\src\OgreOdeJoint.cpp: In member function `virtual void OgreOde::PistonJoint::setAxisDelta(const Ogre::Vector3&, const Ogre::Vector3&)':
E:\Program Files\CodeBlocks\OgreSDK\ogreaddons\ogreode\Core\src\OgreOdeJoint.cpp:863: warning: `dJointSetPistonAxisDelta' is deprecated (declared at E:/PROGRA~1/CODEBL~1/OgreSDK/OGREAD~1/ogreode/ode/include/ode/objects.h:2057)
E:\Program Files\CodeBlocks\OgreSDK\ogreaddons\ogreode\Core\src\OgreOdeJoint.cpp:864: warning: `dJointSetPistonAxisDelta' is deprecated (declared at E:/PROGRA~1/CODEBL~1/OgreSDK/OGREAD~1/ogreode/ode/include/ode/objects.h:2057)
"C:\Program Files\CMake 2.8\bin\cmake.exe" -E cmake_progress_report "E:\Program Files\CodeBlocks\OgreSDK\ogreaddons\ogreode\CMakeFiles" 13
[ 44%] Building CXX object Core/CMakeFiles/OgreOde_Core.dir/src/OgreOdeMaintainedList.cpp.obj
cd E:\PROGRA~1\CODEBL~1\OgreSDK\OGREAD~1\ogreode\Core && C:\MinGW\bin\g++.exe   -DOgreOde_Core_EXPORTS -DOGREODE_EXPORTS -DdSINGLE -O3 -DNDEBUG -IE:\PROGRA~1\CODEBL~1\OgreSDK\OGREAD~1\ogreode\ode\include -I"E:\Program Files\CodeBlocks\OgreSDK\Samples\Common\include" -IE:\PROGRA~1\CODEBL~1\OgreSDK -IE:\PROGRA~1\CODEBL~1\OgreSDK\include -IE:\PROGRA~1\CODEBL~1\OgreSDK\OGREAD~1\ogreode\Core\include   -o CMakeFiles\OgreOde_Core.dir\src\OgreOdeMaintainedList.cpp.obj -c "E:\Program Files\CodeBlocks\OgreSDK\ogreaddons\ogreode\Core\src\OgreOdeMaintainedList.cpp"
In file included from E:/PROGRA~1/CODEBL~1/OgreSDK/include/OgreTimer.h:37,
                 from E:/PROGRA~1/CODEBL~1/OgreSDK/include/OgreRenderTarget.h:37,
                 from E:/PROGRA~1/CODEBL~1/OgreSDK/include/OgreRenderSystem.h:42,
                 from E:/PROGRA~1/CODEBL~1/OgreSDK/include/Ogre.h:88,
                 from E:/PROGRA~1/CODEBL~1/OgreSDK/OGREAD~1/ogreode/Core/include/OgreOdePreReqs.h:4,
                 from E:/PROGRA~1/CODEBL~1/OgreSDK/OGREAD~1/ogreode/Core/include/OgreOdeMaintainedList.h:9,
                 from E:\Program Files\CodeBlocks\OgreSDK\ogreaddons\ogreode\Core\src\OgreOdeMaintainedList.cpp:1:
E:/PROGRA~1/CODEBL~1/OgreSDK/include/WIN32/OgreTimerImp.h:33:1: warning: "NOMINMAX" redefined
In file included from C:/MinGW/bin/../lib/gcc/mingw32/3.4.2/../../../../include/c++/3.4.2/mingw32/bits/c++config.h:35,
                 from C:/MinGW/bin/../lib/gcc/mingw32/3.4.2/../../../../include/c++/3.4.2/string:45,
                 from E:/PROGRA~1/CODEBL~1/OgreSDK/include/OgrePrerequisites.h:32,
                 from E:/PROGRA~1/CODEBL~1/OgreSDK/include/Ogre.h:32,
                 from E:/PROGRA~1/CODEBL~1/OgreSDK/OGREAD~1/ogreode/Core/include/OgreOdePreReqs.h:4,
                 from E:/PROGRA~1/CODEBL~1/OgreSDK/OGREAD~1/ogreode/Core/include/OgreOdeMaintainedList.h:9,
                 from E:\Program Files\CodeBlocks\OgreSDK\ogreaddons\ogreode\Core\src\OgreOdeMaintainedList.cpp:1:
C:/MinGW/bin/../lib/gcc/mingw32/3.4.2/../../../../include/c++/3.4.2/mingw32/bits/os_defines.h:46:1: warning: this is the location of the previous definition
"C:\Program Files\CMake 2.8\bin\cmake.exe" -E cmake_progress_report "E:\Program Files\CodeBlocks\OgreSDK\ogreaddons\ogreode\CMakeFiles" 14
[ 48%] Building CXX object Core/CMakeFiles/OgreOde_Core.dir/src/OgreOdeMass.cpp.obj
cd E:\PROGRA~1\CODEBL~1\OgreSDK\OGREAD~1\ogreode\Core && C:\MinGW\bin\g++.exe   -DOgreOde_Core_EXPORTS -DOGREODE_EXPORTS -DdSINGLE -O3 -DNDEBUG -IE:\PROGRA~1\CODEBL~1\OgreSDK\OGREAD~1\ogreode\ode\include -I"E:\Program Files\CodeBlocks\OgreSDK\Samples\Common\include" -IE:\PROGRA~1\CODEBL~1\OgreSDK -IE:\PROGRA~1\CODEBL~1\OgreSDK\include -IE:\PROGRA~1\CODEBL~1\OgreSDK\OGREAD~1\ogreode\Core\include   -o CMakeFiles\OgreOde_Core.dir\src\OgreOdeMass.cpp.obj -c "E:\Program Files\CodeBlocks\OgreSDK\ogreaddons\ogreode\Core\src\OgreOdeMass.cpp"
In file included from E:/PROGRA~1/CODEBL~1/OgreSDK/include/OgreTimer.h:37,
                 from E:/PROGRA~1/CODEBL~1/OgreSDK/include/OgreRenderTarget.h:37,
                 from E:/PROGRA~1/CODEBL~1/OgreSDK/include/OgreRenderSystem.h:42,
                 from E:/PROGRA~1/CODEBL~1/OgreSDK/include/Ogre.h:88,
                 from E:/PROGRA~1/CODEBL~1/OgreSDK/OGREAD~1/ogreode/Core/include/OgreOdePreReqs.h:4,
                 from E:\Program Files\CodeBlocks\OgreSDK\ogreaddons\ogreode\Core\src\OgreOdeMass.cpp:4:
E:/PROGRA~1/CODEBL~1/OgreSDK/include/WIN32/OgreTimerImp.h:33:1: warning: "NOMINMAX" redefined
In file included from C:/MinGW/bin/../lib/gcc/mingw32/3.4.2/../../../../include/c++/3.4.2/mingw32/bits/c++config.h:35,
                 from C:/MinGW/bin/../lib/gcc/mingw32/3.4.2/../../../../include/c++/3.4.2/string:45,
                 from E:/PROGRA~1/CODEBL~1/OgreSDK/include/OgrePrerequisites.h:32,
                 from E:/PROGRA~1/CODEBL~1/OgreSDK/include/Ogre.h:32,
                 from E:/PROGRA~1/CODEBL~1/OgreSDK/OGREAD~1/ogreode/Core/include/OgreOdePreReqs.h:4,
                 from E:\Program Files\CodeBlocks\OgreSDK\ogreaddons\ogreode\Core\src\OgreOdeMass.cpp:4:
C:/MinGW/bin/../lib/gcc/mingw32/3.4.2/../../../../include/c++/3.4.2/mingw32/bits/os_defines.h:46:1: warning: this is the location of the previous definition
E:\Program Files\CodeBlocks\OgreSDK\ogreaddons\ogreode\Core\src\OgreOdeMass.cpp: In constructor `OgreOde::CapsuleMass::CapsuleMass(Ogre::Real, Ogre::Real, const Ogre::Vector3&, Ogre::Real)':
E:\Program Files\CodeBlocks\OgreSDK\ogreaddons\ogreode\Core\src\OgreOdeMass.cpp:124: warning: `dMassSetCappedCylinderTotal' is deprecated (declared at E:/PROGRA~1/CODEBL~1/OgreSDK/OGREAD~1/ogreode/ode/include/ode/mass.h:85)
E:\Program Files\CodeBlocks\OgreSDK\ogreaddons\ogreode\Core\src\OgreOdeMass.cpp:124: warning: `dMassSetCappedCylinderTotal' is deprecated (declared at E:/PROGRA~1/CODEBL~1/OgreSDK/OGREAD~1/ogreode/ode/include/ode/mass.h:85)
E:\Program Files\CodeBlocks\OgreSDK\ogreaddons\ogreode\Core\src\OgreOdeMass.cpp: In member function `void OgreOde::CapsuleMass::setDensity(Ogre::Real, Ogre::Real, const Ogre::Vector3&, Ogre::Real)':
E:\Program Files\CodeBlocks\OgreSDK\ogreaddons\ogreode\Core\src\OgreOdeMass.cpp:135: warning: `dMassSetCappedCylinder' is deprecated (declared at E:/PROGRA~1/CODEBL~1/OgreSDK/OGREAD~1/ogreode/ode/include/ode/mass.h:84)
E:\Program Files\CodeBlocks\OgreSDK\ogreaddons\ogreode\Core\src\OgreOdeMass.cpp:135: warning: `dMassSetCappedCylinder' is deprecated (declared at E:/PROGRA~1/CODEBL~1/OgreSDK/OGREAD~1/ogreode/ode/include/ode/mass.h:84)
"C:\Program Files\CMake 2.8\bin\cmake.exe" -E cmake_progress_report "E:\Program Files\CodeBlocks\OgreSDK\ogreaddons\ogreode\CMakeFiles" 15
[ 51%] 
Building CXX object Core/CMakeFiles/OgreOde_Core.dir/src/OgreOdePrecompiledHeaders.cpp.obj
cd E:\PROGRA~1\CODEBL~1\OgreSDK\OGREAD~1\ogreode\Core && C:\MinGW\bin\g++.exe   -DOgreOde_Core_EXPORTS -DOGREODE_EXPORTS -DdSINGLE -O3 -DNDEBUG -IE:\PROGRA~1\CODEBL~1\OgreSDK\OGREAD~1\ogreode\ode\include -I"E:\Program Files\CodeBlocks\OgreSDK\Samples\Common\include" -IE:\PROGRA~1\CODEBL~1\OgreSDK -IE:\PROGRA~1\CODEBL~1\OgreSDK\include -IE:\PROGRA~1\CODEBL~1\OgreSDK\OGREAD~1\ogreode\Core\include   -o CMakeFiles\OgreOde_Core.dir\src\OgreOdePrecompiledHeaders.cpp.obj -c "E:\Program Files\CodeBlocks\OgreSDK\ogreaddons\ogreode\Core\src\OgreOdePrecompiledHeaders.cpp"
In file included from E:\Program Files\CodeBlocks\OgreSDK\ogreaddons\ogreode\Core\src\OgreOdePrecompiledHeaders.cpp:1:
E:/PROGRA~1/CODEBL~1/OgreSDK/OGREAD~1/ogreode/Core/include/OgreOdePrecompiledHeaders.h:29:39: warning: no newline at end of file
"C:\Program Files\CMake 2.8\bin\cmake.exe" -E cmake_progress_report "E:\Program Files\CodeBlocks\OgreSDK\ogreaddons\ogreode\CMakeFiles" 16
[ 55%] 
Building CXX object Core/CMakeFiles/OgreOde_Core.dir/src/OgreOdeSpace.cpp.obj
cd E:\PROGRA~1\CODEBL~1\OgreSDK\OGREAD~1\ogreode\Core && C:\MinGW\bin\g++.exe   -DOgreOde_Core_EXPORTS -DOGREODE_EXPORTS -DdSINGLE -O3 -DNDEBUG -IE:\PROGRA~1\CODEBL~1\OgreSDK\OGREAD~1\ogreode\ode\include -I"E:\Program Files\CodeBlocks\OgreSDK\Samples\Common\include" -IE:\PROGRA~1\CODEBL~1\OgreSDK -IE:\PROGRA~1\CODEBL~1\OgreSDK\include -IE:\PROGRA~1\CODEBL~1\OgreSDK\OGREAD~1\ogreode\Core\include   -o CMakeFiles\OgreOde_Core.dir\src\OgreOdeSpace.cpp.obj -c "E:\Program Files\CodeBlocks\OgreSDK\ogreaddons\ogreode\Core\src\OgreOdeSpace.cpp"
In file included from E:/PROGRA~1/CODEBL~1/OgreSDK/include/OgreTimer.h:37,
"C:\Program Files\CMake 2.8\bin\cmake.exe" -E cmake_progress_report "E:\Program Files\CodeBlocks\OgreSDK\ogreaddons\ogreode\CMakeFiles" 17
                 from E:/PROGRA~1/CODEBL~1/OgreSDK/include/OgreRenderTarget.h:37,
                 from E:/PROGRA~1/CODEBL~1/OgreSDK/include/OgreRenderSystem.h:42,
                 from E:/PROGRA~1/CODEBL~1/OgreSDK/include/Ogre.h:88,
                 from E:/PROGRA~1/CODEBL~1/OgreSDK/OGREAD~1/ogreode/Core/include/OgreOdePreReqs.h:4,
                 from E:/PROGRA~1/CODEBL~1/OgreSDK/OGREAD~1/ogreode/Core/include/OgreOdeBody.h:4,
                 from E:\Program Files\CodeBlocks\OgreSDK\ogreaddons\ogreode\Core\src\OgreOdeSpace.cpp:4:
E:/PROGRA~1/CODEBL~1/OgreSDK/include/WIN32/OgreTimerImp.h:33:1: warning: "NOMINMAX" redefined
In file included from C:/MinGW/bin/../lib/gcc/mingw32/3.4.2/../../../../include/c++/3.4.2/mingw32/bits/c++config.h:35,
                 from C:/MinGW/bin/../lib/gcc/mingw32/3.4.2/../../../../include/c++/3.4.2/string:45,
                 from E:/PROGRA~1/CODEBL~1/OgreSDK/include/OgrePrerequisites.h:32,
                 from E:/PROGRA~1/CODEBL~1/OgreSDK/include/Ogre.h:32,
                 from E:/PROGRA~1/CODEBL~1/OgreSDK/OGREAD~1/ogreode/Core/include/OgreOdePreReqs.h:4,
                 from E:/PROGRA~1/CODEBL~1/OgreSDK/OGREAD~1/ogreode/Core/include/OgreOdeBody.h:4,
                 from E:\Program Files\CodeBlocks\OgreSDK\ogreaddons\ogreode\Core\src\OgreOdeSpace.cpp:4:
C:/MinGW/bin/../lib/gcc/mingw32/3.4.2/../../../../include/c++/3.4.2/mingw32/bits/os_defines.h:46:1: warning: this is the location of the previous definition
[ 58%] Building CXX object Core/CMakeFiles/OgreOde_Core.dir/src/OgreOdeStepper.cpp.obj
cd E:\PROGRA~1\CODEBL~1\OgreSDK\OGREAD~1\ogreode\Core && C:\MinGW\bin\g++.exe   -DOgreOde_Core_EXPORTS -DOGREODE_EXPORTS -DdSINGLE -O3 -DNDEBUG -IE:\PROGRA~1\CODEBL~1\OgreSDK\OGREAD~1\ogreode\ode\include -I"E:\Program Files\CodeBlocks\OgreSDK\Samples\Common\include" -IE:\PROGRA~1\CODEBL~1\OgreSDK -IE:\PROGRA~1\CODEBL~1\OgreSDK\include -IE:\PROGRA~1\CODEBL~1\OgreSDK\OGREAD~1\ogreode\Core\include   -o CMakeFiles\OgreOde_Core.dir\src\OgreOdeStepper.cpp.obj -c "E:\Program Files\CodeBlocks\OgreSDK\ogreaddons\ogreode\Core\src\OgreOdeStepper.cpp"
In file included from E:/PROGRA~1/CODEBL~1/OgreSDK/include/OgreTimer.h:37,
                 from E:/PROGRA~1/CODEBL~1/OgreSDK/include/OgreRenderTarget.h:37,
                 from E:/PROGRA~1/CODEBL~1/OgreSDK/include/OgreRenderSystem.h:42,
                 from E:/PROGRA~1/CODEBL~1/OgreSDK/include/Ogre.h:88,
                 from E:/PROGRA~1/CODEBL~1/OgreSDK/OGREAD~1/ogreode/Core/include/OgreOdePreReqs.h:4,
                 from E:/PROGRA~1/CODEBL~1/OgreSDK/OGREAD~1/ogreode/Core/include/OgreOdeGeometry.h:4,
                 from E:\Program Files\CodeBlocks\OgreSDK\ogreaddons\ogreode\Core\src\OgreOdeStepper.cpp:4:
E:/PROGRA~1/CODEBL~1/OgreSDK/include/WIN32/OgreTimerImp.h:33:1: warning: "NOMINMAX" redefined
In file included from C:/MinGW/bin/../lib/gcc/mingw32/3.4.2/../../../../include/c++/3.4.2/mingw32/bits/c++config.h:35,
                 from C:/MinGW/bin/../lib/gcc/mingw32/3.4.2/../../../../include/c++/3.4.2/string:45,
                 from E:/PROGRA~1/CODEBL~1/OgreSDK/include/OgrePrerequisites.h:32,
                 from E:/PROGRA~1/CODEBL~1/OgreSDK/include/Ogre.h:32,
                 from E:/PROGRA~1/CODEBL~1/OgreSDK/OGREAD~1/ogreode/Core/include/OgreOdePreReqs.h:4,
                 from E:/PROGRA~1/CODEBL~1/OgreSDK/OGREAD~1/ogreode/Core/include/OgreOdeGeometry.h:4,
                 from E:\Program Files\CodeBlocks\OgreSDK\ogreaddons\ogreode\Core\src\OgreOdeStepper.cpp:4:
C:/MinGW/bin/../lib/gcc/mingw32/3.4.2/../../../../include/c++/3.4.2/mingw32/bits/os_defines.h:46:1: warning: this is the location of the previous definition
E:\Program Files\CodeBlocks\OgreSDK\ogreaddons\ogreode\Core\src\OgreOdeStepper.cpp: In constructor `OgreOde::ForwardFixedInterpolatedStepHandler::ForwardFixedInterpolatedStepHandler(OgreOde::World*, OgreOde::StepHandler::StepModeType, Ogre::Real, Ogre::Real, Ogre::Real, Ogre::Real)':
E:\Program Files\CodeBlocks\OgreSDK\ogreaddons\ogreode\Core\src\OgreOdeStepper.cpp:280: warning: converting to `unsigned int' from `Ogre::Real'
"C:\Program Files\CMake 2.8\bin\cmake.exe" -E cmake_progress_report "E:\Program Files\CodeBlocks\OgreSDK\ogreaddons\ogreode\CMakeFiles" 18
[ 62%] 
Building CXX object Core/CMakeFiles/OgreOde_Core.dir/src/OgreOdeTriangleMeshData.cpp.obj
cd E:\PROGRA~1\CODEBL~1\OgreSDK\OGREAD~1\ogreode\Core && C:\MinGW\bin\g++.exe   -DOgreOde_Core_EXPORTS -DOGREODE_EXPORTS -DdSINGLE -O3 -DNDEBUG -IE:\PROGRA~1\CODEBL~1\OgreSDK\OGREAD~1\ogreode\ode\include -I"E:\Program Files\CodeBlocks\OgreSDK\Samples\Common\include" -IE:\PROGRA~1\CODEBL~1\OgreSDK -IE:\PROGRA~1\CODEBL~1\OgreSDK\include -IE:\PROGRA~1\CODEBL~1\OgreSDK\OGREAD~1\ogreode\Core\include   -o CMakeFiles\OgreOde_Core.dir\src\OgreOdeTriangleMeshData.cpp.obj -c "E:\Program Files\CodeBlocks\OgreSDK\ogreaddons\ogreode\Core\src\OgreOdeTriangleMeshData.cpp"
In file included from E:/PROGRA~1/CODEBL~1/OgreSDK/include/OgreTimer.h:37,
                 from E:/PROGRA~1/CODEBL~1/OgreSDK/include/OgreRenderTarget.h:37,
                 from E:/PROGRA~1/CODEBL~1/OgreSDK/include/OgreRenderSystem.h:42,
                 from E:/PROGRA~1/CODEBL~1/OgreSDK/include/Ogre.h:88,
                 from E:/PROGRA~1/CODEBL~1/OgreSDK/OGREAD~1/ogreode/Core/include/OgreOdePreReqs.h:4,
                 from E:/PROGRA~1/CODEBL~1/OgreSDK/OGREAD~1/ogreode/Core/include/OgreOdeGeometry.h:4,
                 from E:\Program Files\CodeBlocks\OgreSDK\ogreaddons\ogreode\Core\src\OgreOdeTriangleMeshData.cpp:4:
E:/PROGRA~1/CODEBL~1/OgreSDK/include/WIN32/OgreTimerImp.h:33:1: warning: "NOMINMAX" redefined
In file included from C:/MinGW/bin/../lib/gcc/mingw32/3.4.2/../../../../include/c++/3.4.2/mingw32/bits/c++config.h:35,
                 from C:/MinGW/bin/../lib/gcc/mingw32/3.4.2/../../../../include/c++/3.4.2/string:45,
                 from E:/PROGRA~1/CODEBL~1/OgreSDK/include/OgrePrerequisites.h:32,
                 from E:/PROGRA~1/CODEBL~1/OgreSDK/include/Ogre.h:32,
                 from E:/PROGRA~1/CODEBL~1/OgreSDK/OGREAD~1/ogreode/Core/include/OgreOdePreReqs.h:4,
                 from E:/PROGRA~1/CODEBL~1/OgreSDK/OGREAD~1/ogreode/Core/include/OgreOdeGeometry.h:4,
                 from E:\Program Files\CodeBlocks\OgreSDK\ogreaddons\ogreode\Core\src\OgreOdeTriangleMeshData.cpp:4:
C:/MinGW/bin/../lib/gcc/mingw32/3.4.2/../../../../include/c++/3.4.2/mingw32/bits/os_defines.h:46:1: warning: this is the location of the previous definition
In file included from E:\Program Files\CodeBlocks\OgreSDK\ogreaddons\ogreode\Core\src\OgreOdeTriangleMeshData.cpp:10:
E:/PROGRA~1/CODEBL~1/OgreSDK/OGREAD~1/ogreode/Core/include/OgreOdeDebugContact.h:154:7: warning: no newline at end of file
"C:\Program Files\CMake 2.8\bin\cmake.exe" -E cmake_progress_report "E:\Program Files\CodeBlocks\OgreSDK\ogreaddons\ogreode\CMakeFiles" 19
[ 65%] 
Building CXX object Core/CMakeFiles/OgreOde_Core.dir/src/OgreOdeTriangleMeshDataManager.cpp.obj
cd E:\PROGRA~1\CODEBL~1\OgreSDK\OGREAD~1\ogreode\Core && C:\MinGW\bin\g++.exe   -DOgreOde_Core_EXPORTS -DOGREODE_EXPORTS -DdSINGLE -O3 -DNDEBUG -IE:\PROGRA~1\CODEBL~1\OgreSDK\OGREAD~1\ogreode\ode\include -I"E:\Program Files\CodeBlocks\OgreSDK\Samples\Common\include" -IE:\PROGRA~1\CODEBL~1\OgreSDK -IE:\PROGRA~1\CODEBL~1\OgreSDK\include -IE:\PROGRA~1\CODEBL~1\OgreSDK\OGREAD~1\ogreode\Core\include   -o CMakeFiles\OgreOde_Core.dir\src\OgreOdeTriangleMeshDataManager.cpp.obj -c "E:\Program Files\CodeBlocks\OgreSDK\ogreaddons\ogreode\Core\src\OgreOdeTriangleMeshDataManager.cpp"
In file included from E:/PROGRA~1/CODEBL~1/OgreSDK/include/OgreTimer.h:37,
                 from E:/PROGRA~1/CODEBL~1/OgreSDK/include/OgreRenderTarget.h:37,
                 from E:/PROGRA~1/CODEBL~1/OgreSDK/include/OgreRenderSystem.h:42,
                 from E:/PROGRA~1/CODEBL~1/OgreSDK/include/Ogre.h:88,
                 from E:/PROGRA~1/CODEBL~1/OgreSDK/OGREAD~1/ogreode/Core/include/OgreOdeTriangleMeshDataManager.h:4,
                 from E:\Program Files\CodeBlocks\OgreSDK\ogreaddons\ogreode\Core\src\OgreOdeTriangleMeshDataManager.cpp:3:
E:/PROGRA~1/CODEBL~1/OgreSDK/include/WIN32/OgreTimerImp.h:33:1: warning: "NOMINMAX" redefined
In file included from C:/MinGW/bin/../lib/gcc/mingw32/3.4.2/../../../../include/c++/3.4.2/mingw32/bits/c++config.h:35,
                 from C:/MinGW/bin/../lib/gcc/mingw32/3.4.2/../../../../include/c++/3.4.2/string:45,
                 from E:/PROGRA~1/CODEBL~1/OgreSDK/include/OgrePrerequisites.h:32,
                 from E:/PROGRA~1/CODEBL~1/OgreSDK/include/Ogre.h:32,
                 from E:/PROGRA~1/CODEBL~1/OgreSDK/OGREAD~1/ogreode/Core/include/OgreOdeTriangleMeshDataManager.h:4,
                 from E:\Program Files\CodeBlocks\OgreSDK\ogreaddons\ogreode\Core\src\OgreOdeTriangleMeshDataManager.cpp:3:
C:/MinGW/bin/../lib/gcc/mingw32/3.4.2/../../../../include/c++/3.4.2/mingw32/bits/os_defines.h:46:1: warning: this is the location of the previous definition
"C:\Program Files\CMake 2.8\bin\cmake.exe" -E cmake_progress_report "E:\Program Files\CodeBlocks\OgreSDK\ogreaddons\ogreode\CMakeFiles" 20
[ 68%] 
Building CXX object Core/CMakeFiles/OgreOde_Core.dir/src/OgreOdeUtility.cpp.obj
cd E:\PROGRA~1\CODEBL~1\OgreSDK\OGREAD~1\ogreode\Core && C:\MinGW\bin\g++.exe   -DOgreOde_Core_EXPORTS -DOGREODE_EXPORTS -DdSINGLE -O3 -DNDEBUG -IE:\PROGRA~1\CODEBL~1\OgreSDK\OGREAD~1\ogreode\ode\include -I"E:\Program Files\CodeBlocks\OgreSDK\Samples\Common\include" -IE:\PROGRA~1\CODEBL~1\OgreSDK -IE:\PROGRA~1\CODEBL~1\OgreSDK\include -IE:\PROGRA~1\CODEBL~1\OgreSDK\OGREAD~1\ogreode\Core\include   -o CMakeFiles\OgreOde_Core.dir\src\OgreOdeUtility.cpp.obj -c "E:\Program Files\CodeBlocks\OgreSDK\ogreaddons\ogreode\Core\src\OgreOdeUtility.cpp"
In file included from E:/PROGRA~1/CODEBL~1/OgreSDK/include/OgreTimer.h:37,
                 from E:/PROGRA~1/CODEBL~1/OgreSDK/include/OgreRenderTarget.h:37,
                 from E:/PROGRA~1/CODEBL~1/OgreSDK/include/OgreRenderSystem.h:42,
                 from E:/PROGRA~1/CODEBL~1/OgreSDK/include/Ogre.h:88,
                 from E:/PROGRA~1/CODEBL~1/OgreSDK/OGREAD~1/ogreode/Core/include/OgreOdePreReqs.h:4,
                 from E:/PROGRA~1/CODEBL~1/OgreSDK/OGREAD~1/ogreode/Core/include/OgreOdeUtility.h:4,
                 from E:\Program Files\CodeBlocks\OgreSDK\ogreaddons\ogreode\Core\src\OgreOdeUtility.cpp:4:
E:/PROGRA~1/CODEBL~1/OgreSDK/include/WIN32/OgreTimerImp.h:33:1: warning: "NOMINMAX" redefined
In file included from C:/MinGW/bin/../lib/gcc/mingw32/3.4.2/../../../../include/c++/3.4.2/mingw32/bits/c++config.h:35,
                 from C:/MinGW/bin/../lib/gcc/mingw32/3.4.2/../../../../include/c++/3.4.2/string:45,
                 from E:/PROGRA~1/CODEBL~1/OgreSDK/include/OgrePrerequisites.h:32,
                 from E:/PROGRA~1/CODEBL~1/OgreSDK/include/Ogre.h:32,
                 from E:/PROGRA~1/CODEBL~1/OgreSDK/OGREAD~1/ogreode/Core/include/OgreOdePreReqs.h:4,
                 from E:/PROGRA~1/CODEBL~1/OgreSDK/OGREAD~1/ogreode/Core/include/OgreOdeUtility.h:4,
                 from E:\Program Files\CodeBlocks\OgreSDK\ogreaddons\ogreode\Core\src\OgreOdeUtility.cpp:4:
C:/MinGW/bin/../lib/gcc/mingw32/3.4.2/../../../../include/c++/3.4.2/mingw32/bits/os_defines.h:46:1: warning: this is the location of the previous definition
E:\Program Files\CodeBlocks\OgreSDK\ogreaddons\ogreode\Core\src\OgreOdeUtility.cpp:9: warning: division by zero in `1.0e+0f / 0.'
"C:\Program Files\CMake 2.8\bin\cmake.exe" -E cmake_progress_report "E:\Program Files\CodeBlocks\OgreSDK\ogreaddons\ogreode\CMakeFiles" 21
[ 72%] 
Building CXX object Core/CMakeFiles/OgreOde_Core.dir/src/OgreOdeWorld.cpp.obj
cd E:\PROGRA~1\CODEBL~1\OgreSDK\OGREAD~1\ogreode\Core && C:\MinGW\bin\g++.exe   -DOgreOde_Core_EXPORTS -DOGREODE_EXPORTS -DdSINGLE -O3 -DNDEBUG -IE:\PROGRA~1\CODEBL~1\OgreSDK\OGREAD~1\ogreode\ode\include -I"E:\Program Files\CodeBlocks\OgreSDK\Samples\Common\include" -IE:\PROGRA~1\CODEBL~1\OgreSDK -IE:\PROGRA~1\CODEBL~1\OgreSDK\include -IE:\PROGRA~1\CODEBL~1\OgreSDK\OGREAD~1\ogreode\Core\include   -o CMakeFiles\OgreOde_Core.dir\src\OgreOdeWorld.cpp.obj -c "E:\Program Files\CodeBlocks\OgreSDK\ogreaddons\ogreode\Core\src\OgreOdeWorld.cpp"
In file included from E:/PROGRA~1/CODEBL~1/OgreSDK/include/OgreTimer.h:37,
                 from E:/PROGRA~1/CODEBL~1/OgreSDK/include/OgreRenderTarget.h:37,
                 from E:/PROGRA~1/CODEBL~1/OgreSDK/include/OgreRenderSystem.h:42,
                 from E:/PROGRA~1/CODEBL~1/OgreSDK/include/Ogre.h:88,
                 from E:/PROGRA~1/CODEBL~1/OgreSDK/OGREAD~1/ogreode/Core/include/OgreOdePreReqs.h:4,
                 from E:/PROGRA~1/CODEBL~1/OgreSDK/OGREAD~1/ogreode/Core/include/OgreOdeWorld.h:4,
                 from E:\Program Files\CodeBlocks\OgreSDK\ogreaddons\ogreode\Core\src\OgreOdeWorld.cpp:4:
E:/PROGRA~1/CODEBL~1/OgreSDK/include/WIN32/OgreTimerImp.h:33:1: warning: "NOMINMAX" redefined
In file included from C:/MinGW/bin/../lib/gcc/mingw32/3.4.2/../../../../include/c++/3.4.2/mingw32/bits/c++config.h:35,
                 from C:/MinGW/bin/../lib/gcc/mingw32/3.4.2/../../../../include/c++/3.4.2/string:45,
                 from E:/PROGRA~1/CODEBL~1/OgreSDK/include/OgrePrerequisites.h:32,
                 from E:/PROGRA~1/CODEBL~1/OgreSDK/include/Ogre.h:32,
                 from E:/PROGRA~1/CODEBL~1/OgreSDK/OGREAD~1/ogreode/Core/include/OgreOdePreReqs.h:4,
                 from E:/PROGRA~1/CODEBL~1/OgreSDK/OGREAD~1/ogreode/Core/include/OgreOdeWorld.h:4,
                 from E:\Program Files\CodeBlocks\OgreSDK\ogreaddons\ogreode\Core\src\OgreOdeWorld.cpp:4:
C:/MinGW/bin/../lib/gcc/mingw32/3.4.2/../../../../include/c++/3.4.2/mingw32/bits/os_defines.h:46:1: warning: this is the location of the previous definition
E:\Program Files\CodeBlocks\OgreSDK\ogreaddons\ogreode\Core\src\OgreOdeWorld.cpp: In member function `size_t OgreOde::World::getAutoSleepAverageSamplesCount()':
E:\Program Files\CodeBlocks\OgreSDK\ogreaddons\ogreode\Core\src\OgreOdeWorld.cpp:158: warning: converting to `size_t' from `Ogre::Real'
Linking CXX shared library ..\bin\libOgreOde_Core.dll
cd E:\PROGRA~1\CODEBL~1\OgreSDK\OGREAD~1\ogreode\Core && "C:\Program Files\CMake 2.8\bin\cmake.exe" -E cmake_link_script CMakeFiles\OgreOde_Core.dir\link.txt --verbose=1
g++.exe: /SUBSYSTEM:WINDOWS: No such file or directory
C:\MinGW\bin\g++.exe   /SUBSYSTEM:WINDOWS -shared -o ..\bin\libOgreOde_Core.dll -Wl,--out-implib,..\lib\libOgreOde_Core.dll.a -Wl,--major-image-version,0,--minor-image-version,0 CMakeFiles\OgreOde_Core.dir\src\OgreOdeBody.cpp.obj CMakeFiles\OgreOde_Core.dir\src\OgreOdeCollision.cpp.obj CMakeFiles\OgreOde_Core.dir\src\OgreOdeDebugContact.cpp.obj CMakeFiles\OgreOde_Core.dir\src\OgreOdeDebugObject.cpp.obj CMakeFiles\OgreOde_Core.dir\src\OgreOdeEigenSolver.cpp.obj CMakeFiles\OgreOde_Core.dir\src\OgreOdeEntityInformer.cpp.obj CMakeFiles\OgreOde_Core.dir\src\OgreOdeGeometry.cpp.obj CMakeFiles\OgreOde_Core.dir\src\OgreOdeJoint.cpp.obj CMakeFiles\OgreOde_Core.dir\src\OgreOdeMaintainedList.cpp.obj CMakeFiles\OgreOde_Core.dir\src\OgreOdeMass.cpp.obj CMakeFiles\OgreOde_Core.dir\src\OgreOdePrecompiledHeaders.cpp.obj CMakeFiles\OgreOde_Core.dir\src\OgreOdeSpace.cpp.obj CMakeFiles\OgreOde_Core.dir\src\OgreOdeStepper.cpp.obj CMakeFiles\OgreOde_Core.dir\src\OgreOdeTriangleMeshData.cpp.obj CMakeFiles\OgreOde_Core.dir\src\OgreOdeTriangleMeshDataManager.cpp.obj CMakeFiles\OgreOde_Core.dir\src\OgreOdeUtility.cpp.obj CMakeFiles\OgreOde_Core.dir\src\OgreOdeWorld.cpp.obj "E:\Program Files\CodeBlocks\OgreSDK\lib\OgreMain.lib" -lkernel32 -luser32 -lgdi32 -lwinspool -lshell32 -lole32 -loleaut32 -luuid -lcomdlg32 -ladvapi32 
mingw32-make.exe[2]: *** [bin/libOgreOde_Core.dll] Error 1
mingw32-make.exe[2]: Leaving directory `E:/Program Files/CodeBlocks/OgreSDK/ogreaddons/ogreode'
mingw32-make.exe[1]: *** [Core/CMakeFiles/OgreOde_Core.dir/all] Error 2
mingw32-make.exe[1]: Leaving directory `E:/Program Files/CodeBlocks/OgreSDK/ogreaddons/ogreode'
mingw32-make.exe: *** [all] Error 2
Process terminated with status 2 (4 minutes, 2 seconds)
0 errors, 48 warnings
Que dois je faire ? Ai-je omis quelque chose ?

Merci d'avance.

ps: Si quelqu'un saurait comment mettre une balise secret/spoil, il serait sympa de me l'indiquer, je la trouve pas et le log est immense :s