IdentifiantMot de passe
Loading...
Mot de passe oublié ?Je m'inscris ! (gratuit)
Navigation

Inscrivez-vous gratuitement
pour pouvoir participer, suivre les réponses en temps réel, voter pour les messages, poser vos propres questions et recevoir la newsletter

Matériel Discussion :

probleme compilation driver Bewan


Sujet :

Matériel

Vue hybride

Message précédent Message précédent   Message suivant Message suivant
  1. #1
    Membre confirmé
    Profil pro
    Inscrit en
    Juillet 2007
    Messages
    174
    Détails du profil
    Informations personnelles :
    Localisation : France

    Informations forums :
    Inscription : Juillet 2007
    Messages : 174
    Par défaut probleme compilation driver Bewan
    Bonjour,
    j'ai un probleme de compilation d'un driver pour une carte Bewan PCIst mais je ne comprend pas d'où sa vient. Voici l'erreur:

    serveur:/home/ser/Desktop/unicorn/unicorn_pci# make
    make CC=gcc -C /usr/src/linux SUBDIRS=/home/ser/Desktop/unicorn/unicorn_pci modules
    make[1]: entrant dans le répertoire « /usr/src/linux-source-2.6.18 »
    CC [M] /home/ser/Desktop/unicorn/unicorn_pci/unicorn_pcidrv.o
    /home/ser/Desktop/unicorn/unicorn_pci/unicorn_pcidrv.c:2160: error: expected ‘)’ before string constant
    /home/ser/Desktop/unicorn/unicorn_pci/unicorn_pcidrv.c:2162: error: expected ‘)’ before string constant
    /home/ser/Desktop/unicorn/unicorn_pci/unicorn_pcidrv.c:2163: error: expected ‘)’ before string constant
    /home/ser/Desktop/unicorn/unicorn_pci/unicorn_pcidrv.c:2165: error: expected ‘)’ before string constant
    /home/ser/Desktop/unicorn/unicorn_pci/unicorn_pcidrv.c:2166: error: expected ‘)’ before string constant
    /home/ser/Desktop/unicorn/unicorn_pci/unicorn_pcidrv.c:2168: error: expected ‘)’ before string constant
    /home/ser/Desktop/unicorn/unicorn_pci/unicorn_pcidrv.c:2170: error: expected ‘)’ before string constant
    /home/ser/Desktop/unicorn/unicorn_pci/unicorn_pcidrv.c:2171: error: expected ‘)’ before string constant

    /home/ser/Desktop/unicorn/unicorn_pci/unicorn_pcidrv.c:2172: error: expected ‘)’ before string constant
    /home/ser/Desktop/unicorn/unicorn_pci/unicorn_pcidrv.c:2173: error: expected ‘)’ before string constant
    /home/ser/Desktop/unicorn/unicorn_pci/unicorn_pcidrv.c:2174: error: expected ‘)’ before string constant
    /home/ser/Desktop/unicorn/unicorn_pci/unicorn_pcidrv.c:2175: error: expected ‘)’ before string constant
    /home/ser/Desktop/unicorn/unicorn_pci/unicorn_pcidrv.c:2176: error: expected ‘)’ before string constant
    /home/ser/Desktop/unicorn/unicorn_pci/unicorn_pcidrv.c:2177: error: expected ‘)’ before string constant
    /home/ser/Desktop/unicorn/unicorn_pci/unicorn_pcidrv.c:2178: error: expected ‘)’ before string constant
    /home/ser/Desktop/unicorn/unicorn_pci/unicorn_pcidrv.c:2181: error: expected ‘)’ before string constant
    /home/ser/Desktop/unicorn/unicorn_pci/unicorn_pcidrv.c:2186: error: expected ‘)’ before string constant
    /home/ser/Desktop/unicorn/unicorn_pci/unicorn_pcidrv.c:2191: error: expected ‘)’ before string constant
    make[2]: *** [/home/ser/Desktop/unicorn/unicorn_pci/unicorn_pcidrv.o] Erreur 1
    make[1]: *** [_module_/home/ser/Desktop/unicorn/unicorn_pci] Erreur 2
    make[1]: quittant le répertoire « /usr/src/linux-source-2.6.18 »
    make: *** [modules] Erreur 2
    serveur:/home/ser/Desktop/unicorn/unicorn_pci#
    Je suis sous une debian.
    Pouvez vous m'aider à resoudre ce probleme?

    merci d'avance

  2. #2
    Membre éprouvé Avatar de gandalfar
    Inscrit en
    Novembre 2004
    Messages
    145
    Détails du profil
    Informations forums :
    Inscription : Novembre 2004
    Messages : 145
    Par défaut
    quel est ta version de gcc ?

  3. #3
    Membre confirmé
    Profil pro
    Inscrit en
    Juillet 2007
    Messages
    174
    Détails du profil
    Informations personnelles :
    Localisation : France

    Informations forums :
    Inscription : Juillet 2007
    Messages : 174
    Par défaut
    ma version de gcc est 4.1.2

  4. #4
    Membre éprouvé Avatar de gandalfar
    Inscrit en
    Novembre 2004
    Messages
    145
    Détails du profil
    Informations forums :
    Inscription : Novembre 2004
    Messages : 145
    Par défaut
    tu a essayer de changer le Makefile pour utiliser une version plus permissive de gcc comme la 3.3?

  5. #5
    Membre confirmé
    Profil pro
    Inscrit en
    Juillet 2007
    Messages
    174
    Détails du profil
    Informations personnelles :
    Localisation : France

    Informations forums :
    Inscription : Juillet 2007
    Messages : 174
    Par défaut
    Aparement il semblerait que ce soit un probleme dans la source.
    J'ai alors modifier quelque ligne et le probleme precedent ne se pose plus.
    Mais un nouveau probleme est aparut:
    serveur:/home/ser/Desktop/unicorn/unicorn_pci# make
    make CC=gcc -C /usr/src/linux SUBDIRS=/home/ser/Desktop/unicorn/unicorn_pci modules
    make[1]: entrant dans le répertoire « /usr/src/linux-source-2.6.18 »
    make[2]: *** Pas de règle pour fabriquer la cible « /home/ser/Desktop/unicorn/unicorn_pci/../msw/msw.o », nécessaire pour « /home/ser/Desktop/unicorn/unicorn_pci/unicorn_pci_atm.o ». Arrêt.
    make[1]: *** [_module_/home/ser/Desktop/unicorn/unicorn_pci] Erreur 2
    make[1]: quittant le répertoire « /usr/src/linux-source-2.6.18 »
    make: *** [modules] Erreur 2
    Et comment changer le Makefile pour utiliser une version plus permissive de gcc comme la 3.3?

Discussions similaires

  1. [DEBUTANT] problem compilation eclipse
    Par roninou dans le forum Eclipse Java
    Réponses: 3
    Dernier message: 14/01/2005, 15h59
  2. probleme avec driver ODBC DBASE suite a install SP
    Par bzh56 dans le forum Bases de données
    Réponses: 2
    Dernier message: 02/11/2004, 10h47
  3. [JAR]Probleme compilation avec jdom
    Par ronaldgis dans le forum Eclipse Java
    Réponses: 4
    Dernier message: 04/08/2004, 11h31
  4. probleme compilation classe avec Borland c++ compiler 5.5
    Par softblue dans le forum Autres éditeurs
    Réponses: 2
    Dernier message: 17/06/2004, 15h16
  5. [Debian] problème compilation jbuilder 9...
    Par Ancien_Do.Urden dans le forum JBuilder
    Réponses: 5
    Dernier message: 20/03/2004, 15h02

Partager

Partager
  • Envoyer la discussion sur Viadeo
  • Envoyer la discussion sur Twitter
  • Envoyer la discussion sur Google
  • Envoyer la discussion sur Facebook
  • Envoyer la discussion sur Digg
  • Envoyer la discussion sur Delicious
  • Envoyer la discussion sur MySpace
  • Envoyer la discussion sur Yahoo