1. #1
    Futur Membre du Club
    Homme Profil pro
    Consultant en Business Intelligence
    Inscrit en
    novembre 2015
    Messages
    13
    Détails du profil
    Informations personnelles :
    Sexe : Homme
    Localisation : France, Nord (Nord Pas de Calais)

    Informations professionnelles :
    Activité : Consultant en Business Intelligence
    Secteur : Santé

    Informations forums :
    Inscription : novembre 2015
    Messages : 13
    Points : 7
    Points
    7

    Par défaut Impossible de construire un Job Talend 6.3

    Bonjour,

    Je me permet de nouveau de solliciter le forum car je rencontre un problème dans la construction d'un job. La génération de l'exécutable n'aboutie pas.

    Je vous met plein de détail dans l'espoir que vous puissiez me dépanner.

    • La version de Talend est 6.3.0. Celles du JDK et JRE sont 1.8.0_60.


    • Mes variables d'environnement sont positionnées ainsi :

    JAVA_HOME = c:\Program Files\Java\jdk1.8.0_60
    JDK_HOME = c:\Program Files\Java\jdk1.8.0_60

    Donc, dans le Repository, je fais un clic droit sur le job et choisi "Construire le job". Je complète la fenêtre qui s'affiche comme suit :

    Nom : pb_talend1.jpg
Affichages : 56
Taille : 73,4 Ko

    Je clic ensuite sur le bouton "Finish", il y a une jauge de progression qui s'affiche en bas de la fenêtre et j'attend un petit moment. La jauge ne progresse pas, aucun message n'est affiché et au bout d'une ou deux minutes, la fenêtre se ferme sans plus d'information. Sur le disque C:\, je ne trouve pas le fichier mon_executable.zip.

    A noter que si je coche les cases Extraire le fichiez zip, Eléments ou Sources java dans la fenêtre de construction du job, j'ai le même problème.

    Par contre, il y a un fichier dont le nom correspond à mon prénom et sans extension (j'avoue ne pas me souvenir comment j'ai pu paramétrer cela). Voici le contenu du fichier :

    [INFO] Scanning for projects...
    [INFO] ------------------------------------------------------------------------
    [INFO] Reactor Build Order:
    [INFO]
    [INFO] CHD_DATAWAREHOUSE Codes Master
    [INFO] CHD_DATAWAREHOUSE Routines
    [INFO] CHD_DATAWAREHOUSE POST_JOB (Jobs)
    [INFO] CHD_DATAWAREHOUSE PRE_JOB (Jobs)
    [INFO] CHD_DATAWAREHOUSE INITIALISATION (Jobs)
    [INFO] CHD_DATAWAREHOUSE DESACTIVER_ACCES (Jobs)
    [INFO] CHD_DATAWAREHOUSE ALIM_TABLE_SANTE400_BUP01 (Jobs)
    [INFO] CHD_DATAWAREHOUSE ALIM_TABLE_SANTE400_ILP01 (Jobs)
    [INFO] CHD_DATAWAREHOUSE PREPA_ALIM_TD_COMPTE (Jobs)
    [INFO] CHD_DATAWAREHOUSE ALIM_TABLE_SANTE400_GDP01 (Jobs)
    [INFO] CHD_DATAWAREHOUSE ALIM_TABLE_SANTE400_IKP01 (Jobs)
    [INFO] CHD_DATAWAREHOUSE ALIM_TABLE_SANTE400_IJP01 (Jobs)
    [INFO] CHD_DATAWAREHOUSE ALIM_TABLE_SANTE400_BCP01 (Jobs)
    [INFO] CHD_DATAWAREHOUSE ALIM_TABLE_SANTE400_R7B02 (Jobs)
    [INFO] CHD_DATAWAREHOUSE ALIM_TABLE_SANTE400_UFL01GE (Jobs)
    [INFO] CHD_DATAWAREHOUSE ALIM_TABLE_SANTE400_THL02GE (Jobs)
    [INFO] CHD_DATAWAREHOUSE ALIM_TABLE_SANTE400_AHP01 (Jobs)
    [INFO] CHD_DATAWAREHOUSE ALIM_ODS (Jobs)
    [INFO] CHD_DATAWAREHOUSE ALIM_TD_COMPTE (Jobs)
    [INFO] CHD_DATAWAREHOUSE FIN_EXPLOITATION (Jobs)
    [INFO] CHD_DATAWAREHOUSE PREPA_ALIM_TF_COMPTE_MONTANTS (Jobs)
    [INFO] CHD_DATAWAREHOUSE PREPA_ALIM_TF_IMMOBILISATION (Jobs)
    [INFO] CHD_DATAWAREHOUSE PREPA_ALIM_DATAWAREHOUSE (Jobs)
    [INFO] CHD_DATAWAREHOUSE ACTIVER_ACCES (Jobs)
    [INFO] CHD_DATAWAREHOUSE ALIM_TF_COMPTE_MONTANTS (Jobs)
    [INFO] CHD_DATAWAREHOUSE ALIM_TF_IMMOBILISATION (Jobs)
    [INFO] CHD_DATAWAREHOUSE ALIM_DATAWAREHOUSE (Jobs)
    [INFO] CHD_DATAWAREHOUSE CONTROLE_COHERENCE (Jobs)
    [INFO] CHD_DATAWAREHOUSE ALIM_CHD_DATAWAREHOUSE (Jobs)
    [INFO]
    [INFO] Using the builder org.apache.maven.lifecycle.internal.builder.singlethreaded.SingleThreadedBuilder with a thread count of 1
    [INFO]
    [INFO] ------------------------------------------------------------------------
    [INFO] Building CHD_DATAWAREHOUSE Codes Master 6.3.0
    [INFO] ------------------------------------------------------------------------
    [INFO] ------------------------------------------------------------------------
    [INFO] Reactor Summary:
    [INFO]
    [INFO] CHD_DATAWAREHOUSE Codes Master .................... FAILURE [ 0.020 s]
    [INFO] CHD_DATAWAREHOUSE Routines ........................ SKIPPED
    [INFO] CHD_DATAWAREHOUSE POST_JOB (Jobs) ................. SKIPPED
    [INFO] CHD_DATAWAREHOUSE PRE_JOB (Jobs) .................. SKIPPED
    [INFO] CHD_DATAWAREHOUSE INITIALISATION (Jobs) ........... SKIPPED
    [INFO] CHD_DATAWAREHOUSE DESACTIVER_ACCES (Jobs) ......... SKIPPED
    [INFO] CHD_DATAWAREHOUSE ALIM_TABLE_SANTE400_BUP01 (Jobs) SKIPPED
    [INFO] CHD_DATAWAREHOUSE ALIM_TABLE_SANTE400_ILP01 (Jobs) SKIPPED
    [INFO] CHD_DATAWAREHOUSE PREPA_ALIM_TD_COMPTE (Jobs) ..... SKIPPED
    [INFO] CHD_DATAWAREHOUSE ALIM_TABLE_SANTE400_GDP01 (Jobs) SKIPPED
    [INFO] CHD_DATAWAREHOUSE ALIM_TABLE_SANTE400_IKP01 (Jobs) SKIPPED
    [INFO] CHD_DATAWAREHOUSE ALIM_TABLE_SANTE400_IJP01 (Jobs) SKIPPED
    [INFO] CHD_DATAWAREHOUSE ALIM_TABLE_SANTE400_BCP01 (Jobs) SKIPPED
    [INFO] CHD_DATAWAREHOUSE ALIM_TABLE_SANTE400_R7B02 (Jobs) SKIPPED
    [INFO] CHD_DATAWAREHOUSE ALIM_TABLE_SANTE400_UFL01GE (Jobs) SKIPPED
    [INFO] CHD_DATAWAREHOUSE ALIM_TABLE_SANTE400_THL02GE (Jobs) SKIPPED
    [INFO] CHD_DATAWAREHOUSE ALIM_TABLE_SANTE400_AHP01 (Jobs) SKIPPED
    [INFO] CHD_DATAWAREHOUSE ALIM_ODS (Jobs) ................. SKIPPED
    [INFO] CHD_DATAWAREHOUSE ALIM_TD_COMPTE (Jobs) ........... SKIPPED
    [INFO] CHD_DATAWAREHOUSE FIN_EXPLOITATION (Jobs) ......... SKIPPED
    [INFO] CHD_DATAWAREHOUSE PREPA_ALIM_TF_COMPTE_MONTANTS (Jobs) SKIPPED
    [INFO] CHD_DATAWAREHOUSE PREPA_ALIM_TF_IMMOBILISATION (Jobs) SKIPPED
    [INFO] CHD_DATAWAREHOUSE PREPA_ALIM_DATAWAREHOUSE (Jobs) . SKIPPED
    [INFO] CHD_DATAWAREHOUSE ACTIVER_ACCES (Jobs) ............ SKIPPED
    [INFO] CHD_DATAWAREHOUSE ALIM_TF_COMPTE_MONTANTS (Jobs) .. SKIPPED
    [INFO] CHD_DATAWAREHOUSE ALIM_TF_IMMOBILISATION (Jobs) ... SKIPPED
    [INFO] CHD_DATAWAREHOUSE ALIM_DATAWAREHOUSE (Jobs) ....... SKIPPED
    [INFO] CHD_DATAWAREHOUSE CONTROLE_COHERENCE (Jobs) ....... SKIPPED
    [INFO] CHD_DATAWAREHOUSE ALIM_CHD_DATAWAREHOUSE (Jobs) ... SKIPPED
    [INFO] ------------------------------------------------------------------------
    [INFO] BUILD FAILURE
    [INFO] ------------------------------------------------------------------------
    [INFO] Total time: 0.530 s
    [INFO] Finished at: 2017-04-28T10:04:48+01:00
    [INFO] Final Memory: 5M/15M
    [INFO] ------------------------------------------------------------------------
    [ERROR] Unknown lifecycle phase "NOM/Documents/001". You must specify a valid lifecycle phase or a goal in the format <plugin-prefix>:<goal> or <plugin-group-id>:<plugin-artifact-id>[:<plugin-version>]:<goal>. Available lifecycle phases are: validate, initialize, generate-sources, process-sources, generate-resources, process-resources, compile, process-classes, generate-test-sources, process-test-sources, generate-test-resources, process-test-resources, test-compile, process-test-classes, test, prepare-package, package, pre-integration-test, integration-test, post-integration-test, verify, install, deploy, pre-clean, clean, post-clean, pre-site, site, post-site, site-deploy. -> [Help 1]
    [ERROR]
    [ERROR] To see the full stack trace of the errors, re-run Maven with the -e switch.
    [ERROR] Re-run Maven using the -X switch to enable full debug logging.
    [ERROR]
    [ERROR] For more information about the errors and possible solutions, please read the following articles:
    [ERROR] [Help 1] http://cwiki.apache.org/confluence/d...FoundException

    Peu importe le nom du fichier, j'ai pu constater l'erreur. Le problème, c'est que je ne la comprend pas, ne maîtrisant pas tout ce qui concerne Apache, Tomcat et/ou Java. Elle parle d'un cycle de vie et de maven. Il y a un lien que j'ai bien sûr lu, mais auquel je n'ai rien compris non plus. Il semblerait que je dois indiquer la phase du cycle de vie quelque part, mais où ?

    Ce qui est bizarre aussi, c'est que dans le début du texte de l'erreur, il est fait mention de "NOM/Documents/001". Ceci semble correspondre au début du nom du dossier C:\NOM\Documents\001 - Système d'Informations Décisionnel

    J'ai aussi vu qu'il existait une section maven dans les propriétés du projet, mais c'est du code XML, et je ne sais pas si je dois changer quelque chose et où le changer.

    Dans les préférences Talend, il y a aussi une section sur le cycle de vie, mais pareil, comment la compléter ?

    Nom : pb_talend2.jpg
Affichages : 54
Taille : 102,5 Ko

    Je note aussi que dans le dossier Chande mapping file location, il n'y a pas de fichier lifecycle-mapping-metadata.xml. J'ai néanmoins cliqué sur le bouton Open workspace lifecycle mapping metadata, et ça m'a affiché ceci, mais à nouveau, même problème, il y a des items de menu à compléter, mais je ne sais pas comment les remplir :

    Nom : pb_talend3.jpg
Affichages : 54
Taille : 52,2 Ko

    Jusqu'à présent, je travaillais sous Talend 3.2 (contrainte de mon employeur), mais j'ai enfin pu tout migrer dans la dernière version de Talend, et tout fonctionne correctement, le job s'exécute sans problème. Je ne m'attendais pas à rencontrer un tel problème en voulant générer l'exécutable pour passer en production.

    J'ai cherché sur les forums, mais je n'ai pas trouvé de problème similaire. J'espère avoir fourni suffisament d'informations dans l'espoir que quelqu'un puisse m'aider.

    D'avance un grand Merci à tout ceux qui accepterons de ce pencher sur mon problème.

    GiDu

  2. #2
    Membre du Club
    Homme Profil pro
    Consultant en Business Intelligence
    Inscrit en
    décembre 2016
    Messages
    42
    Détails du profil
    Informations personnelles :
    Sexe : Homme
    Âge : 34
    Localisation : Cameroun

    Informations professionnelles :
    Activité : Consultant en Business Intelligence
    Secteur : High Tech - Produits et services télécom et Internet

    Informations forums :
    Inscription : décembre 2016
    Messages : 42
    Points : 69
    Points
    69

    Par défaut

    Bonjour Gidu59

    Le problème que tu poses est très atypique.

    Est ce que tu arrives à exécuter le job?

    Bonne journée
    wcfsmart

  3. #3
    Futur Membre du Club
    Homme Profil pro
    Consultant en Business Intelligence
    Inscrit en
    novembre 2015
    Messages
    13
    Détails du profil
    Informations personnelles :
    Sexe : Homme
    Localisation : France, Nord (Nord Pas de Calais)

    Informations professionnelles :
    Activité : Consultant en Business Intelligence
    Secteur : Santé

    Informations forums :
    Inscription : novembre 2015
    Messages : 13
    Points : 7
    Points
    7

    Par défaut

    Bonjour wcfsmart,

    Oui, j'arrive à déclencher le job depuis Talend et il s'exécute sans problème.

    J'ai aussi essayé de compiler un autre job tout simple où j'affichais juste un message, et j'obtiens exactement la même erreur lorsque je tente de générer l'exécutable.

    Avant je développais en version 3.2 et je ne rencontrais pas ce problème, mais j'ai commencé à tout migrer voilà 2 mois en 6.3, et alors que j'ai fini et que je veux tout basculer en prod, je tombe sur ce problème. Je me voie mal revenir en arrière. Jamais il ne m'est venue à l'esprit de tester la génération de l'exécutable avant (si j'avais su )

    En espérant que "l'atypie" trouvera quelqu'un qui maîtrise le sujet, parce que je sèche complètement, et vue le nombre de réponse, je ne suis pas du tout rassuré

    Bon après-midi...

    GiDu

  4. #4
    Membre du Club
    Homme Profil pro
    Consultant en Business Intelligence
    Inscrit en
    décembre 2016
    Messages
    42
    Détails du profil
    Informations personnelles :
    Sexe : Homme
    Âge : 34
    Localisation : Cameroun

    Informations professionnelles :
    Activité : Consultant en Business Intelligence
    Secteur : High Tech - Produits et services télécom et Internet

    Informations forums :
    Inscription : décembre 2016
    Messages : 42
    Points : 69
    Points
    69

    Par défaut

    Bonjour GiDu,

    A ta place, je vais recommencé le téléchargement de Talend

    En principe, talend ne requiert pas des configurations compliquées. J'ai talend installé sur 4 pc différents et je l'utilise depuis 2010, jamais je n'ai rencontré un telp problème.

    Bonne journée
    wcfsmart

  5. #5
    Futur Membre du Club
    Homme Profil pro
    Consultant en Business Intelligence
    Inscrit en
    novembre 2015
    Messages
    13
    Détails du profil
    Informations personnelles :
    Sexe : Homme
    Localisation : France, Nord (Nord Pas de Calais)

    Informations professionnelles :
    Activité : Consultant en Business Intelligence
    Secteur : Santé

    Informations forums :
    Inscription : novembre 2015
    Messages : 13
    Points : 7
    Points
    7

    Par défaut

    Merci de m'avoir consacré du temps Wcfsmart.

    Comme j'ai résolu mon problème, je n'avais pas encore pris le temps de répondre.

    Donc, je n'étais pas du tout rassuré de tout désinstaller/réinstaller, avec la peur de perdre un développement ou que plus rien ne fonctionne du tout.

    En désespoir de cause, je me suis lancé et j'ai réalisé les actions suivantes :
    • J'ai réalisé un export de mon projet,
    • J'ai supprimé le dossier Talend (j'ai cherché et pas trouvé d'exécutable de désinstallation),
    • J'ai désinstallé toutes les versions de java (JDK et JRE),
    • J'ai supprimé de la base de registre toutes les entrées qui utilisaient le mot "talend". Pareil pour le mot "TOS" (mais avec plus de précaution sur les suppressions)
    • J'ai réinstallé le JDK (v.1.8.111)
    • Tant qu'à faire, j'ai téléchargé la toute dernière version de Talend sur le site Talend (v.6.4) que j'ai installé. Facile, il n'y a qu'un dossier à copier (ça explique pourquoi il n'y a pas d'utilitaire de désinstallation, et en plus, c'est plus propre que des DLL un peu partout).
    • J'ai réimporté mon projet.
    • Et hop, j'ai compilé !

    Et là, miracle, ça fonctionnait

    GiDu

+ Répondre à la discussion
Cette discussion est résolue.

Discussions similaires

  1. Impossible d'exporter des jobs avec Talend 4.1
    Par matt0056 dans le forum Installation, migration et administration
    Réponses: 1
    Dernier message: 07/08/2012, 10h23
  2. [Lazarus] [Ubuntu] Impossible de construire
    Par durdur17 dans le forum Lazarus
    Réponses: 3
    Dernier message: 17/05/2008, 23h39
  3. Réponses: 0
    Dernier message: 15/05/2008, 17h55
  4. Recupération d'une exception sur Job Talend
    Par tioneb369 dans le forum Développement de jobs
    Réponses: 2
    Dernier message: 18/10/2007, 10h05
  5. Talend : Impossible d'exécuter mes Jobs
    Par SebastienM dans le forum Exécution et industrialisation
    Réponses: 12
    Dernier message: 25/07/2007, 11h55

Partager

Partager
  • Envoyer la discussion sur Viadeo
  • Envoyer la discussion sur Twitter
  • Envoyer la discussion sur Google
  • Envoyer la discussion sur Facebook
  • Envoyer la discussion sur Digg
  • Envoyer la discussion sur Delicious
  • Envoyer la discussion sur MySpace
  • Envoyer la discussion sur Yahoo