IdentifiantMot de passe
Loading...
Mot de passe oublié ?Je m'inscris ! (gratuit)
Navigation

Inscrivez-vous gratuitement
pour pouvoir participer, suivre les réponses en temps réel, voter pour les messages, poser vos propres questions et recevoir la newsletter

Maven Java Discussion :

Erreurs 1er test : MavenFilteringException [Débutant(e)]


Sujet :

Maven Java

Vue hybride

Message précédent Message précédent   Message suivant Message suivant
  1. #1
    Membre éclairé
    Profil pro
    Inscrit en
    Décembre 2004
    Messages
    759
    Détails du profil
    Informations personnelles :
    Localisation : France

    Informations forums :
    Inscription : Décembre 2004
    Messages : 759
    Par défaut Erreurs 1er test : MavenFilteringException
    Bonjour,

    Après avoir installé Maven (3.1.1), les plugin Eclipse, je lance le premier "Run as/Maven test" sur le pom suivant :
    Code XML : Sélectionner tout - Visualiser dans une fenêtre à part
    1
    2
    3
    4
    5
    6
    7
    8
    9
    10
    11
    12
    13
    14
    15
    16
    17
    18
    19
    20
    21
    22
    23
    24
    25
    26
    27
    28
    <project xmlns="http://maven.apache.org/POM/4.0.0" xmlns:xsi="http://www.w3.org/2001/XMLSchema-instance" xsi:schemaLocation="http://maven.apache.org/POM/4.0.0 http://maven.apache.org/xsd/maven-4.0.0.xsd">
    	<modelVersion>4.0.0</modelVersion>
    	<groupId>groupeTest</groupId>
    	<artifactId>artefactTest</artifactId>
    	<version>0.0.1-SNAPSHOT</version>
    	<name>Maven Project Test</name>
    	<build>
    		<plugins>
    			<plugin>
    				<groupId>org.apache.mave.plugins</groupId>
    				<artifactId>maven-compiler-plugin</artifactId>
    				<version>2.3.2</version>
    				<configuration> 
    					<source>1.6</source> 
    					<target>1.6</target> 
    				</configuration>
    			</plugin>
    		</plugins>	
    	</build>  
    	<dependencies>
    		<dependency>
    		<groupId>junit</groupId>
    		<artifactId>junit</artifactId>
    		<version>4.8.2</version>
    		<scope>test</scope>
    		</dependency>
    	</dependencies>
    </project>

    Voici l'erreur :
    Code : Sélectionner tout - Visualiser dans une fenêtre à part
    1
    2
    3
    4
    5
    6
    7
    8
    9
    10
    11
    12
    13
    14
    15
    16
    17
    18
    19
    20
    21
    22
    23
    24
    25
    26
    27
    28
    29
    30
    31
    32
    33
    34
    35
    36
    37
    38
    39
    40
    41
    42
    43
    44
    45
    46
    47
    48
    49
    50
    51
    52
    53
    54
    55
    56
    57
    58
    59
    60
    61
    62
    63
    64
    65
    66
    67
    68
    69
    70
    71
    72
    73
    74
    75
    76
    77
    78
    79
    80
    81
    82
    83
    84
    85
    86
    87
    88
    [WARNING] Error injecting: org.apache.maven.plugin.resources.ResourcesMojo
    java.lang.NoClassDefFoundError: org/apache/maven/shared/filtering/MavenFilteringException
    	at java.lang.Class.getDeclaredConstructors0(Native Method)
    	at java.lang.Class.privateGetDeclaredConstructors(Class.java:2398)
    	at java.lang.Class.getDeclaredConstructors(Class.java:1838)
    	at com.google.inject.spi.InjectionPoint.forConstructorOf(InjectionPoint.java:245)
    	at com.google.inject.internal.ConstructorBindingImpl.create(ConstructorBindingImpl.java:99)
    	at com.google.inject.internal.InjectorImpl.createUninitializedBinding(InjectorImpl.java:653)
    	at com.google.inject.internal.InjectorImpl.createJustInTimeBinding(InjectorImpl.java:863)
    	at com.google.inject.internal.InjectorImpl.createJustInTimeBindingRecursive(InjectorImpl.java:790)
    	at com.google.inject.internal.InjectorImpl.getJustInTimeBinding(InjectorImpl.java:278)
    	at com.google.inject.internal.InjectorImpl.getBindingOrThrow(InjectorImpl.java:210)
    	at com.google.inject.internal.InjectorImpl.getProviderOrThrow(InjectorImpl.java:986)
    	at com.google.inject.internal.InjectorImpl.getProvider(InjectorImpl.java:1019)
    	at com.google.inject.internal.InjectorImpl.getProvider(InjectorImpl.java:982)
    	at com.google.inject.internal.InjectorImpl.getInstance(InjectorImpl.java:1032)
    	at org.eclipse.sisu.space.AbstractDeferredClass.get(AbstractDeferredClass.java:48)
    	at com.google.inject.internal.ProviderInternalFactory.provision(ProviderInternalFactory.java:86)
    	at com.google.inject.internal.InternalFactoryToInitializableAdapter.provision(InternalFactoryToInitializableAdapter.java:55)
    	at com.google.inject.internal.ProviderInternalFactory$1.call(ProviderInternalFactory.java:70)
    	at com.google.inject.internal.ProvisionListenerStackCallback$Provision.provision(ProvisionListenerStackCallback.java:100)
    	at org.eclipse.sisu.plexus.PlexusLifecycleManager.onProvision(PlexusLifecycleManager.java:133)
    	at com.google.inject.internal.ProvisionListenerStackCallback$Provision.provision(ProvisionListenerStackCallback.java:109)
    	at com.google.inject.internal.ProvisionListenerStackCallback.provision(ProvisionListenerStackCallback.java:55)
    	at com.google.inject.internal.ProviderInternalFactory.circularGet(ProviderInternalFactory.java:68)
    	at com.google.inject.internal.InternalFactoryToInitializableAdapter.get(InternalFactoryToInitializableAdapter.java:47)
    	at com.google.inject.internal.InjectorImpl$2$1.call(InjectorImpl.java:997)
    	at com.google.inject.internal.InjectorImpl.callInContext(InjectorImpl.java:1047)
    	at com.google.inject.internal.InjectorImpl$2.get(InjectorImpl.java:993)
    	at com.google.inject.Scopes$1$1.get(Scopes.java:59)
    	at org.eclipse.sisu.inject.LazyBeanEntry.getValue(LazyBeanEntry.java:82)
    	at org.eclipse.sisu.plexus.LazyPlexusBean.getValue(LazyPlexusBean.java:51)
    	at org.codehaus.plexus.DefaultPlexusContainer.lookup(DefaultPlexusContainer.java:260)
    	at org.codehaus.plexus.DefaultPlexusContainer.lookup(DefaultPlexusContainer.java:252)
    	at org.apache.maven.plugin.internal.DefaultMavenPluginManager.getConfiguredMojo(DefaultMavenPluginManager.java:459)
    	at org.apache.maven.plugin.DefaultBuildPluginManager.executeMojo(DefaultBuildPluginManager.java:97)
    	at org.apache.maven.lifecycle.internal.MojoExecutor.execute(MojoExecutor.java:208)
    	at org.apache.maven.lifecycle.internal.MojoExecutor.execute(MojoExecutor.java:153)
    	at org.apache.maven.lifecycle.internal.MojoExecutor.execute(MojoExecutor.java:145)
    	at org.apache.maven.lifecycle.internal.LifecycleModuleBuilder.buildProject(LifecycleModuleBuilder.java:84)
    	at org.apache.maven.lifecycle.internal.LifecycleModuleBuilder.buildProject(LifecycleModuleBuilder.java:59)
    	at org.apache.maven.lifecycle.internal.LifecycleStarter.singleThreadedBuild(LifecycleStarter.java:183)
    	at org.apache.maven.lifecycle.internal.LifecycleStarter.execute(LifecycleStarter.java:161)
    	at org.apache.maven.DefaultMaven.doExecute(DefaultMaven.java:317)
    	at org.apache.maven.DefaultMaven.execute(DefaultMaven.java:152)
    	at org.apache.maven.cli.MavenCli.execute(MavenCli.java:555)
    	at org.apache.maven.cli.MavenCli.doMain(MavenCli.java:214)
    	at org.apache.maven.cli.MavenCli.main(MavenCli.java:158)
    	at sun.reflect.NativeMethodAccessorImpl.invoke0(Native Method)
    	at sun.reflect.NativeMethodAccessorImpl.invoke(NativeMethodAccessorImpl.java:39)
    	at sun.reflect.DelegatingMethodAccessorImpl.invoke(DelegatingMethodAccessorImpl.java:25)
    	at java.lang.reflect.Method.invoke(Method.java:597)
    	at org.codehaus.plexus.classworlds.launcher.Launcher.launchEnhanced(Launcher.java:289)
    	at org.codehaus.plexus.classworlds.launcher.Launcher.launch(Launcher.java:229)
    	at org.codehaus.plexus.classworlds.launcher.Launcher.mainWithExitCode(Launcher.java:415)
    	at org.codehaus.plexus.classworlds.launcher.Launcher.main(Launcher.java:356)
    	at org.codehaus.classworlds.Launcher.main(Launcher.java:46)
    Caused by: java.lang.ClassNotFoundException: org.apache.maven.shared.filtering.MavenFilteringException
    	at org.codehaus.plexus.classworlds.strategy.SelfFirstStrategy.loadClass(SelfFirstStrategy.java:50)
    	at org.codehaus.plexus.classworlds.realm.ClassRealm.unsynchronizedLoadClass(ClassRealm.java:259)
    	at org.codehaus.plexus.classworlds.realm.ClassRealm.loadClass(ClassRealm.java:242)
    	at org.codehaus.plexus.classworlds.realm.ClassRealm.loadClass(ClassRealm.java:227)
    	... 55 more
    [INFO] ------------------------------------------------------------------------
    [INFO] BUILD FAILURE
    [INFO] ------------------------------------------------------------------------
    [INFO] Total time: 0.718s
    [INFO] Finished at: Mon Nov 25 16:00:33 CET 2013
    [INFO] Final Memory: 3M/15M
    [INFO] ------------------------------------------------------------------------
    [ERROR] Failed to execute goal org.apache.maven.plugins:maven-resources-plugin:2.6:resources (default-resources) on project artefactTest: Execution default-resources of goal org.apache.maven.plugins:maven-resources-plugin:2.6:resources failed: A required class was missing while executing org.apache.maven.plugins:maven-resources-plugin:2.6:resources: org/apache/maven/shared/filtering/MavenFilteringException
    [ERROR] -----------------------------------------------------
    [ERROR] realm =    plugin>org.apache.maven.plugins:maven-resources-plugin:2.6
    [ERROR] strategy = org.codehaus.plexus.classworlds.strategy.SelfFirstStrategy
    [ERROR] urls[0] = file:/C:/Documents%20and%20Settings/the_user/.m2/repository/org/apache/maven/plugins/maven-resources-plugin/2.6/maven-resources-plugin-2.6.jar
    [ERROR] urls[1] = file:/C:/Documents%20and%20Settings/the_user/.m2/repository/org/apache/maven/reporting/maven-reporting-api/2.0.6/maven-reporting-api-2.0.6.jar
    [ERROR] urls[2] = file:/C:/Documents%20and%20Settings/the_user/.m2/repository/org/apache/maven/doxia/doxia-sink-api/1.0-alpha-7/doxia-sink-api-1.0-alpha-7.jar
    [ERROR] urls[3] = file:/C:/Documents%20and%20Settings/the_user/.m2/repository/commons-cli/commons-cli/1.0/commons-cli-1.0.jar
    [ERROR] urls[4] = file:/C:/Documents%20and%20Settings/the_user/.m2/repository/org/codehaus/plexus/plexus-interactivity-api/1.0-alpha-4/plexus-interactivity-api-1.0-alpha-4.jar
    [ERROR] urls[5] = file:/C:/Documents%20and%20Settings/the_user/.m2/repository/junit/junit/3.8.1/junit-3.8.1.jar
    [ERROR] urls[6] = file:/C:/Documents%20and%20Settings/the_user/.m2/repository/org/codehaus/plexus/plexus-utils/2.0.5/plexus-utils-2.0.5.jar
    [ERROR] urls[7] = file:/C:/Documents%20and%20Settings/the_user/.m2/repository/org/apache/maven/shared/maven-filtering/1.1/maven-filtering-1.1.jar
    [ERROR] urls[8] = file:/C:/Documents%20and%20Settings/the_user/.m2/repository/org/sonatype/plexus/plexus-build-api/0.0.4/plexus-build-api-0.0.4.jar
    [ERROR] urls[9] = file:/C:/Documents%20and%20Settings/the_user/.m2/repository/org/codehaus/plexus/plexus-interpolation/1.13/plexus-interpolation-1.13.jar
    [ERROR] Number of foreign imports: 1
    [ERROR] import: Entry[import  from realm ClassRealm[maven.api, parent: null]]
    [ERROR] 
    [ERROR] -----------------------------------------------------: org.apache.maven.shared.filtering.MavenFilteringException
    Merci pour votre aide.

  2. #2
    Expert confirmé

    Avatar de denisC
    Profil pro
    Développeur Java
    Inscrit en
    Février 2005
    Messages
    4 050
    Détails du profil
    Informations personnelles :
    Âge : 45
    Localisation : Canada

    Informations professionnelles :
    Activité : Développeur Java
    Secteur : Service public

    Informations forums :
    Inscription : Février 2005
    Messages : 4 050
    Par défaut
    La premiere chose a vérifier est si le fichier :
    C:/Documents%20and%20Settings/the_user/.m2/repository/org/apache/maven/shared/maven-filtering/1.1/maven-filtering-1.1.jar

    Est corompu ou non. Est-ce que tu peux l'ouvrir avec un manageur de zip, comme 7zip? Si non, efface le, et laisse maven le recharger.

  3. #3
    Membre éclairé
    Profil pro
    Inscrit en
    Décembre 2004
    Messages
    759
    Détails du profil
    Informations personnelles :
    Localisation : France

    Informations forums :
    Inscription : Décembre 2004
    Messages : 759
    Par défaut
    Le fichier est normal (43 ko) et s'ouvre bien avec un dézippeur.
    Je l'ai supprimé et laissé maven le retélécharger --> à l'identique.

    Autre piste?
    Merci.

Discussions similaires

  1. Erreur de test
    Par anis50 dans le forum Ruby on Rails
    Réponses: 5
    Dernier message: 24/10/2007, 03h51
  2. Erreur de Test Ogre sur VC++
    Par chebchoub dans le forum Développement 2D, 3D et Jeux
    Réponses: 7
    Dernier message: 03/09/2007, 12h59
  3. message erreur 1er développement
    Par eultartuffe dans le forum C#
    Réponses: 7
    Dernier message: 20/03/2007, 09h38
  4. Erreur de test if(a==b)
    Par scal-80 dans le forum C++
    Réponses: 3
    Dernier message: 21/06/2006, 16h43
  5. message d'erreur sur test module
    Par Daniel MOREAU dans le forum Access
    Réponses: 5
    Dernier message: 23/11/2005, 20h19

Partager

Partager
  • Envoyer la discussion sur Viadeo
  • Envoyer la discussion sur Twitter
  • Envoyer la discussion sur Google
  • Envoyer la discussion sur Facebook
  • Envoyer la discussion sur Digg
  • Envoyer la discussion sur Delicious
  • Envoyer la discussion sur MySpace
  • Envoyer la discussion sur Yahoo