IdentifiantMot de passe
Loading...
Mot de passe oublié ?Je m'inscris ! (gratuit)
Navigation

Inscrivez-vous gratuitement
pour pouvoir participer, suivre les réponses en temps réel, voter pour les messages, poser vos propres questions et recevoir la newsletter

Windev Mobile Discussion :

Erreur lors de la génération d'une application - Zone répétée


Sujet :

Windev Mobile

  1. #1
    Nouveau Candidat au Club
    Homme Profil pro
    Développeur WEB et Administrateur BDD
    Inscrit en
    mai 2022
    Messages
    1
    Détails du profil
    Informations personnelles :
    Sexe : Homme
    Âge : 21
    Localisation : Belgique

    Informations professionnelles :
    Activité : Développeur WEB et Administrateur BDD
    Secteur : Distribution

    Informations forums :
    Inscription : mai 2022
    Messages : 1
    Points : 1
    Points
    1
    Par défaut Erreur lors de la génération d'une application - Zone répétée
    Bonjour,

    J'envoie aujourd'hui un message sur le forum car j'ai besoin d'aide.
    Je suis en train de réaliser, pour la boite dans laquelle je travaille, une application de pointage. Celle-ci permettra aux employés de pouvoir, pour eux, connaître le nombre d'heure qu'ils doivent encore faire pour terminer correctement leurs mois.

    Mon problème est ici, j'ai ajouté une ZRListe sur la page d'accueil qui se remplie quand on clique sur "Entrée" ou "Sortie". Je n'ai pas eu le temps de taper la moindre ligne que lorsque je génère l'application, dès qu'il y a la ZRListe (Qu'elle soit remplie, pas remplie, avec des lignes de programmation, n'importe quoi) l'application ne se génère pas, une erreur avec Gradle survient. Dès que je supprime cette liste, hop, l'application se génère sans problème.

    J'utilise la version 24 de WinDev Mobile.
    Voici l'erreur générée :
    Echec de la création de l'application Android .
    Ligne de commande : "C:\Program Files\Java\jdk-10.0.2\bin\java.exe" -Duser.dir="C:\Mes Projets Mobile\Fency Counting\Android\Gen" "-Dorg.gradle.appname=C:\Mes Projets Mobile\Fency Counting\Android\Gen" -classpath "C:\Users\Labo\AppData\Roaming\PC SOFT\24.0\Android\Gradle\lib\gradle-launcher-4.4.1.jar" org.gradle.launcher.GradleMain assembleDebug -b "C:\Mes Projets Mobile\Fency Counting\Android\Gen\build.gradle"


    Erreur retournée :
    :compileDebugJavaWithJavacC:\Mes Projets Mobile\Fency Counting\Android\Gen\src\com\masociete\fency_counting\wdgen\GWDFFEN_Home.java:968: error: cannot find symbol
    class GWDZR_SansNom1 extends WDZoneRepetee
    ^
    symbol: class WDZoneRepetee
    location: class GWDFFEN_Home
    C:\Mes Projets Mobile\Fency Counting\Android\Gen\src\com\masociete\fency_counting\wdgen\GWDFFEN_Home.java:978: error: cannot find symbol
    super.setRectCompPrincipal(0,0,317,64);
    ^
    (Pleins d'autres erreurs du même style mais on va éviter d'encombrer trop ce poste)


    Note: Some input files use unchecked or unsafe operations.
    Note: Recompile with -Xlint:unchecked for details.
    Note: Some messages have been simplified; recompile with -Xdiags:verbose to get full output
    19 errors
    FAILED

    FAILURE: Build failed with an exception.

    * What went wrong:
    Execution failed for task ':compileDebugJavaWithJavac'.
    Compilation failed; see the compiler error output for details.

    * Try:
    Run with --stacktrace option to get the stack trace. Run with --info or --debug option to get more log output. Run with --scan to get full insights.

    * Get more help at https://help.gradle.org

    BUILD FAILED in 4s
    16 actionable tasks: 6 executed, 10 up-to-date
    Je vous remercie d'avance de votre aide!
    Cordialement,
    NOLAN (Skatoux).

  2. #2
    Membre actif

    Homme Profil pro
    Inscrit en
    juillet 2011
    Messages
    159
    Détails du profil
    Informations personnelles :
    Sexe : Homme
    Localisation : France

    Informations forums :
    Inscription : juillet 2011
    Messages : 159
    Points : 215
    Points
    215
    Billets dans le blog
    1
    Par défaut
    J'avais déjà vu ton message sur un autre forum
    Mais je n'ai jamais eu le problème.
    Essaie de refaire un projet de 0 sur un autre ordinateur de développement
    Juste pour voir si c'est pas problème de fichier temporaire ou un bug dans ton projet.

  3. #3
    Membre expert

    Homme Profil pro
    Développeur informatique
    Inscrit en
    juin 2004
    Messages
    2 218
    Détails du profil
    Informations personnelles :
    Sexe : Homme
    Âge : 47
    Localisation : France, Calvados (Basse Normandie)

    Informations professionnelles :
    Activité : Développeur informatique
    Secteur : High Tech - Éditeur de logiciels

    Informations forums :
    Inscription : juin 2004
    Messages : 2 218
    Points : 3 647
    Points
    3 647
    Par défaut
    Bonjour,

    Peut-être une astuce ici :
    https://forum.pcsoft.fr/fr-FR/pcsoft...spond/read.awp

Discussions similaires

  1. [MVC] Erreur lors intégration Spring MVC sur une application JEE
    Par khaigo dans le forum Spring Web
    Réponses: 0
    Dernier message: 26/06/2011, 18h04
  2. Erreur lors du Run & Debug d'une application
    Par hadler dans le forum NetBeans
    Réponses: 2
    Dernier message: 26/04/2009, 12h37
  3. Erreur lors de l'installation d'une application VB
    Par akesjv dans le forum Installation, Déploiement et Sécurité
    Réponses: 1
    Dernier message: 27/03/2007, 11h41
  4. [.NET 2.0] Erreur lors de l'utilisation d'une application .NET
    Par Jérôme Lambert dans le forum Framework .NET
    Réponses: 6
    Dernier message: 21/11/2006, 15h45
  5. Erreur lors de l'installation d'une application
    Par omlip dans le forum Tomcat et TomEE
    Réponses: 1
    Dernier message: 16/11/2006, 12h21

Partager

Partager
  • Envoyer la discussion sur Viadeo
  • Envoyer la discussion sur Twitter
  • Envoyer la discussion sur Google
  • Envoyer la discussion sur Facebook
  • Envoyer la discussion sur Digg
  • Envoyer la discussion sur Delicious
  • Envoyer la discussion sur MySpace
  • Envoyer la discussion sur Yahoo