{"text_format":"3","workbook":"xlsx","n_sheets":9,"sheets":["STC B2M","SYNTHESE VBA","Modele","MODAA","Détail des achats","Modèle Ach","2501 - 2.22","Par OE","Par OGE"],"not_rendered":{"macros":1,"external_links":3,"defined_names":14,"comments":1},"read":"whole","date_system":"1900"}

{"sheet":"STC B2M","index":0,"n_rows":13,"n_cols":39,"rows_kept":13}
[{"$nulls":27},"TAT visé",11]
[]
[]
[]
[]
["n","Article","Description article","Niveau d'arborescence","Article Parent","Réparabilité","% de réparation","Consommation annuelle","Lieu de réparation",2014,2015,2016,2017,2018,2019,2020,2021,"Total général","Qté deployé","Taux de panne/an","Nombre de pannes / an","Nombre de Def/an","Nombre de Det/an","Nombre de DET1 sur 5 ans","Nbr de DET 2 sur 5 ans (remplacement)","Délai global appro (j)","Délai réparation (j)","Qté besoin composé annuel","Qté besoin Annuel pondéré","Stock Etat","Stock Indus","Stock Magasin","Stock Total avant OA","OA en cours","Stock Total","A acheter","Prix unitaire (€)","Prix Total (€)","Commentaire"]
["STC B2M",826050,"BVC",0,"NA","Oui",{"v":0.95,"d":"95%"},null,"T",274,25,54,69,67,389,{"$f":"IFERROR(VLOOKUP(B7,[2]FTR!$AQ:$AT,3,FALSE),\"\")","v":207},{"$f":"IFERROR(VLOOKUP(B7,[2]FTR!$AQ:$AT,4,FALSE),\"\")","v":33},{"$f":"SUM(J7:Q7)","v":1118},1303,{"$f":"U7/S7","v":{"v":0.10706062931696086,"d":"11%"}},{"$f":"IF((R7-Y7)/8>0,(R7-Y7)/8,1)","v":{"v":139.5,"d":"140"}},171,{"$f":"ROUNDUP(X7/5.5,0)","v":10},54,2,{"$f":"30*10","v":300},2,{"$f":"ROUNDUP(MAX(K7:O7),0)","v":389},{"$f":"IF(IF(AA7>$AC$1,ROUNDUP((AB7/240)*AA7,0),0)+(2*Y7/5)<2,\"2\",IF(AA7>$AC$1,ROUNDUP((AB7/240)*AA7,0),0)+(2*Y7/5))","v":"2"},{"$f":"IFERROR(VLOOKUP('STC B2M'!B7,'[2]Synthese SE'!AI:AK,3,FALSE),0)","v":0},{"$f":"IFERROR(VLOOKUP('STC B2M'!B7,'[2]Synthese stock Indus'!A:C,3,FALSE),0)","v":27},{"$f":"IFERROR(VLOOKUP('STC B2M'!B7,'[2]Stock Magasin'!G:I,3,FALSE),0)","v":28},{"$f":"SUM(AD7:AF7)","v":55},{"$f":"(IFERROR(VLOOKUP('STC B2M'!B7,'[2]OA en cours'!D:I,6,FALSE),0)-IFERROR(VLOOKUP('STC B2M'!B7,'[2]OA en cours'!D:I,7,FALSE),0))","v":0},{"$f":"AG7+AH7","v":55},{"$f":"IF(AC7-AI7<=0,\"Non\",AC7-AI7)","v":"Non"},{"v":980,"d":"980 €"},{"$f":"IFERROR(AJ7*AK7,\"0\")","v":"0"}]
["STC B2M",1000778,"BALISE",0,"NA","Oui",{"v":0.95,"d":"95%"},null,"T",147,89,99,137,106,126,{"$f":"IFERROR(VLOOKUP(B8,[2]FTR!$AQ:$AT,3,FALSE),\"\")","v":139},{"$f":"IFERROR(VLOOKUP(B8,[2]FTR!$AQ:$AT,4,FALSE),\"\")","v":22},{"$f":"SUM(J8:Q8)","v":865},2500,{"$f":"U8/S8","v":{"v":0.04295,"d":"4%"}},{"$f":"IF((R8-Y8)/8>0,(R8-Y8)/8,1)","v":{"v":107.375,"d":"107"}},106,26,141,6,{"$f":"30*14","v":420},10,137,{"v":2.4,"d":"2"},{"$f":"IFERROR(VLOOKUP('STC B2M'!B8,'[2]Synthese SE'!AI:AK,3,FALSE),0)","v":0},{"$f":"IFERROR(VLOOKUP('STC B2M'!B8,'[2]Synthese stock Indus'!A:C,3,FALSE),0)","v":48},{"$f":"IFERROR(VLOOKUP('STC B2M'!B8,'[2]Stock Magasin'!G:I,3,FALSE),0)","v":16},64,{"$f":"(IFERROR(VLOOKUP('STC B2M'!B8,'[2]OA en cours'!D:I,6,FALSE),0)-IFERROR(VLOOKUP('STC B2M'!B8,'[2]OA en cours'!D:I,7,FALSE),0))","v":0},64,"Non",{"v":1789,"d":"1,789 €"},"0"]
{"$rows_left_out":6}
{"sheet":"SYNTHESE VBA","index":1,"n_rows":15,"n_cols":33,"rows_kept":15,"merged":[[1,1,1,13]]}
[]
[null,"STC B2M"]
[]
[]
[]
[null,"SIMULATEURS","Article","Description article","Stock Etat","Stock Indus","Stock Magasin","Stock Initial : Stock Total avant OA","OA en cours","Conso Stock","Stock Final Théorique : Stock Total","Ecart de stock","Stock final réel","Commentaire",{"$nulls":6},"SIMULATEURS","Article","Description article","Stock Etat","Stock Indus","Stock Magasin","Stock Initial : Stock Total avant OA","OA en cours","Conso Stock","Stock Final Théorique : Stock Total","Ecart de stock","Stock final réel","Commentaire"]
[null,"STC B2M",826050,"BVC",{"$f":"IFERROR(VLOOKUP(#REF!,'[2]Synthese SE'!BB:BD,3,FALSE),0)","v":0},{"$f":"IFERROR(VLOOKUP(#REF!,'[2]Synthese stock Indus'!T:V,3,FALSE),0)","v":0},{"$f":"IFERROR(VLOOKUP(#REF!,'[2]Stock Magasin'!Z:AB,3,FALSE),0)","v":0},{"$f":"SUM(X7:Z7)","v":0},{"$f":"(IFERROR(VLOOKUP(#REF!,'[2]OA en cours'!W:AB,6,FALSE),0)-IFERROR(VLOOKUP(#REF!,'[2]OA en cours'!W:AB,7,FALSE),0))","v":0},{"$f":"IFERROR(VLOOKUP(V7,'[2]Suivi Conso Stock DET'!T:V,3,FALSE),0)","v":0},{"$f":"AA7+AB7-AC7","v":0},{"$f":"AD7-AF7","v":0},{"$nulls":8},"STC B2M",826050,"BVC",{"$f":"IFERROR(VLOOKUP(#REF!,'[2]Synthese SE'!BB:BD,3,FALSE),0)","v":0},{"$f":"IFERROR(VLOOKUP(#REF!,'[2]Synthese stock Indus'!T:V,3,FALSE),0)","v":0},{"$f":"IFERROR(VLOOKUP(#REF!,'[2]Stock Magasin'!Z:AB,3,FALSE),0)","v":0},{"$f":"SUM(X7:Z7)","v":0},{"$f":"(IFERROR(VLOOKUP(#REF!,'[2]OA en cours'!W:AB,6,FALSE),0)-IFERROR(VLOOKUP(#REF!,'[2]OA en cours'!W:AB,7,FALSE),0))","v":0},{"$f":"IFERROR(VLOOKUP(V7,'[2]Suivi Conso Stock DET'!T:V,3,FALSE),0)","v":0},{"$f":"AA7+AB7-AC7","v":0},{"$f":"AD7-AF7","v":0}]
[null,"STC B2M",1000778,"BALISE",{"$f":"IFERROR(VLOOKUP(#REF!,'[2]Synthese SE'!BB:BD,3,FALSE),0)","v":0},{"$f":"IFERROR(VLOOKUP(#REF!,'[2]Synthese stock Indus'!T:V,3,FALSE),0)","v":0},{"$f":"IFERROR(VLOOKUP(#REF!,'[2]Stock Magasin'!Z:AB,3,FALSE),0)","v":0},{"$f":"SUM(X8:Z8)","v":0},{"$f":"(IFERROR(VLOOKUP(#REF!,'[2]OA en cours'!W:AB,6,FALSE),0)-IFERROR(VLOOKUP(#REF!,'[2]OA en cours'!W:AB,7,FALSE),0))","v":0},{"$f":"IFERROR(VLOOKUP(V8,'[2]Suivi Conso Stock DET'!T:V,3,FALSE),0)","v":0},{"$f":"AA8+AB8-AC8","v":0},{"$f":"AD8-AF8","v":0},{"$nulls":8},"STC B2M",1000778,"BALISE",{"$f":"IFERROR(VLOOKUP(#REF!,'[2]Synthese SE'!BB:BD,3,FALSE),0)","v":0},{"$f":"IFERROR(VLOOKUP(#REF!,'[2]Synthese stock Indus'!T:V,3,FALSE),0)","v":0},{"$f":"IFERROR(VLOOKUP(#REF!,'[2]Stock Magasin'!Z:AB,3,FALSE),0)","v":0},0,{"$f":"(IFERROR(VLOOKUP(#REF!,'[2]OA en cours'!W:AB,6,FALSE),0)-IFERROR(VLOOKUP(#REF!,'[2]OA en cours'!W:AB,7,FALSE),0))","v":0},{"$f":"IFERROR(VLOOKUP(V8,'[2]Suivi Conso Stock DET'!T:V,3,FALSE),0)","v":0},{"$f":"AA8+AB8-AC8","v":0},{"$f":"AD8-AF8","v":0}]
{"$rows_left_out":8}
{"sheet":"Modele","index":2,"n_rows":8,"n_cols":14,"rows_kept":8}
[]
[]
[]
[]
[]
[null,"SIMULATEURS","Article","Description article","Stock Etat","Stock Indus","Stock Magasin","Stock Initial : Stock Total avant OA","OA en cours","Conso Stock","Stock Final Théorique : Stock Total","Ecart de stock","Stock final réel","Commentaire"]
[{"$nulls":4},{"$f":"IFERROR(VLOOKUP(#REF!,'[2]Synthese SE'!BB:BD,3,FALSE),0)","v":0},{"$f":"IFERROR(VLOOKUP(#REF!,'[2]Synthese stock Indus'!T:V,3,FALSE),0)","v":0},{"$f":"IFERROR(VLOOKUP(#REF!,'[2]Stock Magasin'!Z:AB,3,FALSE),0)","v":0},{"$f":"SUM(X7:Z7)","v":0},{"$f":"(IFERROR(VLOOKUP(#REF!,'[2]OA en cours'!W:AB,6,FALSE),0)-IFERROR(VLOOKUP(#REF!,'[2]OA en cours'!W:AB,7,FALSE),0))","v":0},{"$f":"IFERROR(VLOOKUP(V7,'[2]Suivi Conso Stock DET'!T:V,3,FALSE),0)","v":0},{"$f":"AA7+AB7-AC7","v":0},{"$f":"AD7-AF7","v":0}]
[{"$nulls":4},{"$f":"IFERROR(VLOOKUP(#REF!,'[2]Synthese SE'!BB:BD,3,FALSE),0)","v":0},{"$f":"IFERROR(VLOOKUP(#REF!,'[2]Synthese stock Indus'!T:V,3,FALSE),0)","v":0},{"$f":"IFERROR(VLOOKUP(#REF!,'[2]Stock Magasin'!Z:AB,3,FALSE),0)","v":0},{"$f":"SUM(X8:Z8)","v":0},{"$f":"(IFERROR(VLOOKUP(#REF!,'[2]OA en cours'!W:AB,6,FALSE),0)-IFERROR(VLOOKUP(#REF!,'[2]OA en cours'!W:AB,7,FALSE),0))","v":0},{"$f":"IFERROR(VLOOKUP(V8,'[2]Suivi Conso Stock DET'!T:V,3,FALSE),0)","v":0},{"$f":"AA8+AB8-AC8","v":0},{"$f":"AD8-AF8","v":0}]
{"$rows_left_out":1}
{"sheet":"MODAA","index":3,"n_rows":9,"n_cols":18,"rows_kept":9,"hidden":true,"merged":[[1,1,1,17]]}
[]
[null,"SYNTHESE : STOCK ACTIVITE SOUTIEN"]
[]
[]
[]
[null,"SIMULATEURS","Article","Description article","Stock Etat","Stock Indus","Stock Magasin","Stock Initial : Stock Total avant OA","OA en cours","Conso Stock","Stock Final Théorique : Stock Total","A acheter","Prix unitaire (€)","Prix Total (€)","Ecart de stock","Stock final réel","Ecart de stock","Commentaire"]
[null,"STC B2M",826050,"BVC",{"$f":"IFERROR(VLOOKUP(MODAA!C7,'[2]Synthese SE'!AI:AK,3,FALSE),0)","v":0},{"$f":"IFERROR(VLOOKUP(MODAA!C7,'[2]Synthese stock Indus'!A:C,3,FALSE),0)","v":27},{"$f":"IFERROR(VLOOKUP(MODAA!C7,'[2]Stock Magasin'!G:I,3,FALSE),0)","v":28},{"$f":"SUM(E7:G7)","v":55},{"$f":"(IFERROR(VLOOKUP(MODAA!C7,'[2]OA en cours'!D:I,6,FALSE),0)-IFERROR(VLOOKUP(MODAA!C7,'[2]OA en cours'!D:I,7,FALSE),0))","v":0},{"$f":"IFERROR(VLOOKUP(C7,'[2]Suivi Conso Stock DET'!A:C,3,FALSE),0)","v":0},{"$f":"H7+I7-J7","v":55},{"$f":"IF(#REF!-K7<=0,\"Non\",#REF!-K7)","v":{"$error":"#REF!"}},{"v":980,"d":"980 €"},{"$f":"IFERROR(L7*M7,\"0\")","v":"0"},{"$f":"I7-M7","v":-980},null,{"$f":"K7-O7","v":1035}]
[null,"STC B2M",1000778,"BALISE",{"$f":"IFERROR(VLOOKUP(MODAA!C8,'[2]Synthese SE'!AI:AK,3,FALSE),0)","v":0},{"$f":"IFERROR(VLOOKUP(MODAA!C8,'[2]Synthese stock Indus'!A:C,3,FALSE),0)","v":48},{"$f":"IFERROR(VLOOKUP(MODAA!C8,'[2]Stock Magasin'!G:I,3,FALSE),0)","v":16},64,{"$f":"(IFERROR(VLOOKUP(MODAA!C8,'[2]OA en cours'!D:I,6,FALSE),0)-IFERROR(VLOOKUP(MODAA!C8,'[2]OA en cours'!D:I,7,FALSE),0))","v":0},{"$f":"IFERROR(VLOOKUP(C8,'[2]Suivi Conso Stock DET'!A:C,3,FALSE),0)","v":0},{"$f":"H8+I8-J8","v":64},{"$nulls":3},{"$f":"I8-M8","v":0},null,64]
{"$rows_left_out":2}
{"sheet":"Détail des achats","index":4,"n_rows":90,"n_cols":143,"rows_kept":90,"hidden":true,"merged":[[0,0,0,1],[1,6,1,12],[4,4,4,6],[4,7,4,10],[4,16,4,18],[4,19,4,22],[4,28,4,30],[4,31,4,34],[4,40,4,42],[4,43,4,46],[4,52,4,54],[4,55,4,58],[4,64,4,66],[4,67,4,70],[4,76,4,78],[4,79,4,82],[4,88,4,90],[4,91,4,94],[4,100,4,102],[4,103,4,106],[4,112,4,114],[4,115,4,118],[4,124,4,126],[4,127,4,130],[4,136,4,138],[4,139,4,142]]}
[{"$f":"#REF!","v":{"$error":"#REF!"}}]
[{"$nulls":6},"Détail des achats par OE",{"$nulls":10},"A SUPPRIMER"]
[]
[]
[{"$nulls":4},{"$f":"\"PFA 12/\"&[3]VBA!$P$8","v":"PFA 12/2021"},null,null,{"$f":"\"PFA 01/\"&[3]VBA!$Q$8","v":"PFA 01/2022"},{"$nulls":8},{"$f":"H5","v":"PFA 01/2022"},null,null,{"$f":"\"PFA 02/\"&[3]VBA!$Q$8","v":"PFA 02/2022"},{"$nulls":8},{"$f":"T5","v":"PFA 02/2022"},null,null,{"$f":"\"PFA 03/\"&[3]VBA!$Q$8","v":"PFA 03/2022"},{"$nulls":8},{"$f":"AF5","v":"PFA 03/2022"},null,null,{"$f":"\"PFA 04/\"&[3]VBA!$Q$8","v":"PFA 04/2022"},{"$nulls":8},{"$f":"AR5","v":"PFA 04/2022"},null,null,{"$f":"\"PFA 05/\"&[3]VBA!$Q$8","v":"PFA 05/2022"},{"$nulls":8},{"$f":"BD5","v":"PFA 05/2022"},null,null,{"$f":"\"PFA 06/\"&[3]VBA!$Q$8","v":"PFA 06/2022"},{"$nulls":8},{"$f":"BP5","v":"PFA 06/2022"},null,null,{"$f":"\"PFA 07/\"&[3]VBA!$Q$8","v":"PFA 07/2022"},{"$nulls":8},{"$f":"CB5","v":"PFA 07/2022"},null,null,{"$f":"\"PFA 08/\"&[3]VBA!$Q$8","v":"PFA 08/2022"},{"$nulls":8},{"$f":"CN5","v":"PFA 08/2022"},null,null,{"$f":"\"PFA 09/\"&[3]VBA!$Q$8","v":"PFA 09/2022"},{"$nulls":8},{"$f":"CZ5","v":"PFA 09/2022"},null,null,{"$f":"\"PFA 10/\"&[3]VBA!$Q$8","v":"PFA 10/2022"},{"$nulls":8},{"$f":"DL5","v":"PFA 10/2022"},null,null,{"$f":"\"PFA 11/\"&[3]VBA!$Q$8","v":"PFA 11/2022"},{"$nulls":8},{"$f":"DX5","v":"PFA 11/2022"},null,null,{"$f":"\"PFA 12/\"&[3]VBA!$Q$8","v":"PFA 12/2022"}]
[{"$nulls":4},{"$f":"MONTH(RIGHT(E5,7))","v":12},null,null,{"$f":"MONTH(RIGHT(H5,7))","v":1},null,null,"Ecart",{"$nulls":5},{"$f":"MONTH(RIGHT(Q5,7))","v":1},null,null,{"$f":"MONTH(RIGHT(T5,7))","v":2},null,null,"Ecart",{"$nulls":5},{"$f":"MONTH(RIGHT(AC5,7))","v":2},null,null,{"$f":"MONTH(RIGHT(AF5,7))","v":3},null,null,"Ecart",{"$nulls":5},{"$f":"MONTH(RIGHT(AO5,7))","v":3},null,null,{"$f":"MONTH(RIGHT(AR5,7))","v":4},null,null,"Ecart",{"$nulls":5},{"$f":"MONTH(RIGHT(BA5,7))","v":4},null,null,{"$f":"MONTH(RIGHT(BD5,7))","v":5},null,null,"Ecart",{"$nulls":5},{"$f":"MONTH(RIGHT(BM5,7))","v":5},null,null,{"$f":"MONTH(RIGHT(BP5,7))","v":6},null,null,"Ecart",{"$nulls":5},{"$f":"MONTH(RIGHT(BY5,7))","v":6},null,null,{"$f":"MONTH(RIGHT(CB5,7))","v":7},null,null,"Ecart",{"$nulls":5},{"$f":"MONTH(RIGHT(CK5,7))","v":7},null,null,{"$f":"MONTH(RIGHT(CN5,7))","v":8},null,null,"Ecart",{"$nulls":5},{"$f":"MONTH(RIGHT(CW5,7))","v":8},null,null,{"$f":"MONTH(RIGHT(CZ5,7))","v":9},null,null,"Ecart",{"$nulls":5},{"$f":"MONTH(RIGHT(DI5,7))","v":9},null,null,{"$f":"MONTH(RIGHT(DL5,7))","v":10},null,null,"Ecart",{"$nulls":5},{"$f":"MONTH(RIGHT(DU5,7))","v":10},null,null,{"$f":"MONTH(RIGHT(DX5,7))","v":11},null,null,"Ecart",{"$nulls":5},{"$f":"MONTH(RIGHT(EG5,7))","v":11},null,null,{"$f":"MONTH(RIGHT(EJ5,7))","v":12},null,null,"Ecart"]
["OE",null,"Budget ",null,"Réalisé","RAF ","Total PFA","Réalisé","RAF ","Total PFA","PFA M-1",null,"OE",null,"budget",null,"Réalisé","RAF ","Total PFA","Réalisé","RAF ","Total PFA","PFA M-1",null,"OE",null,"budget",null,"Réalisé","RAF ","Total PFA","Réalisé","RAF ","Total PFA","PFA M-1",null,"OE",null,"budget",null,"Réalisé","RAF ","Total PFA","Réalisé","RAF ","Total PFA","PFA M-1",null,"OE",null,"budget",null,"Réalisé","RAF ","Total PFA","Réalisé","RAF ","Total PFA","PFA M-1",null,"OE",null,"budget",null,"Réalisé","RAF ","Total PFA","Réalisé","RAF ","Total PFA","PFA M-1",null,"OE",null,"budget",null,"Réalisé","RAF ","Total PFA","Réalisé","RAF ","Total PFA","PFA M-1",null,"OE",null,"budget",null,"Réalisé","RAF ","Total PFA","Réalisé","RAF ","Total PFA","PFA M-1",null,"OE",null,"budget",null,"Réalisé","RAF ","Total PFA","Réalisé","RAF ","Total PFA","PFA M-1",null,"OE",null,"budget",null,"Réalisé","RAF ","Total PFA","Réalisé","RAF ","Total PFA","PFA M-1",null,"OE",null,"budget",null,"Réalisé","RAF ","Total PFA","Réalisé","RAF ","Total PFA","PFA M-1",null,"OE",null,"budget",null,"Réalisé","RAF ","Total PFA","Réalisé","RAF ","Total PFA","PFA M-1"]
["22001ATU1","ACHATS",{"$f":"IFERROR(VLOOKUP(A8&B8,#REF!,8,FALSE)/1000,0)","v":{"v":0,"d":"0 k€"}},{"v":0,"d":"0 k€"},{"v":0,"d":"0 k€"},{"$f":"(IFERROR(+INDEX(#REF!,MATCH($A8,#REF!,0),MATCH(LEFT($B8,1),#REF!,0)),0))","v":{"v":0,"d":"0 k€"}},{"$f":"SUM(D8:F8)","v":{"v":0,"d":"0 k€"}},{"v":0,"d":"0 k€"},{"$f":"(IFERROR(+INDEX(#REF!,MATCH($A8,#REF!,0),MATCH(LEFT($B8,1),#REF!,0)),0))","v":{"v":0,"d":"0 k€"}},{"$f":"SUM(H8:I8)","v":{"v":0,"d":"0 k€"}},{"$f":"J8-G8","v":{"v":0,"d":"0 k€"}},null,"22001ATU1","ACHATS",{"$f":"IFERROR(VLOOKUP(M8&N8,#REF!,8,FALSE)/1000,0)","v":{"v":0,"d":"0 k€"}},{"v":0,"d":"0 k€"},{"v":0,"d":"0 k€"},{"$f":"(IFERROR(+INDEX(#REF!,MATCH($A8,#REF!,0),MATCH(LEFT($B8,1),#REF!,0)),0))","v":{"v":0,"d":"0 k€"}},{"$f":"SUM(P8:R8)","v":{"v":0,"d":"0 k€"}},{"v":0,"d":"0 k€"},{"$f":"(IFERROR(+INDEX(#REF!,MATCH($A8,#REF!,0),MATCH(LEFT($B8,1),#REF!,0)),0))","v":{"v":0,"d":"0 k€"}},{"$f":"SUM(T8:U8)","v":{"v":0,"d":"0 k€"}},{"$f":"V8-S8","v":{"v":0,"d":"0 k€"}},null,"22001ATU1","ACHATS",{"$f":"IFERROR(VLOOKUP(Y8&Z8,#REF!,8,FALSE)/1000,0)","v":{"v":0,"d":"0 k€"}},{"v":0,"d":"0 k€"},{"v":0,"d":"0 k€"},{"$f":"(IFERROR(+INDEX(#REF!,MATCH($A8,#REF!,0),MATCH(LEFT($B8,1),#REF!,0)),0))","v":{"v":0,"d":"0 k€"}},{"$f":"SUM(AB8:AD8)","v":{"v":0,"d":"0 k€"}},{"v":0,"d":"0 k€"},{"$f":"(IFERROR(+INDEX(#REF!,MATCH($A8,#REF!,0),MATCH(LEFT($B8,1),#REF!,0)),0))","v":{"v":0,"d":"0 k€"}},{"$f":"SUM(AF8:AG8)","v":{"v":0,"d":"0 k€"}},{"$f":"AH8-AE8","v":{"v":0,"d":"0 k€"}}]
{"$rows_left_out":83}
{"sheet":"Modèle Ach","index":5,"n_rows":12,"n_cols":11,"rows_kept":12,"hidden":true,"merged":[[1,3,1,9],[4,4,4,6],[4,7,4,10]]}
[]
[{"$nulls":3},"Détail des achats par OE"]
[]
[]
[{"$nulls":4},{"$f":"\"PFA 12/\"&[3]VBA!$P$8","v":"PFA 12/2021"},null,null,{"$f":"\"PFA 01/\"&[3]VBA!$Q$8","v":"PFA 01/2022"}]
[{"$nulls":4},{"$f":"MONTH(RIGHT(E5,7))","v":12},null,null,{"$f":"MONTH(RIGHT(H5,7))","v":1},null,null,"Ecart"]
["OE",null,"Budget ",null,"Réalisé","RAF ","Total PFA","Réalisé","RAF ","Total PFA","PFA M-1"]
["22001ATU1","ACHATS",{"$f":"IFERROR(VLOOKUP(A8&B8,#REF!,8,FALSE)/1000,0)","v":{"v":0,"d":"0 k€"}},{"v":0,"d":"0 k€"},{"v":0,"d":"0 k€"},{"$f":"(IFERROR(+INDEX(#REF!,MATCH($A8,#REF!,0),MATCH(LEFT($B8,1),#REF!,0)),0))","v":{"v":0,"d":"0 k€"}},{"$f":"SUM(D8:F8)","v":{"v":0,"d":"0 k€"}},{"v":0,"d":"0 k€"},{"$f":"(IFERROR(+INDEX(#REF!,MATCH($A8,#REF!,0),MATCH(LEFT($B8,1),#REF!,0)),0))","v":{"v":0,"d":"0 k€"}},{"$f":"SUM(H8:I8)","v":{"v":0,"d":"0 k€"}},{"$f":"J8-G8","v":{"v":0,"d":"0 k€"}}]
{"$rows_left_out":5}
{"sheet":"2501 - 2.22","index":6,"n_rows":51,"n_cols":25,"rows_kept":51,"hidden":true,"merged":[[0,2,0,8],[0,10,0,17],[6,18,7,18],[7,2,8,2],[7,3,8,3],[7,4,8,6],[7,8,8,8],[7,9,8,9],[7,10,8,10],[7,13,8,14],[16,11,16,16],[21,13,22,16],[23,13,24,16],[25,13,26,16],[26,1,26,7],[32,1,33,6],[35,10,35,11],[41,2,42,5]]}
[2501,null,{"$f":"CONCATENATE(\"PFA \",Y2)","v":"PFA 31.1.22"},{"$nulls":7},{"$f":"CONCATENATE(\"PFA \",Y4)","v":"PFA 28.2.22"},{"$nulls":13},"dates"]
[null,null,"Réalisé \nN-1","Réalisé \nN","Nb heures\nRAF","MO K€\nRAF","HA K€\nRAF","Provisions","PFA \nTOTAL",null,"Réalisé \nN-1","Réalisé \nN","Nb heures\nRAF","MO K€\nRAF","HA K€\nRAF","Provisions","PFA \nTOTAL",null,"Budget inital ","écart budget ",{"$nulls":4},"31.1.22"]
[]
[null,"P",463,0,null,null,5,null,{"$f":"+C4+D4+F4+G4+H4","v":468},null,{"$f":"C4","v":463},0,null,null,5,null,{"$f":"+K4+L4+N4+O4+P4","v":468},{"$f":"Q4-I4","v":0},567,{"$f":"+Q4-S4","v":-99},{"$nulls":4},"28.2.22"]
[null,"DEV",43,77,53653,5720,2095,1000,{"$f":"+C5+D5+F5+G5+H5","v":8935},null,{"$f":"C5","v":43},{"v":194.65,"d":"195"},{"$f":"47897+4610","v":52507},5599,{"$f":"875+1107+75+53","v":2110},1000,{"$f":"+K5+L5+N5+O5+P5","v":{"v":8946.65,"d":"8947"}},{"$f":"Q5-I5","v":{"v":11.649999999999636,"d":"12"}},8938,{"$f":"+Q5-S5","v":{"v":8.649999999999636,"d":"9"}}]
[]
[]
[null,null,"Heures théoriques consommées",{"$f":"CONCATENATE(\"Heures réalisées entre le \",Y2,\" et le \",Y4)","v":"Heures réalisées entre le 31.1.22 et le 28.2.22"},"Ecart à justifier",{"$nulls":3},"HA théoriques consommés",{"$f":"CONCATENATE(\"HA réalisés entre le \",Y2,\" et le \",Y4)","v":"HA réalisés entre le 31.1.22 et le 28.2.22"},"Ecart à justifier",null,null,"Ecart Provisions"]
{"$rows_left_out":44}
{"sheet":"Par OE","index":7,"n_rows":34,"n_cols":12,"rows_kept":34,"hidden":true,"merged":[[2,3,2,6],[2,7,2,11]]}
[2501]
[]
[null,null,"Quantité Heures","PFA 31.1.2022",{"$nulls":3},"PFA 28.2.2022"]
[null,null,"Budget ",{"$nulls":3},"Ecart",{"$nulls":3},"Ecart ","Ecart"]
[{"$nulls":3},"Réalisé","RAF ","Total PFA","Budget","Réalisé","RAF ","Total PFA","Budget","PFA M-1"]
[null,null,{"$f":"SUM(C7:C17)","v":{"v":4142,"d":"4,142.00 "}},{"$f":"SUM(D7:D17)","v":{"v":549.6,"d":"549.60 "}},{"$f":"SUM(E7:E17)","v":{"v":3520,"d":"3,520.00 "}},{"$f":"+D6+E6","v":{"v":4069.6,"d":"4,069.60 "}},{"$f":"F6-C6","v":{"v":-72.40000000000009,"d":"-72.40 "}},{"$f":"SUM(H7:H17)","v":{"v":821.3,"d":"821.30 "}},{"$f":"SUM(I7:I17)","v":{"v":2443,"d":"2,443.00 "}},{"$f":"+H6+I6","v":{"v":3264.3,"d":"3,264.30 "}},{"$f":"J6-C6","v":{"v":-877.6999999999998,"d":"-877.70 "}},{"$f":"J6-F6","v":{"v":-805.2999999999997,"d":"-805.30 "}}]
["25011CONP","ETE",{"v":555,"d":"555.00 "},{"v":59.6,"d":"59.60 "},{"v":420,"d":"420.00 "},{"$f":"+D7+E7","v":{"v":479.6,"d":"479.60 "}},{"$f":"F7-C7","v":{"v":-75.39999999999998,"d":"-75.40 "}},{"v":58.6,"d":"58.60 "},{"v":430,"d":"430.00 "},{"$f":"+H7+I7","v":{"v":488.6,"d":"488.60 "}},{"$f":"J7-C7","v":{"v":-66.39999999999998,"d":"-66.40 "}},{"$f":"J7-F7","v":{"v":9,"d":"9.00 "}}]
["25011CONP","ETL",{"v":1340,"d":"1,340.00 "},{"v":275.6,"d":"275.60 "},{"v":1630,"d":"1,630.00 "},{"$f":"+D8+E8","v":{"v":1905.6,"d":"1,905.60 "}},{"v":565.5999999999999,"d":"565.60 "},{"v":355.8000000000002,"d":"355.80 "},{"v":980,"d":"980.00 "},{"v":1335.8000000000002,"d":"1,335.80 "},{"v":-4.199999999999818,"d":"-4.20 "},{"v":-569.7999999999997,"d":"-569.80 "}]
{"$rows_left_out":27}
{"sheet":"Par OGE","index":8,"n_rows":34,"n_cols":12,"rows_kept":34,"hidden":true,"merged":[[0,3,0,10],[1,3,1,10],[4,3,4,6],[4,7,4,11],[15,3,15,6],[15,7,15,11]]}
[2501]
[]
[]
[]
[{"$nulls":3},"PFA 31.1.2022",{"$nulls":3},"PFA 28.2.2022"]
[null,"Budget ","Réalisé N-1",{"$nulls":3},"Ecart",{"$nulls":3},"Ecart ","Ecart"]
[{"$nulls":3},"Réalisé","RAF ","Total PFA","Budget","Réalisé","RAF ","Total PFA","Budget","PFA M-1"]
["MO (heures en k€]",{"v":5864,"d":"5,864 "},43,77,5720,{"$f":"SUM(C8:E8)","v":5840},{"$f":"+F8-B8","v":{"v":-24,"d":"-24 "}},190,5599,{"$f":"SUM(H8:I8)+$C$8","v":5832},{"$f":"+J8-B8","v":{"v":-32,"d":"-32 "}},{"$f":"J8-F8","v":{"v":-8,"d":"-8 "}}]
{"$rows_left_out":26}