{"text_format":"3","workbook":"xlsx","n_sheets":7,"sheets":["MENU","MODALITES","CODE","FCM_MàJ","FCM_Data","RtionProjet_MàJ","RtionProjet_Data"],"not_rendered":{"images":1,"macros":1,"defined_names":4},"read":"whole","date_system":"1900"}

{"sheet":"MENU","index":0,"n_rows":16,"n_cols":8,"rows_kept":16,"merged":[[0,0,0,10],[2,0,2,10],[4,0,4,10]]}
["Projet d'Agriculture Contractuelle et Transition Ecologique - PACTE"]
[]
["APPLICATION DE SUIVI EVALUATION PACTE SSE"]
[]
["REALISATION"]
["MENU :"]
[]
[null,"PROJET :"]
[null,null,"Gestion des Rapports Mensuels : "]
[{"$nulls":3},"Mise à jour RM :",{"$nulls":3},"Fichier RM :"]
[]
[]
[{"$nulls":3},"Dossier Mise à Jour :"]
[]
[null,null,"Réalisation :"]
[{"$nulls":3},"Requète MàJ",{"$nulls":3},"Données :"]

{"sheet":"MODALITES","index":1,"n_rows":31,"n_cols":13,"rows_kept":31}
["MODALITE"]
[]
[null,"Objectif :"]
[null,null,"1) ","Mettre à jour la table des Rapport Mensuel"]
[null,null,"2)","Mettre à jour les 3 bases de données des indicateurs de Réalisation pour C1, C2 et C3 (XX)"]
[{"$nulls":3},"A noter : XX = C1 ou C2 dans les lignes suivantes"]
[]
[null,null,"1) ","Table des FCM - Mise à Jour"]
[{"$nulls":3},"Le mécanisme s'appuie sur la mise à jour de la feuille Maj_Rap_Mensuel"]
[{"$nulls":4},"a) Sélectionner l'année et le mois du rapport"]
[{"$nulls":4},"b) Indiquer  la date, Si Date <> vide => Oui",{"$nulls":7},"Automatiset Si date => Oui"]
[{"$nulls":4},"c) Ajouter cette feuille de mise à jour dans la feuille \"Rap_Mensuel\" avec le bouton \"Actualiser\""]
[{"$nulls":3},"A noter : En cas de réception après la date limite, faire la mise à jour directement dans la table \"Rap_Mensuel\""]
[{"$nulls":3},"Formule \"Oui\" en référence standard!"]
[]
[null,null,"2)","Table C1, C2 et C3?"]
[{"$nulls":3},"Le mécanisme s'appuie sur la consolidation automatique des feuilles de Mise à Jour mensuelle dans une table \"Réalisation_XX_MaJ - Bouton Actualisation"]
[{"$nulls":4},"* Collecter les feuilles de Mise à Jour mensuelle et les stocker dans le répertoire C:\\PACTE_SSE\\B-DATA\\REALISATION\\Réalisation_XX_MaJ"]
[{"$nulls":4},"* Consolider ces feuilles MaJ dans la feuille \"Réalisation_XX_MaJ\" avec le bouton \"Consolidation\" (Requête Dossier)"]
[{"$nulls":4},"* Ajouter cette feuille à la table \"D_XX\" avec le bouton \"Actualisation\""]
[]
[null,"Titre des colonnes :"]
[null,null,"A Remplir :"]
[{"$nulls":3},"Vert Fluo =","Taper le texte"]
[{"$nulls":3},"Vert Foncé =","A créer"]
[{"$nulls":3},"Jaune =","Liste déroulante"]
[{"$nulls":4},"Note : Certaines listes déroulantes sont à 2 niveaux pour faciliter l'identification du code Ex : Région => Province => Commune"]
[null,null,"Ne pas remplir :"]
[{"$nulls":3},"Orange =","Ne pas remplir Formule automatique"]
[{"$nulls":3},"Blanc = ","Ne pas modifier"]
{"$rows_left_out":2}
{"sheet":"CODE","index":2,"n_rows":21,"n_cols":10,"rows_kept":21}
["CODIFICATION"]
[]
[]
["FEUILLE DE COLLECTE MENSUELLE (FCM)"]
[]
[null,"ANNEE",null,"MOIS",null,"STATUT",null,"DATE","Date","Fériés"]
[null,2019,null,"Janvier",null,"Programmé",null,"2022-01-01","Samedi 1er janvier","Nouvel An"]
[null,2020,null,"Février",null,"Réalisé",null,"2022-01-03","Lundi 3 janvier","Soulèvement populaire"]
[null,2021,null,"Mars",{"$nulls":3},"2022-03-08","Mardi 8 mars","Journée internationale de la femme"]
[null,2022,null,"Avril",{"$nulls":3},"2022-04-18","Lundi 18 avril","Lundi de pâques"]
[null,2023,null,"Mai",{"$nulls":3},"2022-05-02","Lundi 2 mai","Jour de congé pour fête de travail"]
[{"$nulls":3},"Juin",{"$nulls":3},"2022-05-03","Mardi 3 mai","Aid el-filtr"]
[{"$nulls":3},"Juillet",{"$nulls":3},"2022-05-26","Jeudi 26 mai","Ascension"]
[{"$nulls":3},"Août",{"$nulls":3},"2022-07-11","Lundi 11 juillet","Jour de congé pour Tabaski"]
[{"$nulls":3},"Septembre",{"$nulls":3},"2022-08-05","Jeudi 5 aout","Fête nationale"]
[{"$nulls":3},"Octobre",{"$nulls":3},"2022-08-15","Lundi 15 aout","Assomption"]
[{"$nulls":3},"Novembre",{"$nulls":3},"2022-10-08","Samedi 8 octobre","Mouloud"]
[{"$nulls":3},"Décembre",{"$nulls":3},"2022-10-31","Lundi 31 octobre","Martyrs Day"]
[{"$nulls":7},"2022-11-01","Mardi 1er novembre","Toussaint"]
[{"$nulls":7},"2022-12-12","Lundi 12 décembre","Jour de congé pour proclamation d’indépendance"]
[{"$nulls":7},"2022-12-26","Lundi 26 décembre","Jour de congé pour noël"]

{"sheet":"FCM_MàJ","index":3,"n_rows":43,"n_cols":11,"rows_kept":43,"merged":[[0,0,0,8]]}
["SUIVI DES FEUILLES DE COLLECTE MENSUELLES - FCM -"]
[]
[{"$nulls":5},"ANNEE","MOIS",null,"Statut","Réception jusqu'au :"]
[{"$nulls":5},2022,"Mai",null,"Réalisé",null,{"$f":"WORKDAY(F8,5,DATE[DATE])","v":"2022-06-07"}]
[]
[]
["N°","COMPOSANTE","ID_PROJET","PROJET","ACRONYME","DATE","FCM","Statut","DATE_FCM"]
[null,"C1","P1101","Projet d'intensification de la production et la commercialisation du riz et du maïs ","PPIC-RIMA",{"$f":"IFERROR(DATE(FCM_MàJ!$F$4,MONTH(1&FCM_MàJ!$G$4)+1,1)-1,\"\")","v":"2022-05-31"},{"$f":"IF(I8>F8,\"Oui\",\"\")","v":""},{"$f":"$I$4","v":"Réalisé"},null,null,"Si Date RM avant la date du rapport"]
[null,"C1","P1102","Projet d’agriculture contractuelle pour une intensification écologique de la production du maïs","ACPEM",{"$f":"IFERROR(DATE(FCM_MàJ!$F$4,MONTH(1&FCM_MàJ!$G$4)+1,1)-1,\"\")","v":"2022-05-31"},{"$f":"IF(I9>F9,\"Oui\",\"\")","v":""},"Réalisé"]
[null,"C1","P1103","Projet d’Appui aux Petits Exploitants Agricoles","PAPEA-3K",{"$f":"IFERROR(DATE(FCM_MàJ!$F$4,MONTH(1&FCM_MàJ!$G$4)+1,1)-1,\"\")","v":"2022-05-31"},"","Réalisé",null,null,"Si Date RM après la date limite"]
[null,"C1","P1104","Projet de production et de commercialisation du Maîs du Nayala","PROCOMAN",{"$f":"IFERROR(DATE(FCM_MàJ!$F$4,MONTH(1&FCM_MàJ!$G$4)+1,1)-1,\"\")","v":"2022-05-31"},"","Réalisé"]
[null,"C1","P1105","Projet d’Appui à la Commercialisation du Riz local et à la promotion de l’Agriculture Ecologique dans la province du Boulgou (PACRAEB)","PACRAEB",{"$f":"IFERROR(DATE(FCM_MàJ!$F$4,MONTH(1&FCM_MàJ!$G$4)+1,1)-1,\"\")","v":"2022-05-31"},"","Réalisé"]
[null,"C1","P2101","Projet d’appui à l’agriculture durable et contractuelle dans la province du Bam","P2AEC",{"$f":"IFERROR(DATE(FCM_MàJ!$F$4,MONTH(1&FCM_MàJ!$G$4)+1,1)-1,\"\")","v":"2022-05-31"},"","Réalisé"]
[null,"C1","P2102","Projet de Développement de la Riziculture Contractuelle Agro-écologique par le renforcement des capacités des parties prenantes","PDRCA",{"$f":"IFERROR(DATE(FCM_MàJ!$F$4,MONTH(1&FCM_MàJ!$G$4)+1,1)-1,\"\")","v":"2022-05-31"},"","Réalisé"]
[null,"C1","P2103","Projet d’appui à la production durable et de commercialisation du Niébé au Burkina Faso","PADCN",{"$f":"IFERROR(DATE(FCM_MàJ!$F$4,MONTH(1&FCM_MàJ!$G$4)+1,1)-1,\"\")","v":"2022-05-31"},"","Réalisé"]
[null,"C1","P2104","Projet d’appui à l’agriculture durable et contractuelle dans la province du Sanmatenga","PADC",{"$f":"IFERROR(DATE(FCM_MàJ!$F$4,MONTH(1&FCM_MàJ!$G$4)+1,1)-1,\"\")","v":"2022-05-31"},"","Réalisé"]
[null,"C1","P2105","Projet d’Amélioration de la Productivité et de la Compétitivité de la filière lait local dans la province du Seno","KSS",{"$f":"IFERROR(DATE(FCM_MàJ!$F$4,MONTH(1&FCM_MàJ!$G$4)+1,1)-1,\"\")","v":"2022-05-31"},"","Réalisé"]
[null,"C1","P2106","Projet Filière Innovante et Croissance Inclusive de l'Economie Locale","FICIEL",{"$f":"IFERROR(DATE(FCM_MàJ!$F$4,MONTH(1&FCM_MàJ!$G$4)+1,1)-1,\"\")","v":"2022-05-31"},"","Réalisé"]
[null,"C2","P1201","Projet d’accroissement de la disponibilité alimentaire ","PADIAC",{"$f":"IFERROR(DATE(FCM_MàJ!$F$4,MONTH(1&FCM_MàJ!$G$4)+1,1)-1,\"\")","v":"2022-05-31"},"","Réalisé"]
[null,"C2","P1202","Agriculture contractuelle pour une intensification écologique de la production du riz ","ACPER",{"$f":"IFERROR(DATE(FCM_MàJ!$F$4,MONTH(1&FCM_MàJ!$G$4)+1,1)-1,\"\")","v":"2022-05-31"},"","Réalisé"]
[null,"C2","P1203","Projet Contrats Durables pour le Riz des Hauts Bassins","PCD-RHB",{"$f":"IFERROR(DATE(FCM_MàJ!$F$4,MONTH(1&FCM_MàJ!$G$4)+1,1)-1,\"\")","v":"2022-05-31"},"","Réalisé"]
[null,"C2","P1204","Projet de développement des chaînes de valeur maïs Industriel intégrant Systèmes d’Agriculture Contractuelle, d’Agro-écologiques et Financiers durables dans les régions des Hauts Bassins et des Cascades (PISAAF)","PISAAF",{"$f":"IFERROR(DATE(FCM_MàJ!$F$4,MONTH(1&FCM_MàJ!$G$4)+1,1)-1,\"\")","v":"2022-05-31"},"","Réalisé"]
[null,"C2","P1205","Projet Maïs SNK 2778 ","SN K 2778",{"$f":"IFERROR(DATE(FCM_MàJ!$F$4,MONTH(1&FCM_MàJ!$G$4)+1,1)-1,\"\")","v":"2022-05-31"},"","Réalisé"]
[null,"C2","P1206","Projet de renforcement de la professionnalisation des acteurs de la filière karité","PRPAK",{"$f":"IFERROR(DATE(FCM_MàJ!$F$4,MONTH(1&FCM_MàJ!$G$4)+1,1)-1,\"\")","v":"2022-05-31"},"","Réalisé"]
[null,"C2","P1207","Projet de renforcement de la production de maïs et la contractualisation ","PROMAC",{"$f":"IFERROR(DATE(FCM_MàJ!$F$4,MONTH(1&FCM_MàJ!$G$4)+1,1)-1,\"\")","v":"2022-05-31"},"","Réalisé"]
[null,"C2","P2201","Projet production Durable et Contractualisation dans la filière Karité","PROCKA",{"$f":"IFERROR(DATE(FCM_MàJ!$F$4,MONTH(1&FCM_MàJ!$G$4)+1,1)-1,\"\")","v":"2022-05-31"},"","Réalisé"]
[null,"C2","P2202","Projet d’agriculture contractuelle pour un développement durable et équitable de la filière anacarde","PACDEFA",{"$f":"IFERROR(DATE(FCM_MàJ!$F$4,MONTH(1&FCM_MàJ!$G$4)+1,1)-1,\"\")","v":"2022-05-31"},"","Réalisé"]
[null,"C2","P2203","Projet d’Intensification de la Production Agroécologique et de la Transformation de l’Arachide au Burkina Faso","PIPATA",{"$f":"IFERROR(DATE(FCM_MàJ!$F$4,MONTH(1&FCM_MàJ!$G$4)+1,1)-1,\"\")","v":"2022-05-31"},"","Réalisé"]
[null,"C2","P2204","Projet d’intensification de la production et de la commercialisation du manioc sous contrat","PACOM",{"$f":"IFERROR(DATE(FCM_MàJ!$F$4,MONTH(1&FCM_MàJ!$G$4)+1,1)-1,\"\")","v":"2022-05-31"},"","Réalisé"]
[null,"C2","P2205","Projet de renforcement des relations contractuelles entre les collectrices d’amandes et Olvea Burkina","PACOK",{"$f":"IFERROR(DATE(FCM_MàJ!$F$4,MONTH(1&FCM_MàJ!$G$4)+1,1)-1,\"\")","v":"2022-05-31"},"","Réalisé"]
{"$rows_left_out":14}
{"sheet":"FCM_Data","index":4,"n_rows":5,"n_cols":12,"rows_kept":5}
[]
[]
[]
["N°","COMPOSANTE","ID_PROJET","PROJET","ACRONYME","DATE","FCM","STATUT","DATE_FCM",null,"DATE","FCM"]
[{"$nulls":10},44681,{"$error":"#VALUE!"}]

{"sheet":"RtionProjet_MàJ","index":5,"n_rows":115,"n_cols":29,"rows_kept":115}
[]
[]
[]
[]
["Colonne1","ANNEE","MOIS","DATE MaJ","STATUT","COMPOSANTE","ID_PROJET","ACRONYME","ID_INDIC","REALISATION","SOUS_REALISATION","INDICATEUR","INTITULE","TYPE","ID_BENEFICIAIRE","BENEFICIAIRE","LATITUDE","LONGITUDE","UNITE","NOMBRE","DIMENSION","JOUR","PARTIC_PROG","FEMME<35","HOMME<35","FEMME>35","HOMME>35","CFA PACTE","CFA BENEF"]
[null,2021,"Août","2021-08-31","Réalisé","C2","P1201","PADIAC",null,"INFRASTRUCTURE","Bâtiment","Boutique BISMA","xxxxx","Construction","VEND_72","URCEA/BMH",null,null,"m²",999,0,{"$nulls":6},0,0]
[null,2021,"Août","2021-08-31","Réalisé","C2","P1201","PADIAC",null,"INFRASTRUCTURE","Bâtiment","Boutique BISMA","xxxxxx","Construction","VEND_73","U.R.S.COOP-C.P.A./BHM)",null,null,"m²",0,0,{"$nulls":6},0,0]
[null,2021,"Août","2021-08-31","Réalisé","C2","P1201","PADIAC",null,"INFRASTRUCTURE","Bâtiment","Boutique BISMA","xxxxxx","Réhabilitation","VEND_70","Association «Vanoussan » de Sayaro",null,null,"m²",1,100,{"$nulls":6},99959]
[null,2021,"Août","2021-08-31","Réalisé","C2","P1201","PADIAC",null,"INFRASTRUCTURE","Bâtiment","Boutique BISMA","xxxxxx","Réhabilitation","VEND_71","Association Bwawese Centre d’Appui à la Gestion des Exploitations Familiales",null,null,"m²",null,0,{"$nulls":6},0,0]
[null,2021,"Août","2021-08-31","Réalisé","C2","P1201","PADIAC",null,"INFRASTRUCTURE","Bâtiment","Magasin de stockage","xxxxxx","Construction","VEND_72","URCEA/BMH",null,null,"m²",null,0,{"$nulls":6},0,0]
[null,2021,"Août","2021-08-31","Réalisé","C2","P1201","PADIAC",null,"INFRASTRUCTURE","Bâtiment","Magasin de stockage","xxxxxx","Construction","VEND_73","U.R.S.COOP-C.P.A./BHM)",null,null,"m²",null,0,{"$nulls":6},0,0]
[null,2021,"Août","2021-08-31","Réalisé","C2","P1201","PADIAC",null,"INFRASTRUCTURE","Bâtiment","Magasin de stockage","xxxxxx","Construction",{"$nulls":4},"m²",null,100,{"$nulls":6},0]
[null,2021,"Août","2021-08-31","Réalisé","C2","P1201","PADIAC",null,"INFRASTRUCTURE","Bâtiment","Magasin de stockage","xxxxxx","Construction",{"$nulls":4},"m²",null,0,{"$nulls":6},0,0]
[null,2021,"Août","2021-08-31","Réalisé","C2","P1201","PADIAC",null,"INFRASTRUCTURE","Bâtiment","Magasin de stockage","xxxxxx","Construction",{"$nulls":4},"m²",null,0,{"$nulls":6},0,0]
[null,2021,"Août","2021-08-31","Réalisé","C2","P1201","PADIAC",null,"INFRASTRUCTURE","Bâtiment","Magasin de stockage","xxxxxx","Construction",{"$nulls":4},"m²",null,0,{"$nulls":6},0,0]
[null,2021,"Août","2021-08-31","Réalisé","C2","P1201","PADIAC",null,"INFRASTRUCTURE","Bâtiment","Magasin de stockage","xxxxxx","Construction",{"$nulls":4},"m²",null,0,{"$nulls":6},0,0]
[null,2021,"Août","2021-08-31","Réalisé","C2","P1201","PADIAC",null,"INFRASTRUCTURE","Bâtiment","Magasin de stockage","xxxxxx","Construction",{"$nulls":4},"m²",null,0,{"$nulls":6},0,0]
[null,2021,"Août","2021-08-31","Réalisé","C2","P1201","PADIAC",null,"INFRASTRUCTURE","Bâtiment","Magasin de stockage","xxxxxx","Construction",{"$nulls":4},"m²",0,0,{"$nulls":6},0,0]
[null,2021,"Août","2021-08-31","Réalisé","C2","P1201","PADIAC",null,"INFRASTRUCTURE","Bâtiment","Magasin de stockage","xxxxxx","Construction",{"$nulls":4},"m²",0,0,{"$nulls":6},0,0]
[null,2021,"Août","2021-08-31","Réalisé","C2","P1201","PADIAC",null,"INFRASTRUCTURE","Bâtiment","Magasin de stockage","xxxxxx","Construction",{"$nulls":4},"m²",0,0,{"$nulls":6},0,0]
[null,2021,"Août","2021-08-31","Réalisé","C2","P1201","PADIAC",null,"INFRASTRUCTURE","Bâtiment","Magasin de stockage","xxxxxx","Construction",{"$nulls":4},"m²",1,100,{"$nulls":6},0]
[null,2021,"Août","2021-08-31","Réalisé","C2","P1201","PADIAC",null,"INFRASTRUCTURE","Bâtiment","Magasin de stockage","xxxxxx","Construction",{"$nulls":4},"m²",0,0,{"$nulls":6},0,0]
[null,2021,"Août","2021-08-31","Réalisé","C2","P1201","PADIAC",null,"INFRASTRUCTURE","Bâtiment","Magasin de stockage","xxxxxx","Construction",{"$nulls":4},"m²",0,0,{"$nulls":6},0,0]
[null,2021,"Août","2021-08-31","Réalisé","C2","P1201","PADIAC",null,"INFRASTRUCTURE","Autres","Aire de séchage","xxxxxx","Construction",{"$nulls":4},"m²",0,0,{"$nulls":6},0,0]
[null,2021,"Août","2021-08-31","Réalisé","C2","P1201","PADIAC",null,"INFRASTRUCTURE","Autres","Aire de séchage","xxxxxx","Construction",{"$nulls":4},"m²",1,100,{"$nulls":6},0]
[null,2021,"Août","2021-08-31","Réalisé","C2","P1201","PADIAC",null,"INFRASTRUCTURE","Autres","Aire de séchage","xxxxxx","Construction",{"$nulls":4},"m²",0,0,{"$nulls":6},0,0]
[null,2021,"Août","2021-08-31","Réalisé","C2","P1201","PADIAC",null,"INFRASTRUCTURE","Autres","Aire de séchage","xxxxxx","Construction",{"$nulls":4},"m²",0,0,{"$nulls":6},0,0]
[null,2021,"Août","2021-08-31","Réalisé","C2","P1201","PADIAC",null,"INFRASTRUCTURE","Autres","Aire de séchage","xxxxxx","Construction",{"$nulls":4},"m²",0,0,{"$nulls":6},0,0]
[null,2021,"Août","2021-08-31","Réalisé","C2","P1201","PADIAC",null,"INFRASTRUCTURE","Autres","Aire de séchage","xxxxxx","Construction",{"$nulls":4},"m²",0,0,{"$nulls":6},0,0]
[null,2021,"Août","2021-08-31","Réalisé","C2","P1201","PADIAC",null,"INFRASTRUCTURE","Autres","Aire de séchage","xxxxxx","Construction",{"$nulls":4},"m²",0,0,{"$nulls":6},0,0]
{"$rows_left_out":86}
{"sheet":"RtionProjet_Data","index":6,"n_rows":462,"n_cols":29,"rows_kept":462}
[]
[]
[]
["N°","ANNEE","MOIS","DATE_MaJ","STATUT","COMPOSANTE","ID_PROJET","ACRONYME","ID_INDIC","REALISATION","SOUS_REALISATION","INDICATEUR","INTITULE","TYPE","ID_BENEFICIAIRE","BENEFICIAIRE","LATITUDE","LONGITUDE","UNITE","NOMBRE","DIMENSION","JOUR","PARTIC_PROG","FEMME<35","HOMME<35","FEMME>35","HOMME>35","CFA PACTE","CFA BENEF"]
[1,2021,"Août","2021-08-31","Réalisé","C2","P1201","PADIAC",null,"INFRASTRUCTURE","Bâtiment","Boutique BISMA","xxxxx","Construction","VEND_72","URCEA/BMH",null,null,"m²",999,0,{"$nulls":6},0,0]
[2,2021,"Août","2021-08-31","Réalisé","C2","P1201","PADIAC",null,"INFRASTRUCTURE","Bâtiment","Boutique BISMA","xxxxxx","Construction","VEND_73","U.R.S.COOP-C.P.A./BHM)",null,null,"m²",0,0,{"$nulls":6},0,0]
[3,2021,"Août","2021-08-31","Réalisé","C2","P1201","PADIAC",null,"INFRASTRUCTURE","Bâtiment","Boutique BISMA","xxxxxx","Réhabilitation","VEND_70","Association «Vanoussan » de Sayaro",null,null,"m²",1,100,{"$nulls":6},99959]
[4,2021,"Août","2021-08-31","Réalisé","C2","P1201","PADIAC",null,"INFRASTRUCTURE","Bâtiment","Boutique BISMA","xxxxxx","Réhabilitation","VEND_71","Association Bwawese Centre d’Appui à la Gestion des Exploitations Familiales",null,null,"m²",0,0,{"$nulls":6},0,0]
[5,2021,"Août","2021-08-31","Réalisé","C2","P1201","PADIAC",null,"INFRASTRUCTURE","Bâtiment","Magasin de stockage","xxxxxx","Construction","VEND_72","URCEA/BMH",null,null,"m²",0,0,{"$nulls":6},0,0]
[6,2021,"Août","2021-08-31","Réalisé","C2","P1201","PADIAC",null,"INFRASTRUCTURE","Bâtiment","Magasin de stockage","xxxxxx","Construction","VEND_73","U.R.S.COOP-C.P.A./BHM)",null,null,"m²",0,0,{"$nulls":6},0,0]
[7,2021,"Août","2021-08-31","Réalisé","C2","P1201","PADIAC",null,"INFRASTRUCTURE","Bâtiment","Magasin de stockage","xxxxxx","Construction",{"$nulls":4},"m²",1,100,{"$nulls":6},0]
[8,2021,"Août","2021-08-31","Réalisé","C2","P1201","PADIAC",null,"INFRASTRUCTURE","Bâtiment","Magasin de stockage","xxxxxx","Construction",{"$nulls":4},"m²",0,0,{"$nulls":6},0,0]
[9,2021,"Août","2021-08-31","Réalisé","C2","P1201","PADIAC",null,"INFRASTRUCTURE","Bâtiment","Magasin de stockage","xxxxxx","Construction",{"$nulls":4},"m²",0,0,{"$nulls":6},0,0]
[10,2021,"Août","2021-08-31","Réalisé","C2","P1201","PADIAC",null,"INFRASTRUCTURE","Bâtiment","Magasin de stockage","xxxxxx","Construction",{"$nulls":4},"m²",0,0,{"$nulls":6},0,0]
[11,2021,"Août","2021-08-31","Réalisé","C2","P1201","PADIAC",null,"INFRASTRUCTURE","Bâtiment","Magasin de stockage","xxxxxx","Construction",{"$nulls":4},"m²",0,0,{"$nulls":6},0,0]
[12,2021,"Août","2021-08-31","Réalisé","C2","P1201","PADIAC",null,"INFRASTRUCTURE","Bâtiment","Magasin de stockage","xxxxxx","Construction",{"$nulls":4},"m²",0,0,{"$nulls":6},0,0]
[13,2021,"Août","2021-08-31","Réalisé","C2","P1201","PADIAC",null,"INFRASTRUCTURE","Bâtiment","Magasin de stockage","xxxxxx","Construction",{"$nulls":4},"m²",0,0,{"$nulls":6},0,0]
[14,2021,"Août","2021-08-31","Réalisé","C2","P1201","PADIAC",null,"INFRASTRUCTURE","Bâtiment","Magasin de stockage","xxxxxx","Construction",{"$nulls":4},"m²",0,0,{"$nulls":6},0,0]
[15,2021,"Août","2021-08-31","Réalisé","C2","P1201","PADIAC",null,"INFRASTRUCTURE","Bâtiment","Magasin de stockage","xxxxxx","Construction",{"$nulls":4},"m²",0,0,{"$nulls":6},0,0]
[16,2021,"Août","2021-08-31","Réalisé","C2","P1201","PADIAC",null,"INFRASTRUCTURE","Bâtiment","Magasin de stockage","xxxxxx","Construction",{"$nulls":4},"m²",1,100,{"$nulls":6},0]
[17,2021,"Août","2021-08-31","Réalisé","C2","P1201","PADIAC",null,"INFRASTRUCTURE","Bâtiment","Magasin de stockage","xxxxxx","Construction",{"$nulls":4},"m²",0,0,{"$nulls":6},0,0]
[18,2021,"Août","2021-08-31","Réalisé","C2","P1201","PADIAC",null,"INFRASTRUCTURE","Bâtiment","Magasin de stockage","xxxxxx","Construction",{"$nulls":4},"m²",0,0,{"$nulls":6},0,0]
[19,2021,"Août","2021-08-31","Réalisé","C2","P1201","PADIAC",null,"INFRASTRUCTURE","Autres","Aire de séchage","xxxxxx","Construction",{"$nulls":4},"m²",0,0,{"$nulls":6},0,0]
[20,2021,"Août","2021-08-31","Réalisé","C2","P1201","PADIAC",null,"INFRASTRUCTURE","Autres","Aire de séchage","xxxxxx","Construction",{"$nulls":4},"m²",1,100,{"$nulls":6},0]
[21,2021,"Août","2021-08-31","Réalisé","C2","P1201","PADIAC",null,"INFRASTRUCTURE","Autres","Aire de séchage","xxxxxx","Construction",{"$nulls":4},"m²",0,0,{"$nulls":6},0,0]
[22,2021,"Août","2021-08-31","Réalisé","C2","P1201","PADIAC",null,"INFRASTRUCTURE","Autres","Aire de séchage","xxxxxx","Construction",{"$nulls":4},"m²",0,0,{"$nulls":6},0,0]
[23,2021,"Août","2021-08-31","Réalisé","C2","P1201","PADIAC",null,"INFRASTRUCTURE","Autres","Aire de séchage","xxxxxx","Construction",{"$nulls":4},"m²",0,0,{"$nulls":6},0,0]
[24,2021,"Août","2021-08-31","Réalisé","C2","P1201","PADIAC",null,"INFRASTRUCTURE","Autres","Aire de séchage","xxxxxx","Construction",{"$nulls":4},"m²",0,0,{"$nulls":6},0,0]
[25,2021,"Août","2021-08-31","Réalisé","C2","P1201","PADIAC",null,"INFRASTRUCTURE","Autres","Aire de séchage","xxxxxx","Construction",{"$nulls":4},"m²",0,0,{"$nulls":6},0,0]
[26,2021,"Août","2021-08-31","Réalisé","C2","P1201","PADIAC",null,"INFRASTRUCTURE","Autres","Aire de séchage","xxxxxx","Construction",{"$nulls":4},"m²",0,0,{"$nulls":6},0,0]
{"$rows_left_out":432}