{"text_format":"3","workbook":"xlsx","n_sheets":13,"sheets":["Janvier","Février","Mars","Avril","Mai","Juin","Juillet","Août","Septembre","Octobre","Novembre","Décembre","Nom accés "],"not_rendered":{"macros":1},"read":"whole","date_system":"1900"}

{"sheet":"Janvier","index":0,"n_rows":310,"n_cols":11,"rows_kept":310,"merged":[[0,0,0,9],[1,0,1,9],[4,0,4,9],[9,1,9,8],[50,0,50,9],[51,0,51,9],[54,0,54,9],[59,1,59,8],[93,0,93,9],[94,0,94,9],[97,0,97,9],[102,1,102,8],[103,1,103,2],[103,5,103,6],[137,0,137,9],[138,0,138,9],[141,0,141,10],[146,1,146,8],[147,1,147,2],[147,5,147,6],[180,0,180,9],[181,0,181,9],[184,0,184,9],[189,1,189,8],[190,1,190,2],[190,5,190,6],[223,0,223,9],[224,0,224,9],[227,0,227,9],[232,1,232,8],[233,1,233,2],[233,5,233,6],[267,0,267,9],[268,0,268,9],[271,0,271,9],[276,1,276,8],[277,1,277,2],[277,5,277,6]]}
[]
["Relevé des températures"]
[]
[]
["2020-01-01"]
[{"$nulls":5},"Document de référence :","Directives_Frigos"]
[null,"Fréquence =>",null,null,"le matin et le soir :","Relevé des températures "]
[]
[]
[null,"Congélateur cuisine",{"$nulls":7},"Mesure"]
["Valeurs \ncibles =>","Minimum  -15° C                                                                                ",null," Maximum -22°C    ",null,"Minimum  -15° C                                                                                  ",null,"Maximum -22°C          ",null,"en cas de température\nNon-conforme","Visa responsable"]
["Date","Heure","T°","Résultat","Visa","Heure","T°","Résultat","Visa"]
["2021-01-01",{"$f":"IF(C13=\"\",\"\",MAINTENANT)","v":{"$error":"#NAME?"}},{"v":12,"d":"-12°C"},{"$f":"IF(C13>15,\"OK\",\"Contacter le chef\")","v":"Contacter le chef"},"Julien",{"$f":"IF(G13=\"\",\"\",IF(F13<>\"\",F13,NOW()))","v":""},{"v":18,"d":"-18°C"},{"$f":"IF(G13>15,\"OK\",\"Contacter le chef\")","v":"OK"}]
[{"$f":"A13+1","v":"2021-01-02"},{"$f":"IF(C14=\"\",\"\",IF(B14<>\"\",B14,NOW()))","v":"00:00:00"},{"v":14,"d":"-14°C"},{"$f":"IF(C14>15,\"OK\",\"Contacter le chef\")","v":"Contacter le chef"},null,"",null,{"$f":"IF(G14>15,\"OK\",\"Contacter le chef\")","v":"Contacter le chef"}]
[{"$f":"A14+1","v":"2021-01-03"},{"$f":"IF(C15=\"\",\"\",IF(B15<>\"\",B15,NOW()))","v":""},null,"Contacter le chef",null,"",null,"Contacter le chef"]
["2021-01-04","",null,"Contacter le chef",null,"",null,"Contacter le chef"]
["2021-01-05","",null,"Contacter le chef",null,"",null,"Contacter le chef"]
["2021-01-06","",null,"Contacter le chef",null,"",null,"Contacter le chef"]
["2021-01-07","",null,"Contacter le chef",null,"",null,"Contacter le chef"]
["2021-01-08","",null,"Contacter le chef",null,"",null,"Contacter le chef"]
["2021-01-09","",null,"Contacter le chef",null,"",null,"Contacter le chef"]
["2021-01-10","",null,"Contacter le chef",null,"",null,"Contacter le chef"]
["2021-01-11","",null,"Contacter le chef",null,"",null,"Contacter le chef"]
["2021-01-12","",null,"Contacter le chef",null,"",null,"Contacter le chef"]
["2021-01-13","",null,"Contacter le chef",null,"",null,"Contacter le chef"]
["2021-01-14","",null,"Contacter le chef",null,"",null,"Contacter le chef"]
["2021-01-15","",null,"Contacter le chef",null,"",null,"Contacter le chef"]
["2021-01-16","",null,"Contacter le chef",null,"",null,"Contacter le chef"]
["2021-01-17","",null,"Contacter le chef",null,"",null,"Contacter le chef"]
["2021-01-18","",null,"Contacter le chef",null,"",null,"Contacter le chef"]
["2021-01-19","",null,"Contacter le chef",null,"",null,"Contacter le chef"]
["2021-01-20","",null,"Contacter le chef",null,"",null,"Contacter le chef"]
["2021-01-21","",null,"Contacter le chef",null,"",null,"Contacter le chef"]
["2021-01-22","",null,"Contacter le chef",null,"",null,"Contacter le chef"]
["2021-01-23","",null,"Contacter le chef",null,"",null,"Contacter le chef"]
["2021-01-24","",null,"Contacter le chef",null,"",null,"Contacter le chef"]
[{"$f":"A36+1","v":"2021-01-25"},"",null,"Contacter le chef",null,"",null,"Contacter le chef"]
[{"$f":"A37+1","v":"2021-01-26"},"",null,"Contacter le chef",null,"",null,"Contacter le chef"]
["2021-01-27","",null,"Contacter le chef",null,"",null,"Contacter le chef"]
["2021-01-28","",null,"Contacter le chef",null,"",null,"Contacter le chef"]
["2021-01-29","",null,"Contacter le chef",null,"",null,"Contacter le chef"]
["2021-01-30","",null,"Contacter le chef",null,"",null,"Contacter le chef"]
[{"$f":"A42+1","v":"2021-01-31"},"",null,"Contacter le chef",null,"",null,"Contacter le chef"]
[]
[null,"Contrôle"]
[null,"Signature"]
[]
[]
[]
[]
[]
["Relevé des températures"]
[]
[]
[{"$f":"A5","v":"2020-01-01"}]
[{"$nulls":5},"Document de référence :","Directives_Frigos"]
[null,"Fréquence =>",null,null,"le matin et le soir :","Relevé des températures et contrôle des rangements"]
[]
[]
[null,"Congélateur S/Sol",{"$nulls":7},"Mesure"]
["Valeurs \ncibles =>","Minimum  -15° C                                                                                ",null," Maximum -22°C    ",null,"Minimum  -15° C                                                                                  ",null,"Maximum -22°C          ",null,"en cas de température\nNon-conforme","Visa responsable"]
["Date","Heure","T°","Résultat","Visa","Heure","T°","Résultat","Visa"]
["2021-01-01",{"$f":"IF(C63=\"\",\"\",IF(B63<>\"\",B63,NOW()))","v":""},null,{"$f":"IF(C63>15,\"OK\",\"Contacter le chef\")","v":"Contacter le chef"},null,{"$f":"IF(G63=\"\",\"\",IF(F63<>\"\",F63,NOW()))","v":""},null,{"$f":"IF(G63>15,\"OK\",\"Contacter le chef\")","v":"Contacter le chef"}]
[{"$f":"A63+1","v":"2021-01-02"},"",null,{"$f":"IF(C64>15,\"OK\",\"Contacter le chef\")","v":"Contacter le chef"},null,"",null,{"$f":"IF(G64>15,\"OK\",\"Contacter le chef\")","v":"Contacter le chef"}]
[{"$f":"A64+1","v":"2021-01-03"},"",null,"Contacter le chef",null,"",null,"Contacter le chef"]
["2021-01-04","",null,"Contacter le chef",null,"",null,"Contacter le chef"]
["2021-01-05","",null,"Contacter le chef",null,"",null,"Contacter le chef"]
["2021-01-06","",null,"Contacter le chef",null,"",null,"Contacter le chef"]
["2021-01-07","",null,"Contacter le chef",null,"",null,"Contacter le chef"]
["2021-01-08","",null,"Contacter le chef",null,"",null,"Contacter le chef"]
["2021-01-09","",null,"Contacter le chef",null,"",null,"Contacter le chef"]
["2021-01-10","",null,"Contacter le chef",null,"",null,"Contacter le chef"]
["2021-01-11","",null,"Contacter le chef",null,"",null,"Contacter le chef"]
["2021-01-12","",null,"Contacter le chef",null,"",null,"Contacter le chef"]
["2021-01-13","",null,"Contacter le chef",null,"",null,"Contacter le chef"]
["2021-01-14","",null,"Contacter le chef",null,"",null,"Contacter le chef"]
["2021-01-15","",null,"Contacter le chef",null,"",null,"Contacter le chef"]
["2021-01-16","",null,"Contacter le chef",null,"",null,"Contacter le chef"]
["2021-01-17","",null,"Contacter le chef",null,"",null,"Contacter le chef"]
["2021-01-18","",null,"Contacter le chef",null,"",null,"Contacter le chef"]
["2021-01-19","",null,"Contacter le chef",null,"",null,"Contacter le chef"]
["2021-01-20","",null,"Contacter le chef",null,"",null,"Contacter le chef"]
["2021-01-21","",null,"Contacter le chef",null,"",null,"Contacter le chef"]
["2021-01-22","",null,"Contacter le chef",null,"",null,"Contacter le chef"]
["2021-01-23","",null,"Contacter le chef",null,"",null,"Contacter le chef"]
["2021-01-24","",null,"Contacter le chef",null,"",null,"Contacter le chef"]
[{"$f":"A86+1","v":"2021-01-25"},"",null,"Contacter le chef",null,"",null,"Contacter le chef"]
[{"$f":"A87+1","v":"2021-01-26"},"",null,"Contacter le chef",null,"",null,"Contacter le chef"]
["2021-01-27","",null,"Contacter le chef",null,"",null,"Contacter le chef"]
["2021-01-28","",null,"Contacter le chef",null,"",null,"Contacter le chef"]
["2021-01-29","",null,"Contacter le chef",null,"",null,"Contacter le chef"]
["2021-01-30","",null,"Contacter le chef",null,"",null,"Contacter le chef"]
[{"$f":"A92+1","v":"2021-01-31"},"",null,"Contacter le chef",null,"",null,"Contacter le chef"]
[]
["Relevé des températures"]
[]
[]
[{"$f":"A5","v":"2020-01-01"}]
[{"$nulls":5},"Document de référence :","Directives_Frigos"]
[null,"Fréquence =>",null,null,"le matin et le soir :","Relevé des températures et contrôle des rangements"]
[]
[]
[null,"Frigo cuisine",{"$nulls":7},"Mesure"]
["Valeurs \ncibles =>","Minimum  7° C                                                                                ",null," Maximum 3°C    ",null,"Minimum  7° C                                                                                ",null," Maximum 3°C    ",null,"en cas de température\nNon-conforme","Visa responsable"]
["Date","Heure","T°","Résultat","Visa","Heure","T°","Résultat","Visa"]
["2021-01-01",{"$f":"IF(C106=\"\",\"\",IF(B106<>\"\",B106,NOW()))","v":""},null,{"$f":"IF(C106<8,\"OK\",\"Contacter le chef\")","v":"OK"},null,{"$f":"IF(G106=\"\",\"\",IF(F106<>\"\",F106,NOW()))","v":""},null,{"$f":"IF(G106<8,\"OK\",\"Contacter le chef\")","v":"OK"}]
[{"$f":"A106+1","v":"2021-01-02"},"",null,"OK",null,"",null,"OK"]
[{"$f":"A107+1","v":"2021-01-03"},"",null,"OK",null,"",null,"OK"]
["2021-01-04","",null,"OK",null,"",null,"OK"]
["2021-01-05","",null,"OK",null,"",null,"OK"]
["2021-01-06","",null,"OK",null,"",null,"OK"]
["2021-01-07","",null,"OK",null,"",null,"OK"]
["2021-01-08","",null,"OK",null,"",null,"OK"]
["2021-01-09","",null,"OK",null,"",null,"OK"]
["2021-01-10","",null,"OK",null,"",null,"OK"]
["2021-01-11","",null,"OK",null,"",null,"OK"]
["2021-01-12","",null,"OK",null,"",null,"OK"]
["2021-01-13","",null,"OK",null,"",null,"OK"]
["2021-01-14","",null,"OK",null,"",null,"OK"]
["2021-01-15","",null,"OK",null,"",null,"OK"]
["2021-01-16","",null,"OK",null,"",null,"OK"]
["2021-01-17","",null,"OK",null,"",null,"OK"]
["2021-01-18","",null,"OK",null,"",null,"OK"]
["2021-01-19","",null,"OK",null,"",null,"OK"]
["2021-01-20","",null,"OK",null,"",null,"OK"]
["2021-01-21","",null,"OK",null,"",null,"OK"]
["2021-01-22","",null,"OK",null,"",null,"OK"]
["2021-01-23","",null,"OK",null,"",null,"OK"]
["2021-01-24","",null,"OK",null,"",null,"OK"]
[{"$f":"A129+1","v":"2021-01-25"},"",null,"OK",null,"",null,"OK"]
[{"$f":"A130+1","v":"2021-01-26"},"",null,"OK",null,"",null,"OK"]
["2021-01-27","",null,"OK",null,"",null,"OK"]
["2021-01-28","",null,"OK",null,"",null,"OK"]
["2021-01-29","",null,"OK",null,"",null,"OK"]
["2021-01-30","",null,"OK",null,"",null,"OK"]
[{"$f":"A135+1","v":"2021-01-31"},"",null,"OK",null,"",null,"OK"]
[]
[]
["Relevé des températures"]
[]
[]
[{"$f":"A98","v":"2020-01-01"}]
[{"$nulls":5},"Document de référence :","Directives_Frigos"]
[null,"Fréquence =>",null,null,"le matin et le soir :","Relevé des températures et contrôle des rangements"]
[]
[]
[null,"Frigo MEP",{"$nulls":7},"Mesure"]
["Valeurs \ncibles =>","Minimum  7° C                                                                                ",null," Maximum 3°C    ",null,"Minimum  7° C                                                                                ",null," Maximum 3°C    ",null,"en cas de température\nNon-conforme","Visa responsable"]
["Date","Heure","T°","Résultat","Visa","Heure","T°","Résultat","Visa"]
["2021-01-01",{"$f":"IF(C150=\"\",\"\",IF(B150<>\"\",B150,NOW()))","v":""},null,{"$f":"IF(C150<8,\"OK\",\"Contacter le chef\")","v":"OK"},null,{"$f":"IF(G150=\"\",\"\",IF(F150<>\"\",F150,NOW()))","v":""},null,{"$f":"IF(G150<8,\"OK\",\"Contacter le chef\")","v":"OK"}]
[{"$f":"A150+1","v":"2021-01-02"},"",null,"OK",null,"",null,"OK"]
[{"$f":"A151+1","v":"2021-01-03"},"",null,"OK",null,"",null,"OK"]
["2021-01-04","",null,"OK",null,"",null,"OK"]
["2021-01-05","",null,"OK",null,"",null,"OK"]
["2021-01-06","",null,"OK",null,"",null,"OK"]
["2021-01-07","",null,"OK",null,"",null,"OK"]
["2021-01-08","",null,"OK",null,"",null,"OK"]
["2021-01-09","",null,"OK",null,"",null,"OK"]
["2021-01-10","",null,"OK",null,"",null,"OK"]
["2021-01-11","",null,"OK",null,"",null,"OK"]
["2021-01-12","",null,"OK",null,"",null,"OK"]
["2021-01-13","",null,"OK",null,"",null,"OK"]
["2021-01-14","",null,"OK",null,"",null,"OK"]
["2021-01-15","",null,"OK",null,"",null,"OK"]
["2021-01-16","",null,"OK",null,"",null,"OK"]
["2021-01-17","",null,"OK",null,"",null,"OK"]
["2021-01-18","",null,"OK",null,"",null,"OK"]
["2021-01-19","",null,"OK",null,"",null,"OK"]
["2021-01-20","",null,"OK",null,"",null,"OK"]
["2021-01-21","",null,"OK",null,"",null,"OK"]
["2021-01-22","",null,"OK",null,"",null,"OK"]
["2021-01-23","",null,"OK",null,"",null,"OK"]
["2021-01-24","",null,"OK",null,"",null,"OK"]
[{"$f":"A173+1","v":"2021-01-25"},"",null,"OK",null,"",null,"OK"]
[{"$f":"A174+1","v":"2021-01-26"},"",null,"OK",null,"",null,"OK"]
["2021-01-27","",null,"OK",null,"",null,"OK"]
["2021-01-28","",null,"OK",null,"",null,"OK"]
["2021-01-29","",null,"OK",null,"",null,"OK"]
["2021-01-30","",null,"OK",null,"",null,"OK"]
[{"$f":"A179+1","v":"2021-01-31"},"",null,"OK",null,"",null,"OK"]
[]
["Relevé des températures"]
[]
[]
[{"$f":"A142","v":"2020-01-01"}]
[{"$nulls":5},"Document de référence :","Directives_Frigos"]
[null,"Fréquence =>",null,null,"le matin et le soir :","Relevé des températures et contrôle des rangements"]
[]
[]
[null,"Frigo pâtisserie",{"$nulls":7},"Mesure"]
["Valeurs \ncibles =>","Minimum  7° C                                                                                ",null," Maximum 3°C    ",null,"Minimum  7° C                                                                                ",null," Maximum 3°C    ",null,"en cas de température\nNon-conforme","Visa responsable"]
["Date","Heure","T°","Résultat","Visa","Heure","T°","Résultat","Visa"]
["2021-01-01",{"$f":"IF(C193=\"\",\"\",IF(B193<>\"\",B193,NOW()))","v":""},null,{"$f":"IF(C193<8,\"OK\",\"Contacter le chef\")","v":"OK"},null,{"$f":"IF(G193=\"\",\"\",IF(F193<>\"\",F193,NOW()))","v":""},null,{"$f":"IF(G193<8,\"OK\",\"Contacter le chef\")","v":"OK"}]
[{"$f":"A193+1","v":"2021-01-02"},"",null,"OK",null,"",null,"OK"]
[{"$f":"A194+1","v":"2021-01-03"},"",null,"OK",null,"",null,"OK"]
["2021-01-04","",null,"OK",null,"",null,"OK"]
["2021-01-05","",null,"OK",null,"",null,"OK"]
["2021-01-06","",null,"OK",null,"",null,"OK"]
["2021-01-07","",null,"OK",null,"",null,"OK"]
["2021-01-08","",null,"OK",null,"",null,"OK"]
["2021-01-09","",null,"OK",null,"",null,"OK"]
["2021-01-10","",null,"OK",null,"",null,"OK"]
["2021-01-11","",null,"OK",null,"",null,"OK"]
["2021-01-12","",null,"OK",null,"",null,"OK"]
["2021-01-13","",null,"OK",null,"",null,"OK"]
["2021-01-14","",null,"OK",null,"",null,"OK"]
["2021-01-15","",null,"OK",null,"",null,"OK"]
["2021-01-16","",null,"OK",null,"",null,"OK"]
["2021-01-17","",null,"OK",null,"",null,"OK"]
["2021-01-18","",null,"OK",null,"",null,"OK"]
["2021-01-19","",null,"OK",null,"",null,"OK"]
["2021-01-20","",null,"OK",null,"",null,"OK"]
["2021-01-21","",null,"OK",null,"",null,"OK"]
["2021-01-22","",null,"OK",null,"",null,"OK"]
["2021-01-23","",null,"OK",null,"",null,"OK"]
["2021-01-24","",null,"OK",null,"",null,"OK"]
[{"$f":"A216+1","v":"2021-01-25"},"",null,"OK",null,"",null,"OK"]
[{"$f":"A217+1","v":"2021-01-26"},"",null,"OK",null,"",null,"OK"]
["2021-01-27","",null,"OK",null,"",null,"OK"]
["2021-01-28","",null,"OK",null,"",null,"OK"]
["2021-01-29","",null,"OK",null,"",null,"OK"]
["2021-01-30","",null,"OK",null,"",null,"OK"]
[{"$f":"A222+1","v":"2021-01-31"},"",null,"OK",null,"",null,"OK"]
[]
["Relevé des températures"]
[]
[]
[{"$f":"A185","v":"2020-01-01"}]
[{"$nulls":5},"Document de référence :","Directives_Frigos"]
[null,"Fréquence =>",null,null,"le matin et le soir :","Relevé des températures et contrôle des rangements"]
[]
[]
[null,"Frigo produits laitiers",{"$nulls":7},"Mesure"]
["Valeurs \ncibles =>","Minimum  7° C                                                                                ",null," Maximum 3°C    ",null,"Minimum  7° C                                                                                ",null," Maximum 3°C    ",null,"en cas de température\nNon-conforme","Visa responsable"]
["Date","Heure","T°","Résultat","Visa","Heure","T°","Résultat","Visa"]
["2021-01-01",{"$f":"IF(C236=\"\",\"\",IF(B236<>\"\",B236,NOW()))","v":""},null,{"$f":"IF(C236<8,\"OK\",\"Contacter le chef\")","v":"OK"},null,{"$f":"IF(G236=\"\",\"\",IF(F236<>\"\",F236,NOW()))","v":""},null,{"$f":"IF(G236<8,\"OK\",\"Contacter le chef\")","v":"OK"}]
[{"$f":"A236+1","v":"2021-01-02"},"",null,"OK",null,"",null,"OK"]
[{"$f":"A237+1","v":"2021-01-03"},"",null,"OK",null,"",null,"OK"]
["2021-01-04","",null,"OK",null,"",null,"OK"]
["2021-01-05","",null,"OK",null,"",null,"OK"]
["2021-01-06","",null,"OK",null,"",null,"OK"]
["2021-01-07","",null,"OK",null,"",null,"OK"]
["2021-01-08","",null,"OK",null,"",null,"OK"]
["2021-01-09","",null,"OK",null,"",null,"OK"]
["2021-01-10","",null,"OK",null,"",null,"OK"]
["2021-01-11","",null,"OK",null,"",null,"OK"]
["2021-01-12","",null,"OK",null,"",null,"OK"]
["2021-01-13","",null,"OK",null,"",null,"OK"]
["2021-01-14","",null,"OK",null,"",null,"OK"]
["2021-01-15","",null,"OK",null,"",null,"OK"]
["2021-01-16","",null,"OK",null,"",null,"OK"]
["2021-01-17","",null,"OK",null,"",null,"OK"]
["2021-01-18","",null,"OK",null,"",null,"OK"]
["2021-01-19","",null,"OK",null,"",null,"OK"]
["2021-01-20","",null,"OK",null,"",null,"OK"]
["2021-01-21","",null,"OK",null,"",null,"OK"]
["2021-01-22","",null,"OK",null,"",null,"OK"]
["2021-01-23","",null,"OK",null,"",null,"OK"]
["2021-01-24","",null,"OK",null,"",null,"OK"]
[{"$f":"A259+1","v":"2021-01-25"},"",null,"OK",null,"",null,"OK"]
[{"$f":"A260+1","v":"2021-01-26"},"",null,"OK",null,"",null,"OK"]
["2021-01-27","",null,"OK",null,"",null,"OK"]
["2021-01-28","",null,"OK",null,"",null,"OK"]
["2021-01-29","",null,"OK",null,"",null,"OK"]
["2021-01-30","",null,"OK",null,"",null,"OK"]
[{"$f":"A265+1","v":"2021-01-31"},"",null,"OK",null,"",null,"OK"]
[]
[]
["Relevé des températures"]
[]
[]
[{"$f":"A228","v":"2020-01-01"}]
[{"$nulls":5},"Document de référence :","Directives_Frigos"]
[null,"Fréquence =>",null,null,"le matin et le soir :","Relevé des températures et contrôle des rangements"]
[]
[]
[null,"Frigo S/Sol",{"$nulls":7},"Mesure"]
["Valeurs \ncibles =>","Minimum  7° C                                                                                ",null," Maximum 3°C    ",null,"Minimum  7° C                                                                                ",null," Maximum 3°C    ",null,"en cas de température\nNon-conforme","Visa responsable"]
["Date","Heure","T°","Résultat","Visa","Heure","T°","Résultat","Visa"]
["2021-01-01",{"$f":"IF(C280=\"\",\"\",IF(B280<>\"\",B280,NOW()))","v":""},null,{"$f":"IF(C280<8,\"OK\",\"Contacter le chef\")","v":"OK"},null,{"$f":"IF(G280=\"\",\"\",IF(F280<>\"\",F280,NOW()))","v":""},null,{"$f":"IF(G280<8,\"OK\",\"Contacter le chef\")","v":"OK"}]
[{"$f":"A280+1","v":"2021-01-02"},"",null,{"$f":"IF(C281<8,\"OK\",\"Contacter le chef\")","v":"OK"},null,"",null,"OK"]
[{"$f":"A281+1","v":"2021-01-03"},"",null,"OK",null,"",null,"OK"]
["2021-01-04","",null,"OK",null,"",null,"OK"]
["2021-01-05","",null,"OK",null,"",null,"OK"]
["2021-01-06","",null,"OK",null,"",null,"OK"]
["2021-01-07","",null,"OK",null,"",null,"OK"]
["2021-01-08","",null,"OK",null,"",null,"OK"]
["2021-01-09","",null,"OK",null,"",null,"OK"]
["2021-01-10","",null,"OK",null,"",null,"OK"]
["2021-01-11","",null,"OK",null,"",null,"OK"]
["2021-01-12","",null,"OK",null,"",null,"OK"]
["2021-01-13","",null,"OK",null,"",null,"OK"]
["2021-01-14","",null,"OK",null,"",null,"OK"]
["2021-01-15","",null,"OK",null,"",null,"OK"]
["2021-01-16","",null,"OK",null,"",null,"OK"]
["2021-01-17","",null,"OK",null,"",null,"OK"]
["2021-01-18","",null,"OK",null,"",null,"OK"]
["2021-01-19","",null,"OK",null,"",null,"OK"]
["2021-01-20","",null,"OK",null,"",null,"OK"]
["2021-01-21","",null,"OK",null,"",null,"OK"]
["2021-01-22","",null,"OK",null,"",null,"OK"]
["2021-01-23","",null,"OK",null,"",null,"OK"]
["2021-01-24","",null,"OK",null,"",null,"OK"]
[{"$f":"A303+1","v":"2021-01-25"},"",null,"OK",null,"",null,"OK"]
[{"$f":"A304+1","v":"2021-01-26"},"",null,"OK",null,"",null,"OK"]
["2021-01-27","",null,"OK",null,"",null,"OK"]
["2021-01-28","",null,"OK",null,"",null,"OK"]
["2021-01-29","",null,"OK",null,"",null,"OK"]
["2021-01-30","",null,"OK",null,"",null,"OK"]
[{"$f":"A309+1","v":"2021-01-31"},"",null,"OK",null,"",null,"OK"]

{"sheet":"Février","index":1,"n_rows":310,"n_cols":11,"rows_kept":310,"merged":[[0,0,0,9],[1,0,1,9],[4,0,4,9],[9,1,9,8],[50,0,50,9],[51,0,51,9],[54,0,54,9],[59,1,59,8],[93,0,93,9],[94,0,94,9],[97,0,97,9],[102,1,102,8],[103,1,103,2],[103,5,103,6],[137,0,137,9],[138,0,138,9],[141,0,141,10],[146,1,146,8],[147,1,147,2],[147,5,147,6],[180,0,180,9],[181,0,181,9],[184,0,184,9],[189,1,189,8],[190,1,190,2],[190,5,190,6],[223,0,223,9],[224,0,224,9],[227,0,227,9],[232,1,232,8],[233,1,233,2],[233,5,233,6],[267,0,267,9],[268,0,268,9],[271,0,271,9],[276,1,276,8],[277,1,277,2],[277,5,277,6]]}
[]
["Relevé des températures"]
[]
[]
["2021-02-02"]
[{"$nulls":5},"Document de référence :","Directives_Frigos"]
[null,"Fréquence =>",null,null,"le matin et le soir :","Relevé des températures "]
[]
[]
[null,"Congélateur cuisine",{"$nulls":7},"Mesure"]
["Valeurs \ncibles =>","Minimum  -15° C                                                                                ",null," Maximum -22°C    ",null,"Minimum  -15° C                                                                                  ",null,"Maximum -22°C          ",null,"en cas de température\nNon-conforme","Visa responsable"]
["Date","Heure","T°","Résultat","Visa","Heure","T°","Résultat","Visa"]
["2021-01-01",{"$f":"IF(C13=\";\",IF(B13<>\"\",B13,NOW()))","v":false},{"v":23,"d":"-23°C"},{"$f":"IF(C13>15,\"OK\",\"Contacter le chef\")","v":"OK"},null,{"$f":"IF(G13=\"\",\"\",IF(F13<>\"\",F13,NOW()))","v":""},{"v":23,"d":"-23°C"},{"$f":"IF(G13>15,\"OK\",\"Contacter le chef\")","v":"OK"}]
[{"$f":"A13+1","v":"2021-01-02"},{"$f":"IF(C14=\"\",\"\",IF(B14<>\"\",B14,NOW()))","v":""},null,{"$f":"IF(C14>15,\"OK\",\"Contacter le chef\")","v":"Contacter le chef"},null,"",null,{"$f":"IF(G14>15,\"OK\",\"Contacter le chef\")","v":"Contacter le chef"}]
[{"$f":"A14+1","v":"2021-01-03"},"",null,"Contacter le chef",null,"",null,"Contacter le chef"]
["2021-01-04","",null,"Contacter le chef",null,"",null,"Contacter le chef"]
["2021-01-05","",null,"Contacter le chef",null,"",null,"Contacter le chef"]
["2021-01-06","",null,"Contacter le chef",null,"",null,"Contacter le chef"]
["2021-01-07","",null,"Contacter le chef",null,"",null,"Contacter le chef"]
["2021-01-08","",null,"Contacter le chef",null,"",null,"Contacter le chef"]
["2021-01-09","",null,"Contacter le chef",null,"",null,"Contacter le chef"]
["2021-01-10","",null,"Contacter le chef",null,"",null,"Contacter le chef"]
["2021-01-11","",null,"Contacter le chef",null,"",null,"Contacter le chef"]
["2021-01-12","",null,"Contacter le chef",null,"",null,"Contacter le chef"]
["2021-01-13","",null,"Contacter le chef",null,"",null,"Contacter le chef"]
["2021-01-14","",null,"Contacter le chef",null,"",null,"Contacter le chef"]
["2021-01-15","",null,"Contacter le chef",null,"",null,"Contacter le chef"]
["2021-01-16","",null,"Contacter le chef",null,"",null,"Contacter le chef"]
["2021-01-17","",null,"Contacter le chef",null,"",null,"Contacter le chef"]
["2021-01-18","",null,"Contacter le chef",null,"",null,"Contacter le chef"]
["2021-01-19","",null,"Contacter le chef",null,"",null,"Contacter le chef"]
["2021-01-20","",null,"Contacter le chef",null,"",null,"Contacter le chef"]
["2021-01-21","",null,"Contacter le chef",null,"",null,"Contacter le chef"]
["2021-01-22","",null,"Contacter le chef",null,"",null,"Contacter le chef"]
["2021-01-23","",null,"Contacter le chef",null,"",null,"Contacter le chef"]
["2021-01-24","",null,"Contacter le chef",null,"",null,"Contacter le chef"]
[{"$f":"A36+1","v":"2021-01-25"},"",null,"Contacter le chef",null,"",null,"Contacter le chef"]
[{"$f":"A37+1","v":"2021-01-26"},"",null,"Contacter le chef",null,"",null,"Contacter le chef"]
["2021-01-27","",null,"Contacter le chef",null,"",null,"Contacter le chef"]
["2021-01-28","",null,"Contacter le chef",null,"",null,"Contacter le chef"]
["2021-01-29","",null,"Contacter le chef",null,"",null,"Contacter le chef"]
["2021-01-30","",null,"Contacter le chef",null,"",null,"Contacter le chef"]
[{"$f":"A42+1","v":"2021-01-31"},"",null,"Contacter le chef",null,"",null,"Contacter le chef"]
[]
[null,"Contrôle"]
[null,"Signature"]
[]
[]
[]
[]
[]
["Relevé des températures"]
[]
[]
[{"$f":"A5","v":"2021-02-02"}]
[{"$nulls":5},"Document de référence :","Directives_Frigos"]
[null,"Fréquence =>",null,null,"le matin et le soir :","Relevé des températures et contrôle des rangements"]
[]
[]
[null,"Congélateur S/Sol",{"$nulls":7},"Mesure"]
["Valeurs \ncibles =>","Minimum  -15° C                                                                                ",null," Maximum -22°C    ",null,"Minimum  -15° C                                                                                  ",null,"Maximum -22°C          ",null,"en cas de température\nNon-conforme","Visa responsable"]
["Date","Heure","T°","Résultat","Visa","Heure","T°","Résultat","Visa"]
["2021-01-01",{"$f":"IF(C63=\"\",\"\",IF(B63<>\"\",B63,NOW()))","v":""},null,{"$f":"IF(C63>15,\"OK\",\"Contacter le chef\")","v":"Contacter le chef"},null,{"$f":"IF(G63=\"\",\"\",IF(F63<>\"\",F63,NOW()))","v":""},null,{"$f":"IF(G63>15,\"OK\",\"Contacter le chef\")","v":"Contacter le chef"}]
[{"$f":"A63+1","v":"2021-01-02"},"",null,{"$f":"IF(C64>15,\"OK\",\"Contacter le chef\")","v":"Contacter le chef"},null,"",null,{"$f":"IF(G64>15,\"OK\",\"Contacter le chef\")","v":"Contacter le chef"}]
[{"$f":"A64+1","v":"2021-01-03"},"",null,"Contacter le chef",null,"",null,"Contacter le chef"]
["2021-01-04","",null,"Contacter le chef",null,"",null,"Contacter le chef"]
["2021-01-05","",null,"Contacter le chef",null,"",null,"Contacter le chef"]
["2021-01-06","",null,"Contacter le chef",null,"",null,"Contacter le chef"]
["2021-01-07","",null,"Contacter le chef",null,"",null,"Contacter le chef"]
["2021-01-08","",null,"Contacter le chef",null,"",null,"Contacter le chef"]
["2021-01-09","",null,"Contacter le chef",null,"",null,"Contacter le chef"]
["2021-01-10","",null,"Contacter le chef",null,"",null,"Contacter le chef"]
["2021-01-11","",null,"Contacter le chef",null,"",null,"Contacter le chef"]
["2021-01-12","",null,"Contacter le chef",null,"",null,"Contacter le chef"]
["2021-01-13","",null,"Contacter le chef",null,"",null,"Contacter le chef"]
["2021-01-14","",null,"Contacter le chef",null,"",null,"Contacter le chef"]
["2021-01-15","",null,"Contacter le chef",null,"",null,"Contacter le chef"]
["2021-01-16","",null,"Contacter le chef",null,"",null,"Contacter le chef"]
["2021-01-17","",null,"Contacter le chef",null,"",null,"Contacter le chef"]
["2021-01-18","",null,"Contacter le chef",null,"",null,"Contacter le chef"]
["2021-01-19","",null,"Contacter le chef",null,"",null,"Contacter le chef"]
["2021-01-20","",null,"Contacter le chef",null,"",null,"Contacter le chef"]
["2021-01-21","",null,"Contacter le chef",null,"",null,"Contacter le chef"]
["2021-01-22","",null,"Contacter le chef",null,"",null,"Contacter le chef"]
["2021-01-23","",null,"Contacter le chef",null,"",null,"Contacter le chef"]
["2021-01-24","",null,"Contacter le chef",null,"",null,"Contacter le chef"]
[{"$f":"A86+1","v":"2021-01-25"},"",null,"Contacter le chef",null,"",null,"Contacter le chef"]
[{"$f":"A87+1","v":"2021-01-26"},"",null,"Contacter le chef",null,"",null,"Contacter le chef"]
["2021-01-27","",null,"Contacter le chef",null,"",null,"Contacter le chef"]
["2021-01-28","",null,"Contacter le chef",null,"",null,"Contacter le chef"]
["2021-01-29","",null,"Contacter le chef",null,"",null,"Contacter le chef"]
["2021-01-30","",null,"Contacter le chef",null,"",null,"Contacter le chef"]
[{"$f":"A92+1","v":"2021-01-31"},"",null,"Contacter le chef",null,"",null,"Contacter le chef"]
[]
["Relevé des températures"]
[]
[]
[{"$f":"A5","v":"2021-02-02"}]
[{"$nulls":5},"Document de référence :","Directives_Frigos"]
[null,"Fréquence =>",null,null,"le matin et le soir :","Relevé des températures et contrôle des rangements"]
[]
[]
[null,"Frigo cuisine",{"$nulls":7},"Mesure"]
["Valeurs \ncibles =>","Minimum  7° C                                                                                ",null," Maximum 3°C    ",null,"Minimum  7° C                                                                                ",null," Maximum 3°C    ",null,"en cas de température\nNon-conforme","Visa responsable"]
["Date","Heure","T°","Résultat","Visa","Heure","T°","Résultat","Visa"]
["2021-01-01",{"$f":"IF(C106=\"\",\"\",IF(B106<>\"\",B106,NOW()))","v":""},null,{"$f":"IF(C106<8,\"OK\",\"Contacter le chef\")","v":"OK"},null,{"$f":"IF(G106=\"\",\"\",IF(F106<>\"\",F106,NOW()))","v":""},null,{"$f":"IF(G106<8,\"OK\",\"Contacter le chef\")","v":"OK"}]
[{"$f":"A106+1","v":"2021-01-02"},"",null,"OK",null,"",null,"OK"]
[{"$f":"A107+1","v":"2021-01-03"},"",null,"OK",null,"",null,"OK"]
["2021-01-04","",null,"OK",null,"",null,"OK"]
["2021-01-05","",null,"OK",null,"",null,"OK"]
["2021-01-06","",null,"OK",null,"",null,"OK"]
["2021-01-07","",null,"OK",null,"",null,"OK"]
["2021-01-08","",null,"OK",null,"",null,"OK"]
["2021-01-09","",null,"OK",null,"",null,"OK"]
["2021-01-10","",null,"OK",null,"",null,"OK"]
["2021-01-11","",null,"OK",null,"",null,"OK"]
["2021-01-12","",null,"OK",null,"",null,"OK"]
["2021-01-13","",null,"OK",null,"",null,"OK"]
["2021-01-14","",null,"OK",null,"",null,"OK"]
["2021-01-15","",null,"OK",null,"",null,"OK"]
["2021-01-16","",null,"OK",null,"",null,"OK"]
["2021-01-17","",null,"OK",null,"",null,"OK"]
["2021-01-18","",null,"OK",null,"",null,"OK"]
["2021-01-19","",null,"OK",null,"",null,"OK"]
["2021-01-20","",null,"OK",null,"",null,"OK"]
["2021-01-21","",null,"OK",null,"",null,"OK"]
["2021-01-22","",null,"OK",null,"",null,"OK"]
["2021-01-23","",null,"OK",null,"",null,"OK"]
["2021-01-24","",null,"OK",null,"",null,"OK"]
[{"$f":"A129+1","v":"2021-01-25"},"",null,"OK",null,"",null,"OK"]
[{"$f":"A130+1","v":"2021-01-26"},"",null,"OK",null,"",null,"OK"]
["2021-01-27","",null,"OK",null,"",null,"OK"]
["2021-01-28","",null,"OK",null,"",null,"OK"]
["2021-01-29","",null,"OK",null,"",null,"OK"]
["2021-01-30","",null,"OK",null,"",null,"OK"]
[{"$f":"A135+1","v":"2021-01-31"},"",null,"OK",null,"",null,"OK"]
[]
[]
["Relevé des températures"]
[]
[]
[{"$f":"A98","v":"2021-02-02"}]
[{"$nulls":5},"Document de référence :","Directives_Frigos"]
[null,"Fréquence =>",null,null,"le matin et le soir :","Relevé des températures et contrôle des rangements"]
[]
[]
[null,"Frigo MEP",{"$nulls":7},"Mesure"]
["Valeurs \ncibles =>","Minimum  7° C                                                                                ",null," Maximum 3°C    ",null,"Minimum  7° C                                                                                ",null," Maximum 3°C    ",null,"en cas de température\nNon-conforme","Visa responsable"]
["Date","Heure","T°","Résultat","Visa","Heure","T°","Résultat","Visa"]
["2021-01-01",{"$f":"IF(C150=\"\",\"\",IF(B150<>\"\",B150,NOW()))","v":""},null,{"$f":"IF(C150<8,\"OK\",\"Contacter le chef\")","v":"OK"},null,{"$f":"IF(G150=\"\",\"\",IF(F150<>\"\",F150,NOW()))","v":""},null,{"$f":"IF(G150<8,\"OK\",\"Contacter le chef\")","v":"OK"}]
[{"$f":"A150+1","v":"2021-01-02"},"",null,"OK",null,"",null,"OK"]
[{"$f":"A151+1","v":"2021-01-03"},"",null,"OK",null,"",null,"OK"]
["2021-01-04","",null,"OK",null,"",null,"OK"]
["2021-01-05","",null,"OK",null,"",null,"OK"]
["2021-01-06","",null,"OK",null,"",null,"OK"]
["2021-01-07","",null,"OK",null,"",null,"OK"]
["2021-01-08","",null,"OK",null,"",null,"OK"]
["2021-01-09","",null,"OK",null,"",null,"OK"]
["2021-01-10","",null,"OK",null,"",null,"OK"]
["2021-01-11","",null,"OK",null,"",null,"OK"]
["2021-01-12","",null,"OK",null,"",null,"OK"]
["2021-01-13","",null,"OK",null,"",null,"OK"]
["2021-01-14","",null,"OK",null,"",null,"OK"]
["2021-01-15","",null,"OK",null,"",null,"OK"]
["2021-01-16","",null,"OK",null,"",null,"OK"]
["2021-01-17","",null,"OK",null,"",null,"OK"]
["2021-01-18","",null,"OK",null,"",null,"OK"]
["2021-01-19","",null,"OK",null,"",null,"OK"]
["2021-01-20","",null,"OK",null,"",null,"OK"]
["2021-01-21","",null,"OK",null,"",null,"OK"]
["2021-01-22","",null,"OK",null,"",null,"OK"]
["2021-01-23","",null,"OK",null,"",null,"OK"]
["2021-01-24","",null,"OK",null,"",null,"OK"]
[{"$f":"A173+1","v":"2021-01-25"},"",null,"OK",null,"",null,"OK"]
[{"$f":"A174+1","v":"2021-01-26"},"",null,"OK",null,"",null,"OK"]
["2021-01-27","",null,"OK",null,"",null,"OK"]
["2021-01-28","",null,"OK",null,"",null,"OK"]
["2021-01-29","",null,"OK",null,"",null,"OK"]
["2021-01-30","",null,"OK",null,"",null,"OK"]
[{"$f":"A179+1","v":"2021-01-31"},"",null,"OK",null,"",null,"OK"]
[]
["Relevé des températures"]
[]
[]
[{"$f":"A142","v":"2021-02-02"}]
[{"$nulls":5},"Document de référence :","Directives_Frigos"]
[null,"Fréquence =>",null,null,"le matin et le soir :","Relevé des températures et contrôle des rangements"]
[]
[]
[null,"Frigo pâtisserie",{"$nulls":7},"Mesure"]
["Valeurs \ncibles =>","Minimum  7° C                                                                                ",null," Maximum 3°C    ",null,"Minimum  7° C                                                                                ",null," Maximum 3°C    ",null,"en cas de température\nNon-conforme","Visa responsable"]
["Date","Heure","T°","Résultat","Visa","Heure","T°","Résultat","Visa"]
["2021-01-01",{"$f":"IF(C193=\"\",\"\",IF(B193<>\"\",B193,NOW()))","v":""},null,{"$f":"IF(C193<8,\"OK\",\"Contacter le chef\")","v":"OK"},null,{"$f":"IF(G193=\"\",\"\",IF(F193<>\"\",F193,NOW()))","v":""},null,{"$f":"IF(G193<8,\"OK\",\"Contacter le chef\")","v":"OK"}]
[{"$f":"A193+1","v":"2021-01-02"},"",null,"OK",null,"",null,"OK"]
[{"$f":"A194+1","v":"2021-01-03"},"",null,"OK",null,"",null,"OK"]
["2021-01-04","",null,"OK",null,"",null,"OK"]
["2021-01-05","",null,"OK",null,"",null,"OK"]
["2021-01-06","",null,"OK",null,"",null,"OK"]
["2021-01-07","",null,"OK",null,"",null,"OK"]
["2021-01-08","",null,"OK",null,"",null,"OK"]
["2021-01-09","",null,"OK",null,"",null,"OK"]
["2021-01-10","",null,"OK",null,"",null,"OK"]
["2021-01-11","",null,"OK",null,"",null,"OK"]
["2021-01-12","",null,"OK",null,"",null,"OK"]
["2021-01-13","",null,"OK",null,"",null,"OK"]
["2021-01-14","",null,"OK",null,"",null,"OK"]
["2021-01-15","",null,"OK",null,"",null,"OK"]
["2021-01-16","",null,"OK",null,"",null,"OK"]
["2021-01-17","",null,"OK",null,"",null,"OK"]
["2021-01-18","",null,"OK",null,"",null,"OK"]
["2021-01-19","",null,"OK",null,"",null,"OK"]
["2021-01-20","",null,"OK",null,"",null,"OK"]
["2021-01-21","",null,"OK",null,"",null,"OK"]
["2021-01-22","",null,"OK",null,"",null,"OK"]
["2021-01-23","",null,"OK",null,"",null,"OK"]
["2021-01-24","",null,"OK",null,"",null,"OK"]
[{"$f":"A216+1","v":"2021-01-25"},"",null,"OK",null,"",null,"OK"]
[{"$f":"A217+1","v":"2021-01-26"},"",null,"OK",null,"",null,"OK"]
["2021-01-27","",null,"OK",null,"",null,"OK"]
["2021-01-28","",null,"OK",null,"",null,"OK"]
["2021-01-29","",null,"OK",null,"",null,"OK"]
["2021-01-30","",null,"OK",null,"",null,"OK"]
[{"$f":"A222+1","v":"2021-01-31"},"",null,"OK",null,"",null,"OK"]
[]
["Relevé des températures"]
[]
[]
[{"$f":"A185","v":"2021-02-02"}]
[{"$nulls":5},"Document de référence :","Directives_Frigos"]
[null,"Fréquence =>",null,null,"le matin et le soir :","Relevé des températures et contrôle des rangements"]
[]
[]
[null,"Frigo produits laitiers",{"$nulls":7},"Mesure"]
["Valeurs \ncibles =>","Minimum  7° C                                                                                ",null," Maximum 3°C    ",null,"Minimum  7° C                                                                                ",null," Maximum 3°C    ",null,"en cas de température\nNon-conforme","Visa responsable"]
["Date","Heure","T°","Résultat","Visa","Heure","T°","Résultat","Visa"]
["2021-01-01",{"$f":"IF(C236=\"\",\"\",IF(B236<>\"\",B236,NOW()))","v":""},null,{"$f":"IF(C236<8,\"OK\",\"Contacter le chef\")","v":"OK"},null,{"$f":"IF(G236=\"\",\"\",IF(F236<>\"\",F236,NOW()))","v":""},null,{"$f":"IF(G236<8,\"OK\",\"Contacter le chef\")","v":"OK"}]
[{"$f":"A236+1","v":"2021-01-02"},"",null,"OK",null,"",null,"OK"]
[{"$f":"A237+1","v":"2021-01-03"},"",null,"OK",null,"",null,"OK"]
["2021-01-04","",null,"OK",null,"",null,"OK"]
["2021-01-05","",null,"OK",null,"",null,"OK"]
["2021-01-06","",null,"OK",null,"",null,"OK"]
["2021-01-07","",null,"OK",null,"",null,"OK"]
["2021-01-08","",null,"OK",null,"",null,"OK"]
["2021-01-09","",null,"OK",null,"",null,"OK"]
["2021-01-10","",null,"OK",null,"",null,"OK"]
["2021-01-11","",null,"OK",null,"",null,"OK"]
["2021-01-12","",null,"OK",null,"",null,"OK"]
["2021-01-13","",null,"OK",null,"",null,"OK"]
["2021-01-14","",null,"OK",null,"",null,"OK"]
["2021-01-15","",null,"OK",null,"",null,"OK"]
["2021-01-16","",null,"OK",null,"",null,"OK"]
["2021-01-17","",null,"OK",null,"",null,"OK"]
["2021-01-18","",null,"OK",null,"",null,"OK"]
["2021-01-19","",null,"OK",null,"",null,"OK"]
["2021-01-20","",null,"OK",null,"",null,"OK"]
["2021-01-21","",null,"OK",null,"",null,"OK"]
["2021-01-22","",null,"OK",null,"",null,"OK"]
["2021-01-23","",null,"OK",null,"",null,"OK"]
["2021-01-24","",null,"OK",null,"",null,"OK"]
[{"$f":"A259+1","v":"2021-01-25"},"",null,"OK",null,"",null,"OK"]
[{"$f":"A260+1","v":"2021-01-26"},"",null,"OK",null,"",null,"OK"]
["2021-01-27","",null,"OK",null,"",null,"OK"]
["2021-01-28","",null,"OK",null,"",null,"OK"]
["2021-01-29","",null,"OK",null,"",null,"OK"]
["2021-01-30","",null,"OK",null,"",null,"OK"]
[{"$f":"A265+1","v":"2021-01-31"},"",null,"OK",null,"",null,"OK"]
[]
[]
["Relevé des températures"]
[]
[]
[{"$f":"A228","v":"2021-02-02"}]
[{"$nulls":5},"Document de référence :","Directives_Frigos"]
[null,"Fréquence =>",null,null,"le matin et le soir :","Relevé des températures et contrôle des rangements"]
[]
[]
[null,"Frigo S/Sol",{"$nulls":7},"Mesure"]
["Valeurs \ncibles =>","Minimum  7° C                                                                                ",null," Maximum 3°C    ",null,"Minimum  7° C                                                                                ",null," Maximum 3°C    ",null,"en cas de température\nNon-conforme","Visa responsable"]
["Date","Heure","T°","Résultat","Visa","Heure","T°","Résultat","Visa"]
["2021-01-01",{"$f":"IF(C280=\"\",\"\",IF(B280<>\"\",B280,NOW()))","v":""},null,{"$f":"IF(C280<8,\"OK\",\"Contacter le chef\")","v":"OK"},null,{"$f":"IF(G280=\"\",\"\",IF(F280<>\"\",F280,NOW()))","v":""},null,{"$f":"IF(G280<8,\"OK\",\"Contacter le chef\")","v":"OK"}]
[{"$f":"A280+1","v":"2021-01-02"},"",null,{"$f":"IF(C281<8,\"OK\",\"Contacter le chef\")","v":"OK"},null,"",null,"OK"]
[{"$f":"A281+1","v":"2021-01-03"},"",null,"OK",null,"",null,"OK"]
["2021-01-04","",null,"OK",null,"",null,"OK"]
["2021-01-05","",null,"OK",null,"",null,"OK"]
["2021-01-06","",null,"OK",null,"",null,"OK"]
["2021-01-07","",null,"OK",null,"",null,"OK"]
["2021-01-08","",null,"OK",null,"",null,"OK"]
["2021-01-09","",null,"OK",null,"",null,"OK"]
["2021-01-10","",null,"OK",null,"",null,"OK"]
["2021-01-11","",null,"OK",null,"",null,"OK"]
["2021-01-12","",null,"OK",null,"",null,"OK"]
["2021-01-13","",null,"OK",null,"",null,"OK"]
["2021-01-14","",null,"OK",null,"",null,"OK"]
["2021-01-15","",null,"OK",null,"",null,"OK"]
["2021-01-16","",null,"OK",null,"",null,"OK"]
["2021-01-17","",null,"OK",null,"",null,"OK"]
["2021-01-18","",null,"OK",null,"",null,"OK"]
["2021-01-19","",null,"OK",null,"",null,"OK"]
["2021-01-20","",null,"OK",null,"",null,"OK"]
["2021-01-21","",null,"OK",null,"",null,"OK"]
["2021-01-22","",null,"OK",null,"",null,"OK"]
["2021-01-23","",null,"OK",null,"",null,"OK"]
["2021-01-24","",null,"OK",null,"",null,"OK"]
[{"$f":"A303+1","v":"2021-01-25"},"",null,"OK",null,"",null,"OK"]
[{"$f":"A304+1","v":"2021-01-26"},"",null,"OK",null,"",null,"OK"]
["2021-01-27","",null,"OK",null,"",null,"OK"]
["2021-01-28","",null,"OK",null,"",null,"OK"]
["2021-01-29","",null,"OK",null,"",null,"OK"]
["2021-01-30","",null,"OK",null,"",null,"OK"]
[{"$f":"A309+1","v":"2021-01-31"},"",null,"OK",null,"",null,"OK"]

{"sheet":"Mars","index":2,"n_rows":310,"n_cols":11,"rows_kept":310,"merged":[[0,0,0,9],[1,0,1,9],[4,0,4,9],[9,1,9,8],[50,0,50,9],[51,0,51,9],[54,0,54,9],[59,1,59,8],[93,0,93,9],[94,0,94,9],[97,0,97,9],[102,1,102,8],[103,1,103,2],[103,5,103,6],[137,0,137,9],[138,0,138,9],[141,0,141,10],[146,1,146,8],[147,1,147,2],[147,5,147,6],[180,0,180,9],[181,0,181,9],[184,0,184,9],[189,1,189,8],[190,1,190,2],[190,5,190,6],[223,0,223,9],[224,0,224,9],[227,0,227,9],[232,1,232,8],[233,1,233,2],[233,5,233,6],[267,0,267,9],[268,0,268,9],[271,0,271,9],[276,1,276,8],[277,1,277,2],[277,5,277,6]]}
[]
["Relevé des températures"]
[]
[]
["2020-03-01"]
[{"$nulls":5},"Document de référence :","Directives_Frigos"]
[null,"Fréquence =>",null,null,"le matin et le soir :","Relevé des températures "]
[]
[]
[null,"Congélateur cuisine",{"$nulls":7},"Mesure"]
["Valeurs \ncibles =>","Minimum  -15° C                                                                                ",null," Maximum -22°C    ",null,"Minimum  -15° C                                                                                  ",null,"Maximum -22°C          ",null,"en cas de température\nNon-conforme","Visa responsable"]
["Date","Heure","T°","Résultat","Visa","Heure","T°","Résultat","Visa"]
["2021-01-01",null,null,{"$f":"IF(C13>15,\"OK\",\"Contacter le chef\")","v":"Contacter le chef"},null,{"$f":"IF(G13=\"\",\"\",IF(F13<>\"\",F13,NOW()))","v":""},null,{"$f":"IF(G13>15,\"OK\",\"Contacter le chef\")","v":"Contacter le chef"}]
[{"$f":"A13+1","v":"2021-01-02"},{"$f":"IF(C14=\"\",\"\",NOW())","v":""},null,{"$f":"IF(C14>15,\"OK\",\"Contacter le chef\")","v":"Contacter le chef"},null,"",null,{"$f":"IF(G14>15,\"OK\",\"Contacter le chef\")","v":"Contacter le chef"}]
[{"$f":"A14+1","v":"2021-01-03"},{"$f":"IF(C15=\"\",\"\",IF(B15<>\"\",B15,NOW()))","v":""},null,"Contacter le chef",null,"",null,"Contacter le chef"]
["2021-01-04","",null,"Contacter le chef",null,"",null,"Contacter le chef"]
["2021-01-05","",null,"Contacter le chef",null,"",null,"Contacter le chef"]
["2021-01-06","",null,"Contacter le chef",null,"",null,"Contacter le chef"]
["2021-01-07","",null,"Contacter le chef",null,"",null,"Contacter le chef"]
["2021-01-08","",null,"Contacter le chef",null,"",null,"Contacter le chef"]
["2021-01-09","",null,"Contacter le chef",null,"",null,"Contacter le chef"]
["2021-01-10","",null,"Contacter le chef",null,"",null,"Contacter le chef"]
["2021-01-11","",null,"Contacter le chef",null,"",null,"Contacter le chef"]
["2021-01-12","",null,"Contacter le chef",null,"",null,"Contacter le chef"]
["2021-01-13","",null,"Contacter le chef",null,"",null,"Contacter le chef"]
["2021-01-14","",null,"Contacter le chef",null,"",null,"Contacter le chef"]
["2021-01-15","",null,"Contacter le chef",null,"",null,"Contacter le chef"]
["2021-01-16","",null,"Contacter le chef",null,"",null,"Contacter le chef"]
["2021-01-17","",null,"Contacter le chef",null,"",null,"Contacter le chef"]
["2021-01-18","",null,"Contacter le chef",null,"",null,"Contacter le chef"]
["2021-01-19","",null,"Contacter le chef",null,"",null,"Contacter le chef"]
["2021-01-20","",null,"Contacter le chef",null,"",null,"Contacter le chef"]
["2021-01-21","",null,"Contacter le chef",null,"",null,"Contacter le chef"]
["2021-01-22","",null,"Contacter le chef",null,"",null,"Contacter le chef"]
["2021-01-23","",null,"Contacter le chef",null,"",null,"Contacter le chef"]
["2021-01-24","",null,"Contacter le chef",null,"",null,"Contacter le chef"]
[{"$f":"A36+1","v":"2021-01-25"},"",null,"Contacter le chef",null,"",null,"Contacter le chef"]
[{"$f":"A37+1","v":"2021-01-26"},"",null,"Contacter le chef",null,"",null,"Contacter le chef"]
["2021-01-27","",null,"Contacter le chef",null,"",null,"Contacter le chef"]
["2021-01-28","",null,"Contacter le chef",null,"",null,"Contacter le chef"]
["2021-01-29","",null,"Contacter le chef",null,"",null,"Contacter le chef"]
["2021-01-30","",null,"Contacter le chef",null,"",null,"Contacter le chef"]
[{"$f":"A42+1","v":"2021-01-31"},"",null,"Contacter le chef",null,"",null,"Contacter le chef"]
[]
[null,"Contrôle"]
[null,"Signature"]
[]
[]
[]
[]
[]
["Relevé des températures"]
[]
[]
[{"$f":"A5","v":"2020-03-01"}]
[{"$nulls":5},"Document de référence :","Directives_Frigos"]
[null,"Fréquence =>",null,null,"le matin et le soir :","Relevé des températures et contrôle des rangements"]
[]
[]
[null,"Congélateur S/Sol",{"$nulls":7},"Mesure"]
["Valeurs \ncibles =>","Minimum  -15° C                                                                                ",null," Maximum -22°C    ",null,"Minimum  -15° C                                                                                  ",null,"Maximum -22°C          ",null,"en cas de température\nNon-conforme","Visa responsable"]
["Date","Heure","T°","Résultat","Visa","Heure","T°","Résultat","Visa"]
["2021-01-01",{"$f":"IF(C63=\"\",\"\",IF(B63<>\"\",B63,NOW()))","v":""},null,{"$f":"IF(C63>15,\"OK\",\"Contacter le chef\")","v":"Contacter le chef"},null,{"$f":"IF(G63=\"\",\"\",IF(F63<>\"\",F63,NOW()))","v":""},null,{"$f":"IF(G63>15,\"OK\",\"Contacter le chef\")","v":"Contacter le chef"}]
[{"$f":"A63+1","v":"2021-01-02"},"",null,{"$f":"IF(C64>15,\"OK\",\"Contacter le chef\")","v":"Contacter le chef"},null,"",null,{"$f":"IF(G64>15,\"OK\",\"Contacter le chef\")","v":"Contacter le chef"}]
[{"$f":"A64+1","v":"2021-01-03"},"",null,"Contacter le chef",null,"",null,"Contacter le chef"]
["2021-01-04","",null,"Contacter le chef",null,"",null,"Contacter le chef"]
["2021-01-05","",null,"Contacter le chef",null,"",null,"Contacter le chef"]
["2021-01-06","",null,"Contacter le chef",null,"",null,"Contacter le chef"]
["2021-01-07","",null,"Contacter le chef",null,"",null,"Contacter le chef"]
["2021-01-08","",null,"Contacter le chef",null,"",null,"Contacter le chef"]
["2021-01-09","",null,"Contacter le chef",null,"",null,"Contacter le chef"]
["2021-01-10","",null,"Contacter le chef",null,"",null,"Contacter le chef"]
["2021-01-11","",null,"Contacter le chef",null,"",null,"Contacter le chef"]
["2021-01-12","",null,"Contacter le chef",null,"",null,"Contacter le chef"]
["2021-01-13","",null,"Contacter le chef",null,"",null,"Contacter le chef"]
["2021-01-14","",null,"Contacter le chef",null,"",null,"Contacter le chef"]
["2021-01-15","",null,"Contacter le chef",null,"",null,"Contacter le chef"]
["2021-01-16","",null,"Contacter le chef",null,"",null,"Contacter le chef"]
["2021-01-17","",null,"Contacter le chef",null,"",null,"Contacter le chef"]
["2021-01-18","",null,"Contacter le chef",null,"",null,"Contacter le chef"]
["2021-01-19","",null,"Contacter le chef",null,"",null,"Contacter le chef"]
["2021-01-20","",null,"Contacter le chef",null,"",null,"Contacter le chef"]
["2021-01-21","",null,"Contacter le chef",null,"",null,"Contacter le chef"]
["2021-01-22","",null,"Contacter le chef",null,"",null,"Contacter le chef"]
["2021-01-23","",null,"Contacter le chef",null,"",null,"Contacter le chef"]
["2021-01-24","",null,"Contacter le chef",null,"",null,"Contacter le chef"]
[{"$f":"A86+1","v":"2021-01-25"},"",null,"Contacter le chef",null,"",null,"Contacter le chef"]
[{"$f":"A87+1","v":"2021-01-26"},"",null,"Contacter le chef",null,"",null,"Contacter le chef"]
["2021-01-27","",null,"Contacter le chef",null,"",null,"Contacter le chef"]
["2021-01-28","",null,"Contacter le chef",null,"",null,"Contacter le chef"]
["2021-01-29","",null,"Contacter le chef",null,"",null,"Contacter le chef"]
["2021-01-30","",null,"Contacter le chef",null,"",null,"Contacter le chef"]
[{"$f":"A92+1","v":"2021-01-31"},"",null,"Contacter le chef",null,"",null,"Contacter le chef"]
[]
["Relevé des températures"]
[]
[]
[{"$f":"A5","v":"2020-03-01"}]
[{"$nulls":5},"Document de référence :","Directives_Frigos"]
[null,"Fréquence =>",null,null,"le matin et le soir :","Relevé des températures et contrôle des rangements"]
[]
[]
[null,"Frigo cuisine",{"$nulls":7},"Mesure"]
["Valeurs \ncibles =>","Minimum  7° C                                                                                ",null," Maximum 3°C    ",null,"Minimum  7° C                                                                                ",null," Maximum 3°C    ",null,"en cas de température\nNon-conforme","Visa responsable"]
["Date","Heure","T°","Résultat","Visa","Heure","T°","Résultat","Visa"]
["2021-01-01",{"$f":"IF(C106=\"\",\"\",IF(B106<>\"\",B106,NOW()))","v":""},null,{"$f":"IF(C106<8,\"OK\",\"Contacter le chef\")","v":"OK"},null,{"$f":"IF(G106=\"\",\"\",IF(F106<>\"\",F106,NOW()))","v":""},null,{"$f":"IF(G106<8,\"OK\",\"Contacter le chef\")","v":"OK"}]
[{"$f":"A106+1","v":"2021-01-02"},"",null,"OK",null,"",null,"OK"]
[{"$f":"A107+1","v":"2021-01-03"},"",null,"OK",null,"",null,"OK"]
["2021-01-04","",null,"OK",null,"",null,"OK"]
["2021-01-05","",null,"OK",null,"",null,"OK"]
["2021-01-06","",null,"OK",null,"",null,"OK"]
["2021-01-07","",null,"OK",null,"",null,"OK"]
["2021-01-08","",null,"OK",null,"",null,"OK"]
["2021-01-09","",null,"OK",null,"",null,"OK"]
["2021-01-10","",null,"OK",null,"",null,"OK"]
["2021-01-11","",null,"OK",null,"",null,"OK"]
["2021-01-12","",null,"OK",null,"",null,"OK"]
["2021-01-13","",null,"OK",null,"",null,"OK"]
["2021-01-14","",null,"OK",null,"",null,"OK"]
["2021-01-15","",null,"OK",null,"",null,"OK"]
["2021-01-16","",null,"OK",null,"",null,"OK"]
["2021-01-17","",null,"OK",null,"",null,"OK"]
["2021-01-18","",null,"OK",null,"",null,"OK"]
["2021-01-19","",null,"OK",null,"",null,"OK"]
["2021-01-20","",null,"OK",null,"",null,"OK"]
["2021-01-21","",null,"OK",null,"",null,"OK"]
["2021-01-22","",null,"OK",null,"",null,"OK"]
["2021-01-23","",null,"OK",null,"",null,"OK"]
["2021-01-24","",null,"OK",null,"",null,"OK"]
[{"$f":"A129+1","v":"2021-01-25"},"",null,"OK",null,"",null,"OK"]
[{"$f":"A130+1","v":"2021-01-26"},"",null,"OK",null,"",null,"OK"]
["2021-01-27","",null,"OK",null,"",null,"OK"]
["2021-01-28","",null,"OK",null,"",null,"OK"]
["2021-01-29","",null,"OK",null,"",null,"OK"]
["2021-01-30","",null,"OK",null,"",null,"OK"]
[{"$f":"A135+1","v":"2021-01-31"},"",null,"OK",null,"",null,"OK"]
[]
[]
["Relevé des températures"]
[]
[]
[{"$f":"A98","v":"2020-03-01"}]
[{"$nulls":5},"Document de référence :","Directives_Frigos"]
[null,"Fréquence =>",null,null,"le matin et le soir :","Relevé des températures et contrôle des rangements"]
[]
[]
[null,"Frigo MEP",{"$nulls":7},"Mesure"]
["Valeurs \ncibles =>","Minimum  7° C                                                                                ",null," Maximum 3°C    ",null,"Minimum  7° C                                                                                ",null," Maximum 3°C    ",null,"en cas de température\nNon-conforme","Visa responsable"]
["Date","Heure","T°","Résultat","Visa","Heure","T°","Résultat","Visa"]
["2021-01-01",{"$f":"IF(C150=\"\",\"\",IF(B150<>\"\",B150,NOW()))","v":""},null,{"$f":"IF(C150<8,\"OK\",\"Contacter le chef\")","v":"OK"},null,{"$f":"IF(G150=\"\",\"\",IF(F150<>\"\",F150,NOW()))","v":""},null,{"$f":"IF(G150<8,\"OK\",\"Contacter le chef\")","v":"OK"}]
[{"$f":"A150+1","v":"2021-01-02"},"",null,"OK",null,"",null,"OK"]
[{"$f":"A151+1","v":"2021-01-03"},"",null,"OK",null,"",null,"OK"]
["2021-01-04","",null,"OK",null,"",null,"OK"]
["2021-01-05","",null,"OK",null,"",null,"OK"]
["2021-01-06","",null,"OK",null,"",null,"OK"]
["2021-01-07","",null,"OK",null,"",null,"OK"]
["2021-01-08","",null,"OK",null,"",null,"OK"]
["2021-01-09","",null,"OK",null,"",null,"OK"]
["2021-01-10","",null,"OK",null,"",null,"OK"]
["2021-01-11","",null,"OK",null,"",null,"OK"]
["2021-01-12","",null,"OK",null,"",null,"OK"]
["2021-01-13","",null,"OK",null,"",null,"OK"]
["2021-01-14","",null,"OK",null,"",null,"OK"]
["2021-01-15","",null,"OK",null,"",null,"OK"]
["2021-01-16","",null,"OK",null,"",null,"OK"]
["2021-01-17","",null,"OK",null,"",null,"OK"]
["2021-01-18","",null,"OK",null,"",null,"OK"]
["2021-01-19","",null,"OK",null,"",null,"OK"]
["2021-01-20","",null,"OK",null,"",null,"OK"]
["2021-01-21","",null,"OK",null,"",null,"OK"]
["2021-01-22","",null,"OK",null,"",null,"OK"]
["2021-01-23","",null,"OK",null,"",null,"OK"]
["2021-01-24","",null,"OK",null,"",null,"OK"]
[{"$f":"A173+1","v":"2021-01-25"},"",null,"OK",null,"",null,"OK"]
[{"$f":"A174+1","v":"2021-01-26"},"",null,"OK",null,"",null,"OK"]
["2021-01-27","",null,"OK",null,"",null,"OK"]
["2021-01-28","",null,"OK",null,"",null,"OK"]
["2021-01-29","",null,"OK",null,"",null,"OK"]
["2021-01-30","",null,"OK",null,"",null,"OK"]
[{"$f":"A179+1","v":"2021-01-31"},"",null,"OK",null,"",null,"OK"]
[]
["Relevé des températures"]
[]
[]
[{"$f":"A142","v":"2020-03-01"}]
[{"$nulls":5},"Document de référence :","Directives_Frigos"]
[null,"Fréquence =>",null,null,"le matin et le soir :","Relevé des températures et contrôle des rangements"]
[]
[]
[null,"Frigo pâtisserie",{"$nulls":7},"Mesure"]
["Valeurs \ncibles =>","Minimum  7° C                                                                                ",null," Maximum 3°C    ",null,"Minimum  7° C                                                                                ",null," Maximum 3°C    ",null,"en cas de température\nNon-conforme","Visa responsable"]
["Date","Heure","T°","Résultat","Visa","Heure","T°","Résultat","Visa"]
["2021-01-01",{"$f":"IF(C193=\"\",\"\",IF(B193<>\"\",B193,NOW()))","v":""},null,{"$f":"IF(C193<8,\"OK\",\"Contacter le chef\")","v":"OK"},null,{"$f":"IF(G193=\"\",\"\",IF(F193<>\"\",F193,NOW()))","v":""},null,{"$f":"IF(G193<8,\"OK\",\"Contacter le chef\")","v":"OK"}]
[{"$f":"A193+1","v":"2021-01-02"},"",null,"OK",null,"",null,"OK"]
[{"$f":"A194+1","v":"2021-01-03"},"",null,"OK",null,"",null,"OK"]
["2021-01-04","",null,"OK",null,"",null,"OK"]
["2021-01-05","",null,"OK",null,"",null,"OK"]
["2021-01-06","",null,"OK",null,"",null,"OK"]
["2021-01-07","",null,"OK",null,"",null,"OK"]
["2021-01-08","",null,"OK",null,"",null,"OK"]
["2021-01-09","",null,"OK",null,"",null,"OK"]
["2021-01-10","",null,"OK",null,"",null,"OK"]
["2021-01-11","",null,"OK",null,"",null,"OK"]
["2021-01-12","",null,"OK",null,"",null,"OK"]
["2021-01-13","",null,"OK",null,"",null,"OK"]
["2021-01-14","",null,"OK",null,"",null,"OK"]
["2021-01-15","",null,"OK",null,"",null,"OK"]
["2021-01-16","",null,"OK",null,"",null,"OK"]
["2021-01-17","",null,"OK",null,"",null,"OK"]
["2021-01-18","",null,"OK",null,"",null,"OK"]
["2021-01-19","",null,"OK",null,"",null,"OK"]
["2021-01-20","",null,"OK",null,"",null,"OK"]
["2021-01-21","",null,"OK",null,"",null,"OK"]
["2021-01-22","",null,"OK",null,"",null,"OK"]
["2021-01-23","",null,"OK",null,"",null,"OK"]
["2021-01-24","",null,"OK",null,"",null,"OK"]
[{"$f":"A216+1","v":"2021-01-25"},"",null,"OK",null,"",null,"OK"]
[{"$f":"A217+1","v":"2021-01-26"},"",null,"OK",null,"",null,"OK"]
["2021-01-27","",null,"OK",null,"",null,"OK"]
["2021-01-28","",null,"OK",null,"",null,"OK"]
["2021-01-29","",null,"OK",null,"",null,"OK"]
["2021-01-30","",null,"OK",null,"",null,"OK"]
[{"$f":"A222+1","v":"2021-01-31"},"",null,"OK",null,"",null,"OK"]
[]
["Relevé des températures"]
[]
[]
[{"$f":"A185","v":"2020-03-01"}]
[{"$nulls":5},"Document de référence :","Directives_Frigos"]
[null,"Fréquence =>",null,null,"le matin et le soir :","Relevé des températures et contrôle des rangements"]
[]
[]
[null,"Frigo produits laitiers",{"$nulls":7},"Mesure"]
["Valeurs \ncibles =>","Minimum  7° C                                                                                ",null," Maximum 3°C    ",null,"Minimum  7° C                                                                                ",null," Maximum 3°C    ",null,"en cas de température\nNon-conforme","Visa responsable"]
["Date","Heure","T°","Résultat","Visa","Heure","T°","Résultat","Visa"]
["2021-01-01",{"$f":"IF(C236=\"\",\"\",IF(B236<>\"\",B236,NOW()))","v":""},null,{"$f":"IF(C236<8,\"OK\",\"Contacter le chef\")","v":"OK"},null,{"$f":"IF(G236=\"\",\"\",IF(F236<>\"\",F236,NOW()))","v":""},null,{"$f":"IF(G236<8,\"OK\",\"Contacter le chef\")","v":"OK"}]
[{"$f":"A236+1","v":"2021-01-02"},"",null,"OK",null,"",null,"OK"]
[{"$f":"A237+1","v":"2021-01-03"},"",null,"OK",null,"",null,"OK"]
["2021-01-04","",null,"OK",null,"",null,"OK"]
["2021-01-05","",null,"OK",null,"",null,"OK"]
["2021-01-06","",null,"OK",null,"",null,"OK"]
["2021-01-07","",null,"OK",null,"",null,"OK"]
["2021-01-08","",null,"OK",null,"",null,"OK"]
["2021-01-09","",null,"OK",null,"",null,"OK"]
["2021-01-10","",null,"OK",null,"",null,"OK"]
["2021-01-11","",null,"OK",null,"",null,"OK"]
["2021-01-12","",null,"OK",null,"",null,"OK"]
["2021-01-13","",null,"OK",null,"",null,"OK"]
["2021-01-14","",null,"OK",null,"",null,"OK"]
["2021-01-15","",null,"OK",null,"",null,"OK"]
["2021-01-16","",null,"OK",null,"",null,"OK"]
["2021-01-17","",null,"OK",null,"",null,"OK"]
["2021-01-18","",null,"OK",null,"",null,"OK"]
["2021-01-19","",null,"OK",null,"",null,"OK"]
["2021-01-20","",null,"OK",null,"",null,"OK"]
["2021-01-21","",null,"OK",null,"",null,"OK"]
["2021-01-22","",null,"OK",null,"",null,"OK"]
["2021-01-23","",null,"OK",null,"",null,"OK"]
["2021-01-24","",null,"OK",null,"",null,"OK"]
[{"$f":"A259+1","v":"2021-01-25"},"",null,"OK",null,"",null,"OK"]
[{"$f":"A260+1","v":"2021-01-26"},"",null,"OK",null,"",null,"OK"]
["2021-01-27","",null,"OK",null,"",null,"OK"]
["2021-01-28","",null,"OK",null,"",null,"OK"]
["2021-01-29","",null,"OK",null,"",null,"OK"]
["2021-01-30","",null,"OK",null,"",null,"OK"]
[{"$f":"A265+1","v":"2021-01-31"},"",null,"OK",null,"",null,"OK"]
[]
[]
["Relevé des températures"]
[]
[]
[{"$f":"A228","v":"2020-03-01"}]
[{"$nulls":5},"Document de référence :","Directives_Frigos"]
[null,"Fréquence =>",null,null,"le matin et le soir :","Relevé des températures et contrôle des rangements"]
[]
[]
[null,"Frigo S/Sol",{"$nulls":7},"Mesure"]
["Valeurs \ncibles =>","Minimum  7° C                                                                                ",null," Maximum 3°C    ",null,"Minimum  7° C                                                                                ",null," Maximum 3°C    ",null,"en cas de température\nNon-conforme","Visa responsable"]
["Date","Heure","T°","Résultat","Visa","Heure","T°","Résultat","Visa"]
["2021-01-01",{"$f":"IF(C280=\"\",\"\",IF(B280<>\"\",B280,NOW()))","v":""},null,{"$f":"IF(C280<8,\"OK\",\"Contacter le chef\")","v":"OK"},null,{"$f":"IF(G280=\"\",\"\",IF(F280<>\"\",F280,NOW()))","v":""},null,{"$f":"IF(G280<8,\"OK\",\"Contacter le chef\")","v":"OK"}]
[{"$f":"A280+1","v":"2021-01-02"},"",null,{"$f":"IF(C281<8,\"OK\",\"Contacter le chef\")","v":"OK"},null,"",null,"OK"]
[{"$f":"A281+1","v":"2021-01-03"},"",null,"OK",null,"",null,"OK"]
["2021-01-04","",null,"OK",null,"",null,"OK"]
["2021-01-05","",null,"OK",null,"",null,"OK"]
["2021-01-06","",null,"OK",null,"",null,"OK"]
["2021-01-07","",null,"OK",null,"",null,"OK"]
["2021-01-08","",null,"OK",null,"",null,"OK"]
["2021-01-09","",null,"OK",null,"",null,"OK"]
["2021-01-10","",null,"OK",null,"",null,"OK"]
["2021-01-11","",null,"OK",null,"",null,"OK"]
["2021-01-12","",null,"OK",null,"",null,"OK"]
["2021-01-13","",null,"OK",null,"",null,"OK"]
["2021-01-14","",null,"OK",null,"",null,"OK"]
["2021-01-15","",null,"OK",null,"",null,"OK"]
["2021-01-16","",null,"OK",null,"",null,"OK"]
["2021-01-17","",null,"OK",null,"",null,"OK"]
["2021-01-18","",null,"OK",null,"",null,"OK"]
["2021-01-19","",null,"OK",null,"",null,"OK"]
["2021-01-20","",null,"OK",null,"",null,"OK"]
["2021-01-21","",null,"OK",null,"",null,"OK"]
["2021-01-22","",null,"OK",null,"",null,"OK"]
["2021-01-23","",null,"OK",null,"",null,"OK"]
["2021-01-24","",null,"OK",null,"",null,"OK"]
[{"$f":"A303+1","v":"2021-01-25"},"",null,"OK",null,"",null,"OK"]
[{"$f":"A304+1","v":"2021-01-26"},"",null,"OK",null,"",null,"OK"]
["2021-01-27","",null,"OK",null,"",null,"OK"]
["2021-01-28","",null,"OK",null,"",null,"OK"]
["2021-01-29","",null,"OK",null,"",null,"OK"]
["2021-01-30","",null,"OK",null,"",null,"OK"]
[{"$f":"A309+1","v":"2021-01-31"},"",null,"OK",null,"",null,"OK"]

{"sheet":"Avril","index":3,"n_rows":310,"n_cols":11,"rows_kept":310,"merged":[[0,0,0,9],[1,0,1,9],[4,0,4,9],[9,1,9,8],[50,0,50,9],[51,0,51,9],[54,0,54,9],[59,1,59,8],[93,0,93,9],[94,0,94,9],[97,0,97,9],[102,1,102,8],[103,1,103,2],[103,5,103,6],[137,0,137,9],[138,0,138,9],[141,0,141,10],[146,1,146,8],[147,1,147,2],[147,5,147,6],[180,0,180,9],[181,0,181,9],[184,0,184,9],[189,1,189,8],[190,1,190,2],[190,5,190,6],[223,0,223,9],[224,0,224,9],[227,0,227,9],[232,1,232,8],[233,1,233,2],[233,5,233,6],[267,0,267,9],[268,0,268,9],[271,0,271,9],[276,1,276,8],[277,1,277,2],[277,5,277,6]]}
[]
["Relevé des températures"]
[]
[]
["2020-04-01"]
[{"$nulls":5},"Document de référence :","Directives_Frigos"]
[null,"Fréquence =>",null,null,"le matin et le soir :","Relevé des températures "]
[]
[]
[null,"Congélateur cuisine",{"$nulls":7},"Mesure"]
["Valeurs \ncibles =>","Minimum  -15° C                                                                                ",null," Maximum -22°C    ",null,"Minimum  -15° C                                                                                  ",null,"Maximum -22°C          ",null,"en cas de température\nNon-conforme","Visa responsable"]
["Date","Heure","T°","Résultat","Visa","Heure","T°","Résultat","Visa"]
["2021-01-01",{"$f":"IF(C13=\"\",\"\",IF(B13<>\"\",B13,NOW()))","v":""},null,{"$f":"IF(C13>15,\"OK\",\"Contacter le chef\")","v":"Contacter le chef"},null,{"$f":"IF(G13=\"\",\"\",IF(F13<>\"\",F13,NOW()))","v":""},null,{"$f":"IF(G13>15,\"OK\",\"Contacter le chef\")","v":"Contacter le chef"}]
[{"$f":"A13+1","v":"2021-01-02"},"",null,{"$f":"IF(C14>15,\"OK\",\"Contacter le chef\")","v":"Contacter le chef"},null,"",null,{"$f":"IF(G14>15,\"OK\",\"Contacter le chef\")","v":"Contacter le chef"}]
[{"$f":"A14+1","v":"2021-01-03"},"",null,"Contacter le chef",null,"",null,"Contacter le chef"]
["2021-01-04","",null,"Contacter le chef",null,"",null,"Contacter le chef"]
["2021-01-05","",null,"Contacter le chef",null,"",null,"Contacter le chef"]
["2021-01-06","",null,"Contacter le chef",null,"",null,"Contacter le chef"]
["2021-01-07","",null,"Contacter le chef",null,"",null,"Contacter le chef"]
["2021-01-08","",null,"Contacter le chef",null,"",null,"Contacter le chef"]
["2021-01-09","",null,"Contacter le chef",null,"",null,"Contacter le chef"]
["2021-01-10","",null,"Contacter le chef",null,"",null,"Contacter le chef"]
["2021-01-11","",null,"Contacter le chef",null,"",null,"Contacter le chef"]
["2021-01-12","",null,"Contacter le chef",null,"",null,"Contacter le chef"]
["2021-01-13","",null,"Contacter le chef",null,"",null,"Contacter le chef"]
["2021-01-14","",null,"Contacter le chef",null,"",null,"Contacter le chef"]
["2021-01-15","",null,"Contacter le chef",null,"",null,"Contacter le chef"]
["2021-01-16","",null,"Contacter le chef",null,"",null,"Contacter le chef"]
["2021-01-17","",null,"Contacter le chef",null,"",null,"Contacter le chef"]
["2021-01-18","",null,"Contacter le chef",null,"",null,"Contacter le chef"]
["2021-01-19","",null,"Contacter le chef",null,"",null,"Contacter le chef"]
["2021-01-20","",null,"Contacter le chef",null,"",null,"Contacter le chef"]
["2021-01-21","",null,"Contacter le chef",null,"",null,"Contacter le chef"]
["2021-01-22","",null,"Contacter le chef",null,"",null,"Contacter le chef"]
["2021-01-23","",null,"Contacter le chef",null,"",null,"Contacter le chef"]
["2021-01-24","",null,"Contacter le chef",null,"",null,"Contacter le chef"]
[{"$f":"A36+1","v":"2021-01-25"},"",null,"Contacter le chef",null,"",null,"Contacter le chef"]
[{"$f":"A37+1","v":"2021-01-26"},"",null,"Contacter le chef",null,"",null,"Contacter le chef"]
["2021-01-27","",null,"Contacter le chef",null,"",null,"Contacter le chef"]
["2021-01-28","",null,"Contacter le chef",null,"",null,"Contacter le chef"]
["2021-01-29","",null,"Contacter le chef",null,"",null,"Contacter le chef"]
["2021-01-30","",null,"Contacter le chef",null,"",null,"Contacter le chef"]
[{"$f":"A42+1","v":"2021-01-31"},"",null,"Contacter le chef",null,"",null,"Contacter le chef"]
[]
[null,"Contrôle"]
[null,"Signature"]
[]
[]
[]
[]
[]
["Relevé des températures"]
[]
[]
[{"$f":"A5","v":"2020-04-01"}]
[{"$nulls":5},"Document de référence :","Directives_Frigos"]
[null,"Fréquence =>",null,null,"le matin et le soir :","Relevé des températures et contrôle des rangements"]
[]
[]
[null,"Congélateur S/Sol",{"$nulls":7},"Mesure"]
["Valeurs \ncibles =>","Minimum  -15° C                                                                                ",null," Maximum -22°C    ",null,"Minimum  -15° C                                                                                  ",null,"Maximum -22°C          ",null,"en cas de température\nNon-conforme","Visa responsable"]
["Date","Heure","T°","Résultat","Visa","Heure","T°","Résultat","Visa"]
["2021-01-01",{"$f":"IF(C63=\"\",\"\",IF(B63<>\"\",B63,NOW()))","v":""},null,{"$f":"IF(C63>15,\"OK\",\"Contacter le chef\")","v":"Contacter le chef"},null,{"$f":"IF(G63=\"\",\"\",IF(F63<>\"\",F63,NOW()))","v":""},null,{"$f":"IF(G63>15,\"OK\",\"Contacter le chef\")","v":"Contacter le chef"}]
[{"$f":"A63+1","v":"2021-01-02"},"",null,{"$f":"IF(C64>15,\"OK\",\"Contacter le chef\")","v":"Contacter le chef"},null,"",null,{"$f":"IF(G64>15,\"OK\",\"Contacter le chef\")","v":"Contacter le chef"}]
[{"$f":"A64+1","v":"2021-01-03"},"",null,"Contacter le chef",null,"",null,"Contacter le chef"]
["2021-01-04","",null,"Contacter le chef",null,"",null,"Contacter le chef"]
["2021-01-05","",null,"Contacter le chef",null,"",null,"Contacter le chef"]
["2021-01-06","",null,"Contacter le chef",null,"",null,"Contacter le chef"]
["2021-01-07","",null,"Contacter le chef",null,"",null,"Contacter le chef"]
["2021-01-08","",null,"Contacter le chef",null,"",null,"Contacter le chef"]
["2021-01-09","",null,"Contacter le chef",null,"",null,"Contacter le chef"]
["2021-01-10","",null,"Contacter le chef",null,"",null,"Contacter le chef"]
["2021-01-11","",null,"Contacter le chef",null,"",null,"Contacter le chef"]
["2021-01-12","",null,"Contacter le chef",null,"",null,"Contacter le chef"]
["2021-01-13","",null,"Contacter le chef",null,"",null,"Contacter le chef"]
["2021-01-14","",null,"Contacter le chef",null,"",null,"Contacter le chef"]
["2021-01-15","",null,"Contacter le chef",null,"",null,"Contacter le chef"]
["2021-01-16","",null,"Contacter le chef",null,"",null,"Contacter le chef"]
["2021-01-17","",null,"Contacter le chef",null,"",null,"Contacter le chef"]
["2021-01-18","",null,"Contacter le chef",null,"",null,"Contacter le chef"]
["2021-01-19","",null,"Contacter le chef",null,"",null,"Contacter le chef"]
["2021-01-20","",null,"Contacter le chef",null,"",null,"Contacter le chef"]
["2021-01-21","",null,"Contacter le chef",null,"",null,"Contacter le chef"]
["2021-01-22","",null,"Contacter le chef",null,"",null,"Contacter le chef"]
["2021-01-23","",null,"Contacter le chef",null,"",null,"Contacter le chef"]
["2021-01-24","",null,"Contacter le chef",null,"",null,"Contacter le chef"]
[{"$f":"A86+1","v":"2021-01-25"},"",null,"Contacter le chef",null,"",null,"Contacter le chef"]
[{"$f":"A87+1","v":"2021-01-26"},"",null,"Contacter le chef",null,"",null,"Contacter le chef"]
["2021-01-27","",null,"Contacter le chef",null,"",null,"Contacter le chef"]
["2021-01-28","",null,"Contacter le chef",null,"",null,"Contacter le chef"]
["2021-01-29","",null,"Contacter le chef",null,"",null,"Contacter le chef"]
["2021-01-30","",null,"Contacter le chef",null,"",null,"Contacter le chef"]
[{"$f":"A92+1","v":"2021-01-31"},"",null,"Contacter le chef",null,"",null,"Contacter le chef"]
[]
["Relevé des températures"]
[]
[]
[{"$f":"A5","v":"2020-04-01"}]
[{"$nulls":5},"Document de référence :","Directives_Frigos"]
[null,"Fréquence =>",null,null,"le matin et le soir :","Relevé des températures et contrôle des rangements"]
[]
[]
[null,"Frigo cuisine",{"$nulls":7},"Mesure"]
["Valeurs \ncibles =>","Minimum  7° C                                                                                ",null," Maximum 3°C    ",null,"Minimum  7° C                                                                                ",null," Maximum 3°C    ",null,"en cas de température\nNon-conforme","Visa responsable"]
["Date","Heure","T°","Résultat","Visa","Heure","T°","Résultat","Visa"]
["2021-01-01",{"$f":"IF(C106=\"\",\"\",IF(B106<>\"\",B106,NOW()))","v":""},null,{"$f":"IF(C106<8,\"OK\",\"Contacter le chef\")","v":"OK"},null,{"$f":"IF(G106=\"\",\"\",IF(F106<>\"\",F106,NOW()))","v":""},null,{"$f":"IF(G106<8,\"OK\",\"Contacter le chef\")","v":"OK"}]
[{"$f":"A106+1","v":"2021-01-02"},"",null,"OK",null,"",null,"OK"]
[{"$f":"A107+1","v":"2021-01-03"},"",null,"OK",null,"",null,"OK"]
["2021-01-04","",null,"OK",null,"",null,"OK"]
["2021-01-05","",null,"OK",null,"",null,"OK"]
["2021-01-06","",null,"OK",null,"",null,"OK"]
["2021-01-07","",null,"OK",null,"",null,"OK"]
["2021-01-08","",null,"OK",null,"",null,"OK"]
["2021-01-09","",null,"OK",null,"",null,"OK"]
["2021-01-10","",null,"OK",null,"",null,"OK"]
["2021-01-11","",null,"OK",null,"",null,"OK"]
["2021-01-12","",null,"OK",null,"",null,"OK"]
["2021-01-13","",null,"OK",null,"",null,"OK"]
["2021-01-14","",null,"OK",null,"",null,"OK"]
["2021-01-15","",null,"OK",null,"",null,"OK"]
["2021-01-16","",null,"OK",null,"",null,"OK"]
["2021-01-17","",null,"OK",null,"",null,"OK"]
["2021-01-18","",null,"OK",null,"",null,"OK"]
["2021-01-19","",null,"OK",null,"",null,"OK"]
["2021-01-20","",null,"OK",null,"",null,"OK"]
["2021-01-21","",null,"OK",null,"",null,"OK"]
["2021-01-22","",null,"OK",null,"",null,"OK"]
["2021-01-23","",null,"OK",null,"",null,"OK"]
["2021-01-24","",null,"OK",null,"",null,"OK"]
[{"$f":"A129+1","v":"2021-01-25"},"",null,"OK",null,"",null,"OK"]
[{"$f":"A130+1","v":"2021-01-26"},"",null,"OK",null,"",null,"OK"]
["2021-01-27","",null,"OK",null,"",null,"OK"]
["2021-01-28","",null,"OK",null,"",null,"OK"]
["2021-01-29","",null,"OK",null,"",null,"OK"]
["2021-01-30","",null,"OK",null,"",null,"OK"]
[{"$f":"A135+1","v":"2021-01-31"},"",null,"OK",null,"",null,"OK"]
[]
[]
["Relevé des températures"]
[]
[]
[{"$f":"A98","v":"2020-04-01"}]
[{"$nulls":5},"Document de référence :","Directives_Frigos"]
[null,"Fréquence =>",null,null,"le matin et le soir :","Relevé des températures et contrôle des rangements"]
[]
[]
[null,"Frigo MEP",{"$nulls":7},"Mesure"]
["Valeurs \ncibles =>","Minimum  7° C                                                                                ",null," Maximum 3°C    ",null,"Minimum  7° C                                                                                ",null," Maximum 3°C    ",null,"en cas de température\nNon-conforme","Visa responsable"]
["Date","Heure","T°","Résultat","Visa","Heure","T°","Résultat","Visa"]
["2021-01-01",{"$f":"IF(C150=\"\",\"\",IF(B150<>\"\",B150,NOW()))","v":""},null,{"$f":"IF(C150<8,\"OK\",\"Contacter le chef\")","v":"OK"},null,{"$f":"IF(G150=\"\",\"\",IF(F150<>\"\",F150,NOW()))","v":""},null,{"$f":"IF(G150<8,\"OK\",\"Contacter le chef\")","v":"OK"}]
[{"$f":"A150+1","v":"2021-01-02"},"",null,"OK",null,"",null,"OK"]
[{"$f":"A151+1","v":"2021-01-03"},"",null,"OK",null,"",null,"OK"]
["2021-01-04","",null,"OK",null,"",null,"OK"]
["2021-01-05","",null,"OK",null,"",null,"OK"]
["2021-01-06","",null,"OK",null,"",null,"OK"]
["2021-01-07","",null,"OK",null,"",null,"OK"]
["2021-01-08","",null,"OK",null,"",null,"OK"]
["2021-01-09","",null,"OK",null,"",null,"OK"]
["2021-01-10","",null,"OK",null,"",null,"OK"]
["2021-01-11","",null,"OK",null,"",null,"OK"]
["2021-01-12","",null,"OK",null,"",null,"OK"]
["2021-01-13","",null,"OK",null,"",null,"OK"]
["2021-01-14","",null,"OK",null,"",null,"OK"]
["2021-01-15","",null,"OK",null,"",null,"OK"]
["2021-01-16","",null,"OK",null,"",null,"OK"]
["2021-01-17","",null,"OK",null,"",null,"OK"]
["2021-01-18","",null,"OK",null,"",null,"OK"]
["2021-01-19","",null,"OK",null,"",null,"OK"]
["2021-01-20","",null,"OK",null,"",null,"OK"]
["2021-01-21","",null,"OK",null,"",null,"OK"]
["2021-01-22","",null,"OK",null,"",null,"OK"]
["2021-01-23","",null,"OK",null,"",null,"OK"]
["2021-01-24","",null,"OK",null,"",null,"OK"]
[{"$f":"A173+1","v":"2021-01-25"},"",null,"OK",null,"",null,"OK"]
[{"$f":"A174+1","v":"2021-01-26"},"",null,"OK",null,"",null,"OK"]
["2021-01-27","",null,"OK",null,"",null,"OK"]
["2021-01-28","",null,"OK",null,"",null,"OK"]
["2021-01-29","",null,"OK",null,"",null,"OK"]
["2021-01-30","",null,"OK",null,"",null,"OK"]
[{"$f":"A179+1","v":"2021-01-31"},"",null,"OK",null,"",null,"OK"]
[]
["Relevé des températures"]
[]
[]
[{"$f":"A142","v":"2020-04-01"}]
[{"$nulls":5},"Document de référence :","Directives_Frigos"]
[null,"Fréquence =>",null,null,"le matin et le soir :","Relevé des températures et contrôle des rangements"]
[]
[]
[null,"Frigo pâtisserie",{"$nulls":7},"Mesure"]
["Valeurs \ncibles =>","Minimum  7° C                                                                                ",null," Maximum 3°C    ",null,"Minimum  7° C                                                                                ",null," Maximum 3°C    ",null,"en cas de température\nNon-conforme","Visa responsable"]
["Date","Heure","T°","Résultat","Visa","Heure","T°","Résultat","Visa"]
["2021-01-01",{"$f":"IF(C193=\"\",\"\",IF(B193<>\"\",B193,NOW()))","v":""},null,{"$f":"IF(C193<8,\"OK\",\"Contacter le chef\")","v":"OK"},null,{"$f":"IF(G193=\"\",\"\",IF(F193<>\"\",F193,NOW()))","v":""},null,{"$f":"IF(G193<8,\"OK\",\"Contacter le chef\")","v":"OK"}]
[{"$f":"A193+1","v":"2021-01-02"},"",null,"OK",null,"",null,"OK"]
[{"$f":"A194+1","v":"2021-01-03"},"",null,"OK",null,"",null,"OK"]
["2021-01-04","",null,"OK",null,"",null,"OK"]
["2021-01-05","",null,"OK",null,"",null,"OK"]
["2021-01-06","",null,"OK",null,"",null,"OK"]
["2021-01-07","",null,"OK",null,"",null,"OK"]
["2021-01-08","",null,"OK",null,"",null,"OK"]
["2021-01-09","",null,"OK",null,"",null,"OK"]
["2021-01-10","",null,"OK",null,"",null,"OK"]
["2021-01-11","",null,"OK",null,"",null,"OK"]
["2021-01-12","",null,"OK",null,"",null,"OK"]
["2021-01-13","",null,"OK",null,"",null,"OK"]
["2021-01-14","",null,"OK",null,"",null,"OK"]
["2021-01-15","",null,"OK",null,"",null,"OK"]
["2021-01-16","",null,"OK",null,"",null,"OK"]
["2021-01-17","",null,"OK",null,"",null,"OK"]
["2021-01-18","",null,"OK",null,"",null,"OK"]
["2021-01-19","",null,"OK",null,"",null,"OK"]
["2021-01-20","",null,"OK",null,"",null,"OK"]
["2021-01-21","",null,"OK",null,"",null,"OK"]
["2021-01-22","",null,"OK",null,"",null,"OK"]
["2021-01-23","",null,"OK",null,"",null,"OK"]
["2021-01-24","",null,"OK",null,"",null,"OK"]
[{"$f":"A216+1","v":"2021-01-25"},"",null,"OK",null,"",null,"OK"]
[{"$f":"A217+1","v":"2021-01-26"},"",null,"OK",null,"",null,"OK"]
["2021-01-27","",null,"OK",null,"",null,"OK"]
["2021-01-28","",null,"OK",null,"",null,"OK"]
["2021-01-29","",null,"OK",null,"",null,"OK"]
["2021-01-30","",null,"OK",null,"",null,"OK"]
[{"$f":"A222+1","v":"2021-01-31"},"",null,"OK",null,"",null,"OK"]
[]
["Relevé des températures"]
[]
[]
[{"$f":"A185","v":"2020-04-01"}]
[{"$nulls":5},"Document de référence :","Directives_Frigos"]
[null,"Fréquence =>",null,null,"le matin et le soir :","Relevé des températures et contrôle des rangements"]
[]
[]
[null,"Frigo produits laitiers",{"$nulls":7},"Mesure"]
["Valeurs \ncibles =>","Minimum  7° C                                                                                ",null," Maximum 3°C    ",null,"Minimum  7° C                                                                                ",null," Maximum 3°C    ",null,"en cas de température\nNon-conforme","Visa responsable"]
["Date","Heure","T°","Résultat","Visa","Heure","T°","Résultat","Visa"]
["2021-01-01",{"$f":"IF(C236=\"\",\"\",IF(B236<>\"\",B236,NOW()))","v":""},null,{"$f":"IF(C236<8,\"OK\",\"Contacter le chef\")","v":"OK"},null,{"$f":"IF(G236=\"\",\"\",IF(F236<>\"\",F236,NOW()))","v":""},null,{"$f":"IF(G236<8,\"OK\",\"Contacter le chef\")","v":"OK"}]
[{"$f":"A236+1","v":"2021-01-02"},"",null,"OK",null,"",null,"OK"]
[{"$f":"A237+1","v":"2021-01-03"},"",null,"OK",null,"",null,"OK"]
["2021-01-04","",null,"OK",null,"",null,"OK"]
["2021-01-05","",null,"OK",null,"",null,"OK"]
["2021-01-06","",null,"OK",null,"",null,"OK"]
["2021-01-07","",null,"OK",null,"",null,"OK"]
["2021-01-08","",null,"OK",null,"",null,"OK"]
["2021-01-09","",null,"OK",null,"",null,"OK"]
["2021-01-10","",null,"OK",null,"",null,"OK"]
["2021-01-11","",null,"OK",null,"",null,"OK"]
["2021-01-12","",null,"OK",null,"",null,"OK"]
["2021-01-13","",null,"OK",null,"",null,"OK"]
["2021-01-14","",null,"OK",null,"",null,"OK"]
["2021-01-15","",null,"OK",null,"",null,"OK"]
["2021-01-16","",null,"OK",null,"",null,"OK"]
["2021-01-17","",null,"OK",null,"",null,"OK"]
["2021-01-18","",null,"OK",null,"",null,"OK"]
["2021-01-19","",null,"OK",null,"",null,"OK"]
["2021-01-20","",null,"OK",null,"",null,"OK"]
["2021-01-21","",null,"OK",null,"",null,"OK"]
["2021-01-22","",null,"OK",null,"",null,"OK"]
["2021-01-23","",null,"OK",null,"",null,"OK"]
["2021-01-24","",null,"OK",null,"",null,"OK"]
[{"$f":"A259+1","v":"2021-01-25"},"",null,"OK",null,"",null,"OK"]
[{"$f":"A260+1","v":"2021-01-26"},"",null,"OK",null,"",null,"OK"]
["2021-01-27","",null,"OK",null,"",null,"OK"]
["2021-01-28","",null,"OK",null,"",null,"OK"]
["2021-01-29","",null,"OK",null,"",null,"OK"]
["2021-01-30","",null,"OK",null,"",null,"OK"]
[{"$f":"A265+1","v":"2021-01-31"},"",null,"OK",null,"",null,"OK"]
[]
[]
["Relevé des températures"]
[]
[]
[{"$f":"A228","v":"2020-04-01"}]
[{"$nulls":5},"Document de référence :","Directives_Frigos"]
[null,"Fréquence =>",null,null,"le matin et le soir :","Relevé des températures et contrôle des rangements"]
[]
[]
[null,"Frigo S/Sol",{"$nulls":7},"Mesure"]
["Valeurs \ncibles =>","Minimum  7° C                                                                                ",null," Maximum 3°C    ",null,"Minimum  7° C                                                                                ",null," Maximum 3°C    ",null,"en cas de température\nNon-conforme","Visa responsable"]
["Date","Heure","T°","Résultat","Visa","Heure","T°","Résultat","Visa"]
["2021-01-01",{"$f":"IF(C280=\"\",\"\",IF(B280<>\"\",B280,NOW()))","v":""},null,{"$f":"IF(C280<8,\"OK\",\"Contacter le chef\")","v":"OK"},null,{"$f":"IF(G280=\"\",\"\",IF(F280<>\"\",F280,NOW()))","v":""},null,{"$f":"IF(G280<8,\"OK\",\"Contacter le chef\")","v":"OK"}]
[{"$f":"A280+1","v":"2021-01-02"},"",null,{"$f":"IF(C281<8,\"OK\",\"Contacter le chef\")","v":"OK"},null,"",null,"OK"]
[{"$f":"A281+1","v":"2021-01-03"},"",null,"OK",null,"",null,"OK"]
["2021-01-04","",null,"OK",null,"",null,"OK"]
["2021-01-05","",null,"OK",null,"",null,"OK"]
["2021-01-06","",null,"OK",null,"",null,"OK"]
["2021-01-07","",null,"OK",null,"",null,"OK"]
["2021-01-08","",null,"OK",null,"",null,"OK"]
["2021-01-09","",null,"OK",null,"",null,"OK"]
["2021-01-10","",null,"OK",null,"",null,"OK"]
["2021-01-11","",null,"OK",null,"",null,"OK"]
["2021-01-12","",null,"OK",null,"",null,"OK"]
["2021-01-13","",null,"OK",null,"",null,"OK"]
["2021-01-14","",null,"OK",null,"",null,"OK"]
["2021-01-15","",null,"OK",null,"",null,"OK"]
["2021-01-16","",null,"OK",null,"",null,"OK"]
["2021-01-17","",null,"OK",null,"",null,"OK"]
["2021-01-18","",null,"OK",null,"",null,"OK"]
["2021-01-19","",null,"OK",null,"",null,"OK"]
["2021-01-20","",null,"OK",null,"",null,"OK"]
["2021-01-21","",null,"OK",null,"",null,"OK"]
["2021-01-22","",null,"OK",null,"",null,"OK"]
["2021-01-23","",null,"OK",null,"",null,"OK"]
["2021-01-24","",null,"OK",null,"",null,"OK"]
[{"$f":"A303+1","v":"2021-01-25"},"",null,"OK",null,"",null,"OK"]
[{"$f":"A304+1","v":"2021-01-26"},"",null,"OK",null,"",null,"OK"]
["2021-01-27","",null,"OK",null,"",null,"OK"]
["2021-01-28","",null,"OK",null,"",null,"OK"]
["2021-01-29","",null,"OK",null,"",null,"OK"]
["2021-01-30","",null,"OK",null,"",null,"OK"]
[{"$f":"A309+1","v":"2021-01-31"},"",null,"OK",null,"",null,"OK"]

{"sheet":"Mai","index":4,"n_rows":310,"n_cols":11,"rows_kept":310,"merged":[[0,0,0,9],[1,0,1,9],[4,0,4,9],[9,1,9,8],[50,0,50,9],[51,0,51,9],[54,0,54,9],[59,1,59,8],[93,0,93,9],[94,0,94,9],[97,0,97,9],[102,1,102,8],[103,1,103,2],[103,5,103,6],[137,0,137,9],[138,0,138,9],[141,0,141,10],[146,1,146,8],[147,1,147,2],[147,5,147,6],[180,0,180,9],[181,0,181,9],[184,0,184,9],[189,1,189,8],[190,1,190,2],[190,5,190,6],[223,0,223,9],[224,0,224,9],[227,0,227,9],[232,1,232,8],[233,1,233,2],[233,5,233,6],[267,0,267,9],[268,0,268,9],[271,0,271,9],[276,1,276,8],[277,1,277,2],[277,5,277,6]]}
[]
["Relevé des températures"]
[]
[]
["2021-05-01"]
[{"$nulls":5},"Document de référence :","Directives_Frigos"]
[null,"Fréquence =>",null,null,"le matin et le soir :","Relevé des températures "]
[]
[]
[null,"Congélateur cuisine",{"$nulls":7},"Mesure"]
["Valeurs \ncibles =>","Minimum  -15° C                                                                                ",null," Maximum -22°C    ",null,"Minimum  -15° C                                                                                  ",null,"Maximum -22°C          ",null,"en cas de température\nNon-conforme","Visa responsable"]
["Date","Heure","T°","Résultat","Visa","Heure","T°","Résultat","Visa"]
["2021-01-01",{"$f":"IF(C13=\"\",\"\",IF(B13<>\"\",B13,NOW()))","v":""},null,{"$f":"IF(C13>15,\"OK\",\"Contacter le chef\")","v":"Contacter le chef"},null,{"$f":"IF(G13=\"\",\"\",IF(F13<>\"\",F13,NOW()))","v":""},null,{"$f":"IF(G13>15,\"OK\",\"Contacter le chef\")","v":"Contacter le chef"}]
[{"$f":"A13+1","v":"2021-01-02"},"",null,{"$f":"IF(C14>15,\"OK\",\"Contacter le chef\")","v":"Contacter le chef"},null,"",null,{"$f":"IF(G14>15,\"OK\",\"Contacter le chef\")","v":"Contacter le chef"}]
[{"$f":"A14+1","v":"2021-01-03"},"",null,"Contacter le chef",null,"",null,"Contacter le chef"]
["2021-01-04","",null,"Contacter le chef",null,"",null,"Contacter le chef"]
["2021-01-05","",null,"Contacter le chef",null,"",null,"Contacter le chef"]
["2021-01-06","",null,"Contacter le chef",null,"",null,"Contacter le chef"]
["2021-01-07","",null,"Contacter le chef",null,"",null,"Contacter le chef"]
["2021-01-08","",null,"Contacter le chef",null,"",null,"Contacter le chef"]
["2021-01-09","",null,"Contacter le chef",null,"",null,"Contacter le chef"]
["2021-01-10","",null,"Contacter le chef",null,"",null,"Contacter le chef"]
["2021-01-11","",null,"Contacter le chef",null,"",null,"Contacter le chef"]
["2021-01-12","",null,"Contacter le chef",null,"",null,"Contacter le chef"]
["2021-01-13","",null,"Contacter le chef",null,"",null,"Contacter le chef"]
["2021-01-14","",null,"Contacter le chef",null,"",null,"Contacter le chef"]
["2021-01-15","",null,"Contacter le chef",null,"",null,"Contacter le chef"]
["2021-01-16","",null,"Contacter le chef",null,"",null,"Contacter le chef"]
["2021-01-17","",null,"Contacter le chef",null,"",null,"Contacter le chef"]
["2021-01-18","",null,"Contacter le chef",null,"",null,"Contacter le chef"]
["2021-01-19","",null,"Contacter le chef",null,"",null,"Contacter le chef"]
["2021-01-20","",null,"Contacter le chef",null,"",null,"Contacter le chef"]
["2021-01-21","",null,"Contacter le chef",null,"",null,"Contacter le chef"]
["2021-01-22","",null,"Contacter le chef",null,"",null,"Contacter le chef"]
["2021-01-23","",null,"Contacter le chef",null,"",null,"Contacter le chef"]
["2021-01-24","",null,"Contacter le chef",null,"",null,"Contacter le chef"]
[{"$f":"A36+1","v":"2021-01-25"},"",null,"Contacter le chef",null,"",null,"Contacter le chef"]
[{"$f":"A37+1","v":"2021-01-26"},"",null,"Contacter le chef",null,"",null,"Contacter le chef"]
["2021-01-27","",null,"Contacter le chef",null,"",null,"Contacter le chef"]
["2021-01-28","",null,"Contacter le chef",null,"",null,"Contacter le chef"]
["2021-01-29","",null,"Contacter le chef",null,"",null,"Contacter le chef"]
["2021-01-30","",null,"Contacter le chef",null,"",null,"Contacter le chef"]
[{"$f":"A42+1","v":"2021-01-31"},"",null,"Contacter le chef",null,"",null,"Contacter le chef"]
[]
[null,"Contrôle"]
[null,"Signature"]
[]
[]
[]
[]
[]
["Relevé des températures"]
[]
[]
[{"$f":"A5","v":"2021-05-01"}]
[{"$nulls":5},"Document de référence :","Directives_Frigos"]
[null,"Fréquence =>",null,null,"le matin et le soir :","Relevé des températures et contrôle des rangements"]
[]
[]
[null,"Congélateur S/Sol",{"$nulls":7},"Mesure"]
["Valeurs \ncibles =>","Minimum  -15° C                                                                                ",null," Maximum -22°C    ",null,"Minimum  -15° C                                                                                  ",null,"Maximum -22°C          ",null,"en cas de température\nNon-conforme","Visa responsable"]
["Date","Heure","T°","Résultat","Visa","Heure","T°","Résultat","Visa"]
["2021-01-01",{"$f":"IF(C63=\"\",\"\",IF(B63<>\"\",B63,NOW()))","v":""},null,{"$f":"IF(C63>15,\"OK\",\"Contacter le chef\")","v":"Contacter le chef"},null,{"$f":"IF(G63=\"\",\"\",IF(F63<>\"\",F63,NOW()))","v":""},null,{"$f":"IF(G63>15,\"OK\",\"Contacter le chef\")","v":"Contacter le chef"}]
[{"$f":"A63+1","v":"2021-01-02"},"",null,{"$f":"IF(C64>15,\"OK\",\"Contacter le chef\")","v":"Contacter le chef"},null,"",null,{"$f":"IF(G64>15,\"OK\",\"Contacter le chef\")","v":"Contacter le chef"}]
[{"$f":"A64+1","v":"2021-01-03"},"",null,"Contacter le chef",null,"",null,"Contacter le chef"]
["2021-01-04","",null,"Contacter le chef",null,"",null,"Contacter le chef"]
["2021-01-05","",null,"Contacter le chef",null,"",null,"Contacter le chef"]
["2021-01-06","",null,"Contacter le chef",null,"",null,"Contacter le chef"]
["2021-01-07","",null,"Contacter le chef",null,"",null,"Contacter le chef"]
["2021-01-08","",null,"Contacter le chef",null,"",null,"Contacter le chef"]
["2021-01-09","",null,"Contacter le chef",null,"",null,"Contacter le chef"]
["2021-01-10","",null,"Contacter le chef",null,"",null,"Contacter le chef"]
["2021-01-11","",null,"Contacter le chef",null,"",null,"Contacter le chef"]
["2021-01-12","",null,"Contacter le chef",null,"",null,"Contacter le chef"]
["2021-01-13","",null,"Contacter le chef",null,"",null,"Contacter le chef"]
["2021-01-14","",null,"Contacter le chef",null,"",null,"Contacter le chef"]
["2021-01-15","",null,"Contacter le chef",null,"",null,"Contacter le chef"]
["2021-01-16","",null,"Contacter le chef",null,"",null,"Contacter le chef"]
["2021-01-17","",null,"Contacter le chef",null,"",null,"Contacter le chef"]
["2021-01-18","",null,"Contacter le chef",null,"",null,"Contacter le chef"]
["2021-01-19","",null,"Contacter le chef",null,"",null,"Contacter le chef"]
["2021-01-20","",null,"Contacter le chef",null,"",null,"Contacter le chef"]
["2021-01-21","",null,"Contacter le chef",null,"",null,"Contacter le chef"]
["2021-01-22","",null,"Contacter le chef",null,"",null,"Contacter le chef"]
["2021-01-23","",null,"Contacter le chef",null,"",null,"Contacter le chef"]
["2021-01-24","",null,"Contacter le chef",null,"",null,"Contacter le chef"]
[{"$f":"A86+1","v":"2021-01-25"},"",null,"Contacter le chef",null,"",null,"Contacter le chef"]
[{"$f":"A87+1","v":"2021-01-26"},"",null,"Contacter le chef",null,"",null,"Contacter le chef"]
["2021-01-27","",null,"Contacter le chef",null,"",null,"Contacter le chef"]
["2021-01-28","",null,"Contacter le chef",null,"",null,"Contacter le chef"]
["2021-01-29","",null,"Contacter le chef",null,"",null,"Contacter le chef"]
["2021-01-30","",null,"Contacter le chef",null,"",null,"Contacter le chef"]
[{"$f":"A92+1","v":"2021-01-31"},"",null,"Contacter le chef",null,"",null,"Contacter le chef"]
[]
["Relevé des températures"]
[]
[]
[{"$f":"A5","v":"2021-05-01"}]
[{"$nulls":5},"Document de référence :","Directives_Frigos"]
[null,"Fréquence =>",null,null,"le matin et le soir :","Relevé des températures et contrôle des rangements"]
[]
[]
[null,"Frigo cuisine",{"$nulls":7},"Mesure"]
["Valeurs \ncibles =>","Minimum  7° C                                                                                ",null," Maximum 3°C    ",null,"Minimum  7° C                                                                                ",null," Maximum 3°C    ",null,"en cas de température\nNon-conforme","Visa responsable"]
["Date","Heure","T°","Résultat","Visa","Heure","T°","Résultat","Visa"]
["2021-01-01",{"$f":"IF(C106=\"\",\"\",IF(B106<>\"\",B106,NOW()))","v":""},null,{"$f":"IF(C106<8,\"OK\",\"Contacter le chef\")","v":"OK"},null,{"$f":"IF(G106=\"\",\"\",IF(F106<>\"\",F106,NOW()))","v":""},null,{"$f":"IF(G106<8,\"OK\",\"Contacter le chef\")","v":"OK"}]
[{"$f":"A106+1","v":"2021-01-02"},"",null,"OK",null,"",null,"OK"]
[{"$f":"A107+1","v":"2021-01-03"},"",null,"OK",null,"",null,"OK"]
["2021-01-04","",null,"OK",null,"",null,"OK"]
["2021-01-05","",null,"OK",null,"",null,"OK"]
["2021-01-06","",null,"OK",null,"",null,"OK"]
["2021-01-07","",null,"OK",null,"",null,"OK"]
["2021-01-08","",null,"OK",null,"",null,"OK"]
["2021-01-09","",null,"OK",null,"",null,"OK"]
["2021-01-10","",null,"OK",null,"",null,"OK"]
["2021-01-11","",null,"OK",null,"",null,"OK"]
["2021-01-12","",null,"OK",null,"",null,"OK"]
["2021-01-13","",null,"OK",null,"",null,"OK"]
["2021-01-14","",null,"OK",null,"",null,"OK"]
["2021-01-15","",null,"OK",null,"",null,"OK"]
["2021-01-16","",null,"OK",null,"",null,"OK"]
["2021-01-17","",null,"OK",null,"",null,"OK"]
["2021-01-18","",null,"OK",null,"",null,"OK"]
["2021-01-19","",null,"OK",null,"",null,"OK"]
["2021-01-20","",null,"OK",null,"",null,"OK"]
["2021-01-21","",null,"OK",null,"",null,"OK"]
["2021-01-22","",null,"OK",null,"",null,"OK"]
["2021-01-23","",null,"OK",null,"",null,"OK"]
["2021-01-24","",null,"OK",null,"",null,"OK"]
[{"$f":"A129+1","v":"2021-01-25"},"",null,"OK",null,"",null,"OK"]
[{"$f":"A130+1","v":"2021-01-26"},"",null,"OK",null,"",null,"OK"]
["2021-01-27","",null,"OK",null,"",null,"OK"]
["2021-01-28","",null,"OK",null,"",null,"OK"]
["2021-01-29","",null,"OK",null,"",null,"OK"]
["2021-01-30","",null,"OK",null,"",null,"OK"]
[{"$f":"A135+1","v":"2021-01-31"},"",null,"OK",null,"",null,"OK"]
[]
[]
["Relevé des températures"]
[]
[]
[{"$f":"A98","v":"2021-05-01"}]
[{"$nulls":5},"Document de référence :","Directives_Frigos"]
[null,"Fréquence =>",null,null,"le matin et le soir :","Relevé des températures et contrôle des rangements"]
[]
[]
[null,"Frigo MEP",{"$nulls":7},"Mesure"]
["Valeurs \ncibles =>","Minimum  7° C                                                                                ",null," Maximum 3°C    ",null,"Minimum  7° C                                                                                ",null," Maximum 3°C    ",null,"en cas de température\nNon-conforme","Visa responsable"]
["Date","Heure","T°","Résultat","Visa","Heure","T°","Résultat","Visa"]
["2021-01-01",{"$f":"IF(C150=\"\",\"\",IF(B150<>\"\",B150,NOW()))","v":""},null,{"$f":"IF(C150<8,\"OK\",\"Contacter le chef\")","v":"OK"},null,{"$f":"IF(G150=\"\",\"\",IF(F150<>\"\",F150,NOW()))","v":""},null,{"$f":"IF(G150<8,\"OK\",\"Contacter le chef\")","v":"OK"}]
[{"$f":"A150+1","v":"2021-01-02"},"",null,"OK",null,"",null,"OK"]
[{"$f":"A151+1","v":"2021-01-03"},"",null,"OK",null,"",null,"OK"]
["2021-01-04","",null,"OK",null,"",null,"OK"]
["2021-01-05","",null,"OK",null,"",null,"OK"]
["2021-01-06","",null,"OK",null,"",null,"OK"]
["2021-01-07","",null,"OK",null,"",null,"OK"]
["2021-01-08","",null,"OK",null,"",null,"OK"]
["2021-01-09","",null,"OK",null,"",null,"OK"]
["2021-01-10","",null,"OK",null,"",null,"OK"]
["2021-01-11","",null,"OK",null,"",null,"OK"]
["2021-01-12","",null,"OK",null,"",null,"OK"]
["2021-01-13","",null,"OK",null,"",null,"OK"]
["2021-01-14","",null,"OK",null,"",null,"OK"]
["2021-01-15","",null,"OK",null,"",null,"OK"]
["2021-01-16","",null,"OK",null,"",null,"OK"]
["2021-01-17","",null,"OK",null,"",null,"OK"]
["2021-01-18","",null,"OK",null,"",null,"OK"]
["2021-01-19","",null,"OK",null,"",null,"OK"]
["2021-01-20","",null,"OK",null,"",null,"OK"]
["2021-01-21","",null,"OK",null,"",null,"OK"]
["2021-01-22","",null,"OK",null,"",null,"OK"]
["2021-01-23","",null,"OK",null,"",null,"OK"]
["2021-01-24","",null,"OK",null,"",null,"OK"]
[{"$f":"A173+1","v":"2021-01-25"},"",null,"OK",null,"",null,"OK"]
[{"$f":"A174+1","v":"2021-01-26"},"",null,"OK",null,"",null,"OK"]
["2021-01-27","",null,"OK",null,"",null,"OK"]
["2021-01-28","",null,"OK",null,"",null,"OK"]
["2021-01-29","",null,"OK",null,"",null,"OK"]
["2021-01-30","",null,"OK",null,"",null,"OK"]
[{"$f":"A179+1","v":"2021-01-31"},"",null,"OK",null,"",null,"OK"]
[]
["Relevé des températures"]
[]
[]
[{"$f":"A142","v":"2021-05-01"}]
[{"$nulls":5},"Document de référence :","Directives_Frigos"]
[null,"Fréquence =>",null,null,"le matin et le soir :","Relevé des températures et contrôle des rangements"]
[]
[]
[null,"Frigo pâtisserie",{"$nulls":7},"Mesure"]
["Valeurs \ncibles =>","Minimum  7° C                                                                                ",null," Maximum 3°C    ",null,"Minimum  7° C                                                                                ",null," Maximum 3°C    ",null,"en cas de température\nNon-conforme","Visa responsable"]
["Date","Heure","T°","Résultat","Visa","Heure","T°","Résultat","Visa"]
["2021-01-01",{"$f":"IF(C193=\"\",\"\",IF(B193<>\"\",B193,NOW()))","v":""},null,{"$f":"IF(C193<8,\"OK\",\"Contacter le chef\")","v":"OK"},null,{"$f":"IF(G193=\"\",\"\",IF(F193<>\"\",F193,NOW()))","v":""},null,{"$f":"IF(G193<8,\"OK\",\"Contacter le chef\")","v":"OK"}]
[{"$f":"A193+1","v":"2021-01-02"},"",null,"OK",null,"",null,"OK"]
[{"$f":"A194+1","v":"2021-01-03"},"",null,"OK",null,"",null,"OK"]
["2021-01-04","",null,"OK",null,"",null,"OK"]
["2021-01-05","",null,"OK",null,"",null,"OK"]
["2021-01-06","",null,"OK",null,"",null,"OK"]
["2021-01-07","",null,"OK",null,"",null,"OK"]
["2021-01-08","",null,"OK",null,"",null,"OK"]
["2021-01-09","",null,"OK",null,"",null,"OK"]
["2021-01-10","",null,"OK",null,"",null,"OK"]
["2021-01-11","",null,"OK",null,"",null,"OK"]
["2021-01-12","",null,"OK",null,"",null,"OK"]
["2021-01-13","",null,"OK",null,"",null,"OK"]
["2021-01-14","",null,"OK",null,"",null,"OK"]
["2021-01-15","",null,"OK",null,"",null,"OK"]
["2021-01-16","",null,"OK",null,"",null,"OK"]
["2021-01-17","",null,"OK",null,"",null,"OK"]
["2021-01-18","",null,"OK",null,"",null,"OK"]
["2021-01-19","",null,"OK",null,"",null,"OK"]
["2021-01-20","",null,"OK",null,"",null,"OK"]
["2021-01-21","",null,"OK",null,"",null,"OK"]
["2021-01-22","",null,"OK",null,"",null,"OK"]
["2021-01-23","",null,"OK",null,"",null,"OK"]
["2021-01-24","",null,"OK",null,"",null,"OK"]
[{"$f":"A216+1","v":"2021-01-25"},"",null,"OK",null,"",null,"OK"]
[{"$f":"A217+1","v":"2021-01-26"},"",null,"OK",null,"",null,"OK"]
["2021-01-27","",null,"OK",null,"",null,"OK"]
["2021-01-28","",null,"OK",null,"",null,"OK"]
["2021-01-29","",null,"OK",null,"",null,"OK"]
["2021-01-30","",null,"OK",null,"",null,"OK"]
[{"$f":"A222+1","v":"2021-01-31"},"",null,"OK",null,"",null,"OK"]
[]
["Relevé des températures"]
[]
[]
[{"$f":"A185","v":"2021-05-01"}]
[{"$nulls":5},"Document de référence :","Directives_Frigos"]
[null,"Fréquence =>",null,null,"le matin et le soir :","Relevé des températures et contrôle des rangements"]
[]
[]
[null,"Frigo produits laitiers",{"$nulls":7},"Mesure"]
["Valeurs \ncibles =>","Minimum  7° C                                                                                ",null," Maximum 3°C    ",null,"Minimum  7° C                                                                                ",null," Maximum 3°C    ",null,"en cas de température\nNon-conforme","Visa responsable"]
["Date","Heure","T°","Résultat","Visa","Heure","T°","Résultat","Visa"]
["2021-01-01",{"$f":"IF(C236=\"\",\"\",IF(B236<>\"\",B236,NOW()))","v":""},null,{"$f":"IF(C236<8,\"OK\",\"Contacter le chef\")","v":"OK"},null,{"$f":"IF(G236=\"\",\"\",IF(F236<>\"\",F236,NOW()))","v":""},null,{"$f":"IF(G236<8,\"OK\",\"Contacter le chef\")","v":"OK"}]
[{"$f":"A236+1","v":"2021-01-02"},"",null,"OK",null,"",null,"OK"]
[{"$f":"A237+1","v":"2021-01-03"},"",null,"OK",null,"",null,"OK"]
["2021-01-04","",null,"OK",null,"",null,"OK"]
["2021-01-05","",null,"OK",null,"",null,"OK"]
["2021-01-06","",null,"OK",null,"",null,"OK"]
["2021-01-07","",null,"OK",null,"",null,"OK"]
["2021-01-08","",null,"OK",null,"",null,"OK"]
["2021-01-09","",null,"OK",null,"",null,"OK"]
["2021-01-10","",null,"OK",null,"",null,"OK"]
["2021-01-11","",null,"OK",null,"",null,"OK"]
["2021-01-12","",null,"OK",null,"",null,"OK"]
["2021-01-13","",null,"OK",null,"",null,"OK"]
["2021-01-14","",null,"OK",null,"",null,"OK"]
["2021-01-15","",null,"OK",null,"",null,"OK"]
["2021-01-16","",null,"OK",null,"",null,"OK"]
["2021-01-17","",null,"OK",null,"",null,"OK"]
["2021-01-18","",null,"OK",null,"",null,"OK"]
["2021-01-19","",null,"OK",null,"",null,"OK"]
["2021-01-20","",null,"OK",null,"",null,"OK"]
["2021-01-21","",null,"OK",null,"",null,"OK"]
["2021-01-22","",null,"OK",null,"",null,"OK"]
["2021-01-23","",null,"OK",null,"",null,"OK"]
["2021-01-24","",null,"OK",null,"",null,"OK"]
[{"$f":"A259+1","v":"2021-01-25"},"",null,"OK",null,"",null,"OK"]
[{"$f":"A260+1","v":"2021-01-26"},"",null,"OK",null,"",null,"OK"]
["2021-01-27","",null,"OK",null,"",null,"OK"]
["2021-01-28","",null,"OK",null,"",null,"OK"]
["2021-01-29","",null,"OK",null,"",null,"OK"]
["2021-01-30","",null,"OK",null,"",null,"OK"]
[{"$f":"A265+1","v":"2021-01-31"},"",null,"OK",null,"",null,"OK"]
[]
[]
["Relevé des températures"]
[]
[]
[{"$f":"A228","v":"2021-05-01"}]
[{"$nulls":5},"Document de référence :","Directives_Frigos"]
[null,"Fréquence =>",null,null,"le matin et le soir :","Relevé des températures et contrôle des rangements"]
[]
[]
[null,"Frigo S/Sol",{"$nulls":7},"Mesure"]
["Valeurs \ncibles =>","Minimum  7° C                                                                                ",null," Maximum 3°C    ",null,"Minimum  7° C                                                                                ",null," Maximum 3°C    ",null,"en cas de température\nNon-conforme","Visa responsable"]
["Date","Heure","T°","Résultat","Visa","Heure","T°","Résultat","Visa"]
["2021-01-01",{"$f":"IF(C280=\"\",\"\",IF(B280<>\"\",B280,NOW()))","v":""},null,{"$f":"IF(C280<8,\"OK\",\"Contacter le chef\")","v":"OK"},null,{"$f":"IF(G280=\"\",\"\",IF(F280<>\"\",F280,NOW()))","v":""},null,{"$f":"IF(G280<8,\"OK\",\"Contacter le chef\")","v":"OK"}]
[{"$f":"A280+1","v":"2021-01-02"},"",null,{"$f":"IF(C281<8,\"OK\",\"Contacter le chef\")","v":"OK"},null,"",null,"OK"]
[{"$f":"A281+1","v":"2021-01-03"},"",null,"OK",null,"",null,"OK"]
["2021-01-04","",null,"OK",null,"",null,"OK"]
["2021-01-05","",null,"OK",null,"",null,"OK"]
["2021-01-06","",null,"OK",null,"",null,"OK"]
["2021-01-07","",null,"OK",null,"",null,"OK"]
["2021-01-08","",null,"OK",null,"",null,"OK"]
["2021-01-09","",null,"OK",null,"",null,"OK"]
["2021-01-10","",null,"OK",null,"",null,"OK"]
["2021-01-11","",null,"OK",null,"",null,"OK"]
["2021-01-12","",null,"OK",null,"",null,"OK"]
["2021-01-13","",null,"OK",null,"",null,"OK"]
["2021-01-14","",null,"OK",null,"",null,"OK"]
["2021-01-15","",null,"OK",null,"",null,"OK"]
["2021-01-16","",null,"OK",null,"",null,"OK"]
["2021-01-17","",null,"OK",null,"",null,"OK"]
["2021-01-18","",null,"OK",null,"",null,"OK"]
["2021-01-19","",null,"OK",null,"",null,"OK"]
["2021-01-20","",null,"OK",null,"",null,"OK"]
["2021-01-21","",null,"OK",null,"",null,"OK"]
["2021-01-22","",null,"OK",null,"",null,"OK"]
["2021-01-23","",null,"OK",null,"",null,"OK"]
["2021-01-24","",null,"OK",null,"",null,"OK"]
[{"$f":"A303+1","v":"2021-01-25"},"",null,"OK",null,"",null,"OK"]
[{"$f":"A304+1","v":"2021-01-26"},"",null,"OK",null,"",null,"OK"]
["2021-01-27","",null,"OK",null,"",null,"OK"]
["2021-01-28","",null,"OK",null,"",null,"OK"]
["2021-01-29","",null,"OK",null,"",null,"OK"]
["2021-01-30","",null,"OK",null,"",null,"OK"]
[{"$f":"A309+1","v":"2021-01-31"},"",null,"OK",null,"",null,"OK"]

{"sheet":"Juin","index":5,"n_rows":310,"n_cols":11,"rows_kept":310,"merged":[[0,0,0,9],[1,0,1,9],[4,0,4,9],[9,1,9,8],[50,0,50,9],[51,0,51,9],[54,0,54,9],[59,1,59,8],[93,0,93,9],[94,0,94,9],[97,0,97,9],[102,1,102,8],[103,1,103,2],[103,5,103,6],[137,0,137,9],[138,0,138,9],[141,0,141,10],[146,1,146,8],[147,1,147,2],[147,5,147,6],[180,0,180,9],[181,0,181,9],[184,0,184,9],[189,1,189,8],[190,1,190,2],[190,5,190,6],[223,0,223,9],[224,0,224,9],[227,0,227,9],[232,1,232,8],[233,1,233,2],[233,5,233,6],[267,0,267,9],[268,0,268,9],[271,0,271,9],[276,1,276,8],[277,1,277,2],[277,5,277,6]]}
[]
["Relevé des températures"]
[]
[]
["2020-06-01"]
[{"$nulls":5},"Document de référence :","Directives_Frigos"]
[null,"Fréquence =>",null,null,"le matin et le soir :","Relevé des températures "]
[]
[]
[null,"Congélateur cuisine",{"$nulls":7},"Mesure"]
["Valeurs \ncibles =>","Minimum  -15° C                                                                                ",null," Maximum -22°C    ",null,"Minimum  -15° C                                                                                  ",null,"Maximum -22°C          ",null,"en cas de température\nNon-conforme","Visa responsable"]
["Date","Heure","T°","Résultat","Visa","Heure","T°","Résultat","Visa"]
["2021-01-01",{"$f":"IF(C13=\"\",\"\",IF(B13<>\"\",B13,NOW()))","v":""},null,{"$f":"IF(C13>15,\"OK\",\"Contacter le chef\")","v":"Contacter le chef"},null,{"$f":"IF(G13=\"\",\"\",IF(F13<>\"\",F13,NOW()))","v":""},null,{"$f":"IF(G13>15,\"OK\",\"Contacter le chef\")","v":"Contacter le chef"}]
[{"$f":"A13+1","v":"2021-01-02"},"",null,{"$f":"IF(C14>15,\"OK\",\"Contacter le chef\")","v":"Contacter le chef"},null,"",null,{"$f":"IF(G14>15,\"OK\",\"Contacter le chef\")","v":"Contacter le chef"}]
[{"$f":"A14+1","v":"2021-01-03"},"",null,"Contacter le chef",null,"",null,"Contacter le chef"]
["2021-01-04","",null,"Contacter le chef",null,"",null,"Contacter le chef"]
["2021-01-05","",null,"Contacter le chef",null,"",null,"Contacter le chef"]
["2021-01-06","",null,"Contacter le chef",null,"",null,"Contacter le chef"]
["2021-01-07","",null,"Contacter le chef",null,"",null,"Contacter le chef"]
["2021-01-08","",null,"Contacter le chef",null,"",null,"Contacter le chef"]
["2021-01-09","",null,"Contacter le chef",null,"",null,"Contacter le chef"]
["2021-01-10","",null,"Contacter le chef",null,"",null,"Contacter le chef"]
["2021-01-11","",null,"Contacter le chef",null,"",null,"Contacter le chef"]
["2021-01-12","",null,"Contacter le chef",null,"",null,"Contacter le chef"]
["2021-01-13","",null,"Contacter le chef",null,"",null,"Contacter le chef"]
["2021-01-14","",null,"Contacter le chef",null,"",null,"Contacter le chef"]
["2021-01-15","",null,"Contacter le chef",null,"",null,"Contacter le chef"]
["2021-01-16","",null,"Contacter le chef",null,"",null,"Contacter le chef"]
["2021-01-17","",null,"Contacter le chef",null,"",null,"Contacter le chef"]
["2021-01-18","",null,"Contacter le chef",null,"",null,"Contacter le chef"]
["2021-01-19","",null,"Contacter le chef",null,"",null,"Contacter le chef"]
["2021-01-20","",null,"Contacter le chef",null,"",null,"Contacter le chef"]
["2021-01-21","",null,"Contacter le chef",null,"",null,"Contacter le chef"]
["2021-01-22","",null,"Contacter le chef",null,"",null,"Contacter le chef"]
["2021-01-23","",null,"Contacter le chef",null,"",null,"Contacter le chef"]
["2021-01-24","",null,"Contacter le chef",null,"",null,"Contacter le chef"]
[{"$f":"A36+1","v":"2021-01-25"},"",null,"Contacter le chef",null,"",null,"Contacter le chef"]
[{"$f":"A37+1","v":"2021-01-26"},"",null,"Contacter le chef",null,"",null,"Contacter le chef"]
["2021-01-27","",null,"Contacter le chef",null,"",null,"Contacter le chef"]
["2021-01-28","",null,"Contacter le chef",null,"",null,"Contacter le chef"]
["2021-01-29","",null,"Contacter le chef",null,"",null,"Contacter le chef"]
["2021-01-30","",null,"Contacter le chef",null,"",null,"Contacter le chef"]
[{"$f":"A42+1","v":"2021-01-31"},"",null,"Contacter le chef",null,"",null,"Contacter le chef"]
[]
[null,"Contrôle"]
[null,"Signature"]
[]
[]
[]
[]
[]
["Relevé des températures"]
[]
[]
[{"$f":"A5","v":"2020-06-01"}]
[{"$nulls":5},"Document de référence :","Directives_Frigos"]
[null,"Fréquence =>",null,null,"le matin et le soir :","Relevé des températures et contrôle des rangements"]
[]
[]
[null,"Congélateur S/Sol",{"$nulls":7},"Mesure"]
["Valeurs \ncibles =>","Minimum  -15° C                                                                                ",null," Maximum -22°C    ",null,"Minimum  -15° C                                                                                  ",null,"Maximum -22°C          ",null,"en cas de température\nNon-conforme","Visa responsable"]
["Date","Heure","T°","Résultat","Visa","Heure","T°","Résultat","Visa"]
["2021-01-01",{"$f":"IF(C63=\"\",\"\",IF(B63<>\"\",B63,NOW()))","v":""},null,{"$f":"IF(C63>15,\"OK\",\"Contacter le chef\")","v":"Contacter le chef"},null,{"$f":"IF(G63=\"\",\"\",IF(F63<>\"\",F63,NOW()))","v":""},null,{"$f":"IF(G63>15,\"OK\",\"Contacter le chef\")","v":"Contacter le chef"}]
[{"$f":"A63+1","v":"2021-01-02"},"",null,{"$f":"IF(C64>15,\"OK\",\"Contacter le chef\")","v":"Contacter le chef"},null,"",null,{"$f":"IF(G64>15,\"OK\",\"Contacter le chef\")","v":"Contacter le chef"}]
[{"$f":"A64+1","v":"2021-01-03"},"",null,"Contacter le chef",null,"",null,"Contacter le chef"]
["2021-01-04","",null,"Contacter le chef",null,"",null,"Contacter le chef"]
["2021-01-05","",null,"Contacter le chef",null,"",null,"Contacter le chef"]
["2021-01-06","",null,"Contacter le chef",null,"",null,"Contacter le chef"]
["2021-01-07","",null,"Contacter le chef",null,"",null,"Contacter le chef"]
["2021-01-08","",null,"Contacter le chef",null,"",null,"Contacter le chef"]
["2021-01-09","",null,"Contacter le chef",null,"",null,"Contacter le chef"]
["2021-01-10","",null,"Contacter le chef",null,"",null,"Contacter le chef"]
["2021-01-11","",null,"Contacter le chef",null,"",null,"Contacter le chef"]
["2021-01-12","",null,"Contacter le chef",null,"",null,"Contacter le chef"]
["2021-01-13","",null,"Contacter le chef",null,"",null,"Contacter le chef"]
["2021-01-14","",null,"Contacter le chef",null,"",null,"Contacter le chef"]
["2021-01-15","",null,"Contacter le chef",null,"",null,"Contacter le chef"]
["2021-01-16","",null,"Contacter le chef",null,"",null,"Contacter le chef"]
["2021-01-17","",null,"Contacter le chef",null,"",null,"Contacter le chef"]
["2021-01-18","",null,"Contacter le chef",null,"",null,"Contacter le chef"]
["2021-01-19","",null,"Contacter le chef",null,"",null,"Contacter le chef"]
["2021-01-20","",null,"Contacter le chef",null,"",null,"Contacter le chef"]
["2021-01-21","",null,"Contacter le chef",null,"",null,"Contacter le chef"]
["2021-01-22","",null,"Contacter le chef",null,"",null,"Contacter le chef"]
["2021-01-23","",null,"Contacter le chef",null,"",null,"Contacter le chef"]
["2021-01-24","",null,"Contacter le chef",null,"",null,"Contacter le chef"]
[{"$f":"A86+1","v":"2021-01-25"},"",null,"Contacter le chef",null,"",null,"Contacter le chef"]
[{"$f":"A87+1","v":"2021-01-26"},"",null,"Contacter le chef",null,"",null,"Contacter le chef"]
["2021-01-27","",null,"Contacter le chef",null,"",null,"Contacter le chef"]
["2021-01-28","",null,"Contacter le chef",null,"",null,"Contacter le chef"]
["2021-01-29","",null,"Contacter le chef",null,"",null,"Contacter le chef"]
["2021-01-30","",null,"Contacter le chef",null,"",null,"Contacter le chef"]
[{"$f":"A92+1","v":"2021-01-31"},"",null,"Contacter le chef",null,"",null,"Contacter le chef"]
[]
["Relevé des températures"]
[]
[]
[{"$f":"A5","v":"2020-06-01"}]
[{"$nulls":5},"Document de référence :","Directives_Frigos"]
[null,"Fréquence =>",null,null,"le matin et le soir :","Relevé des températures et contrôle des rangements"]
[]
[]
[null,"Frigo cuisine",{"$nulls":7},"Mesure"]
["Valeurs \ncibles =>","Minimum  7° C                                                                                ",null," Maximum 3°C    ",null,"Minimum  7° C                                                                                ",null," Maximum 3°C    ",null,"en cas de température\nNon-conforme","Visa responsable"]
["Date","Heure","T°","Résultat","Visa","Heure","T°","Résultat","Visa"]
["2021-01-01",{"$f":"IF(C106=\"\",\"\",IF(B106<>\"\",B106,NOW()))","v":""},null,{"$f":"IF(C106<8,\"OK\",\"Contacter le chef\")","v":"OK"},null,{"$f":"IF(G106=\"\",\"\",IF(F106<>\"\",F106,NOW()))","v":""},null,{"$f":"IF(G106<8,\"OK\",\"Contacter le chef\")","v":"OK"}]
[{"$f":"A106+1","v":"2021-01-02"},"",null,"OK",null,"",null,"OK"]
[{"$f":"A107+1","v":"2021-01-03"},"",null,"OK",null,"",null,"OK"]
["2021-01-04","",null,"OK",null,"",null,"OK"]
["2021-01-05","",null,"OK",null,"",null,"OK"]
["2021-01-06","",null,"OK",null,"",null,"OK"]
["2021-01-07","",null,"OK",null,"",null,"OK"]
["2021-01-08","",null,"OK",null,"",null,"OK"]
["2021-01-09","",null,"OK",null,"",null,"OK"]
["2021-01-10","",null,"OK",null,"",null,"OK"]
["2021-01-11","",null,"OK",null,"",null,"OK"]
["2021-01-12","",null,"OK",null,"",null,"OK"]
["2021-01-13","",null,"OK",null,"",null,"OK"]
["2021-01-14","",null,"OK",null,"",null,"OK"]
["2021-01-15","",null,"OK",null,"",null,"OK"]
["2021-01-16","",null,"OK",null,"",null,"OK"]
["2021-01-17","",null,"OK",null,"",null,"OK"]
["2021-01-18","",null,"OK",null,"",null,"OK"]
["2021-01-19","",null,"OK",null,"",null,"OK"]
["2021-01-20","",null,"OK",null,"",null,"OK"]
["2021-01-21","",null,"OK",null,"",null,"OK"]
["2021-01-22","",null,"OK",null,"",null,"OK"]
["2021-01-23","",null,"OK",null,"",null,"OK"]
["2021-01-24","",null,"OK",null,"",null,"OK"]
[{"$f":"A129+1","v":"2021-01-25"},"",null,"OK",null,"",null,"OK"]
[{"$f":"A130+1","v":"2021-01-26"},"",null,"OK",null,"",null,"OK"]
["2021-01-27","",null,"OK",null,"",null,"OK"]
["2021-01-28","",null,"OK",null,"",null,"OK"]
["2021-01-29","",null,"OK",null,"",null,"OK"]
["2021-01-30","",null,"OK",null,"",null,"OK"]
[{"$f":"A135+1","v":"2021-01-31"},"",null,"OK",null,"",null,"OK"]
[]
[]
["Relevé des températures"]
[]
[]
[{"$f":"A98","v":"2020-06-01"}]
[{"$nulls":5},"Document de référence :","Directives_Frigos"]
[null,"Fréquence =>",null,null,"le matin et le soir :","Relevé des températures et contrôle des rangements"]
[]
[]
[null,"Frigo MEP",{"$nulls":7},"Mesure"]
["Valeurs \ncibles =>","Minimum  7° C                                                                                ",null," Maximum 3°C    ",null,"Minimum  7° C                                                                                ",null," Maximum 3°C    ",null,"en cas de température\nNon-conforme","Visa responsable"]
["Date","Heure","T°","Résultat","Visa","Heure","T°","Résultat","Visa"]
["2021-01-01",{"$f":"IF(C150=\"\",\"\",IF(B150<>\"\",B150,NOW()))","v":""},null,{"$f":"IF(C150<8,\"OK\",\"Contacter le chef\")","v":"OK"},null,{"$f":"IF(G150=\"\",\"\",IF(F150<>\"\",F150,NOW()))","v":""},null,{"$f":"IF(G150<8,\"OK\",\"Contacter le chef\")","v":"OK"}]
[{"$f":"A150+1","v":"2021-01-02"},"",null,"OK",null,"",null,"OK"]
[{"$f":"A151+1","v":"2021-01-03"},"",null,"OK",null,"",null,"OK"]
["2021-01-04","",null,"OK",null,"",null,"OK"]
["2021-01-05","",null,"OK",null,"",null,"OK"]
["2021-01-06","",null,"OK",null,"",null,"OK"]
["2021-01-07","",null,"OK",null,"",null,"OK"]
["2021-01-08","",null,"OK",null,"",null,"OK"]
["2021-01-09","",null,"OK",null,"",null,"OK"]
["2021-01-10","",null,"OK",null,"",null,"OK"]
["2021-01-11","",null,"OK",null,"",null,"OK"]
["2021-01-12","",null,"OK",null,"",null,"OK"]
["2021-01-13","",null,"OK",null,"",null,"OK"]
["2021-01-14","",null,"OK",null,"",null,"OK"]
["2021-01-15","",null,"OK",null,"",null,"OK"]
["2021-01-16","",null,"OK",null,"",null,"OK"]
["2021-01-17","",null,"OK",null,"",null,"OK"]
["2021-01-18","",null,"OK",null,"",null,"OK"]
["2021-01-19","",null,"OK",null,"",null,"OK"]
["2021-01-20","",null,"OK",null,"",null,"OK"]
["2021-01-21","",null,"OK",null,"",null,"OK"]
["2021-01-22","",null,"OK",null,"",null,"OK"]
["2021-01-23","",null,"OK",null,"",null,"OK"]
["2021-01-24","",null,"OK",null,"",null,"OK"]
[{"$f":"A173+1","v":"2021-01-25"},"",null,"OK",null,"",null,"OK"]
[{"$f":"A174+1","v":"2021-01-26"},"",null,"OK",null,"",null,"OK"]
["2021-01-27","",null,"OK",null,"",null,"OK"]
["2021-01-28","",null,"OK",null,"",null,"OK"]
["2021-01-29","",null,"OK",null,"",null,"OK"]
["2021-01-30","",null,"OK",null,"",null,"OK"]
[{"$f":"A179+1","v":"2021-01-31"},"",null,"OK",null,"",null,"OK"]
[]
["Relevé des températures"]
[]
[]
[{"$f":"A142","v":"2020-06-01"}]
[{"$nulls":5},"Document de référence :","Directives_Frigos"]
[null,"Fréquence =>",null,null,"le matin et le soir :","Relevé des températures et contrôle des rangements"]
[]
[]
[null,"Frigo pâtisserie",{"$nulls":7},"Mesure"]
["Valeurs \ncibles =>","Minimum  7° C                                                                                ",null," Maximum 3°C    ",null,"Minimum  7° C                                                                                ",null," Maximum 3°C    ",null,"en cas de température\nNon-conforme","Visa responsable"]
["Date","Heure","T°","Résultat","Visa","Heure","T°","Résultat","Visa"]
["2021-01-01",{"$f":"IF(C193=\"\",\"\",IF(B193<>\"\",B193,NOW()))","v":""},null,{"$f":"IF(C193<8,\"OK\",\"Contacter le chef\")","v":"OK"},null,{"$f":"IF(G193=\"\",\"\",IF(F193<>\"\",F193,NOW()))","v":""},null,{"$f":"IF(G193<8,\"OK\",\"Contacter le chef\")","v":"OK"}]
[{"$f":"A193+1","v":"2021-01-02"},"",null,"OK",null,"",null,"OK"]
[{"$f":"A194+1","v":"2021-01-03"},"",null,"OK",null,"",null,"OK"]
["2021-01-04","",null,"OK",null,"",null,"OK"]
["2021-01-05","",null,"OK",null,"",null,"OK"]
["2021-01-06","",null,"OK",null,"",null,"OK"]
["2021-01-07","",null,"OK",null,"",null,"OK"]
["2021-01-08","",null,"OK",null,"",null,"OK"]
["2021-01-09","",null,"OK",null,"",null,"OK"]
["2021-01-10","",null,"OK",null,"",null,"OK"]
["2021-01-11","",null,"OK",null,"",null,"OK"]
["2021-01-12","",null,"OK",null,"",null,"OK"]
["2021-01-13","",null,"OK",null,"",null,"OK"]
["2021-01-14","",null,"OK",null,"",null,"OK"]
["2021-01-15","",null,"OK",null,"",null,"OK"]
["2021-01-16","",null,"OK",null,"",null,"OK"]
["2021-01-17","",null,"OK",null,"",null,"OK"]
["2021-01-18","",null,"OK",null,"",null,"OK"]
["2021-01-19","",null,"OK",null,"",null,"OK"]
["2021-01-20","",null,"OK",null,"",null,"OK"]
["2021-01-21","",null,"OK",null,"",null,"OK"]
["2021-01-22","",null,"OK",null,"",null,"OK"]
["2021-01-23","",null,"OK",null,"",null,"OK"]
["2021-01-24","",null,"OK",null,"",null,"OK"]
[{"$f":"A216+1","v":"2021-01-25"},"",null,"OK",null,"",null,"OK"]
[{"$f":"A217+1","v":"2021-01-26"},"",null,"OK",null,"",null,"OK"]
["2021-01-27","",null,"OK",null,"",null,"OK"]
["2021-01-28","",null,"OK",null,"",null,"OK"]
["2021-01-29","",null,"OK",null,"",null,"OK"]
["2021-01-30","",null,"OK",null,"",null,"OK"]
[{"$f":"A222+1","v":"2021-01-31"},"",null,"OK",null,"",null,"OK"]
[]
["Relevé des températures"]
[]
[]
[{"$f":"A185","v":"2020-06-01"}]
[{"$nulls":5},"Document de référence :","Directives_Frigos"]
[null,"Fréquence =>",null,null,"le matin et le soir :","Relevé des températures et contrôle des rangements"]
[]
[]
[null,"Frigo produits laitiers",{"$nulls":7},"Mesure"]
["Valeurs \ncibles =>","Minimum  7° C                                                                                ",null," Maximum 3°C    ",null,"Minimum  7° C                                                                                ",null," Maximum 3°C    ",null,"en cas de température\nNon-conforme","Visa responsable"]
["Date","Heure","T°","Résultat","Visa","Heure","T°","Résultat","Visa"]
["2021-01-01",{"$f":"IF(C236=\"\",\"\",IF(B236<>\"\",B236,NOW()))","v":""},null,{"$f":"IF(C236<8,\"OK\",\"Contacter le chef\")","v":"OK"},null,{"$f":"IF(G236=\"\",\"\",IF(F236<>\"\",F236,NOW()))","v":""},null,{"$f":"IF(G236<8,\"OK\",\"Contacter le chef\")","v":"OK"}]
[{"$f":"A236+1","v":"2021-01-02"},"",null,"OK",null,"",null,"OK"]
[{"$f":"A237+1","v":"2021-01-03"},"",null,"OK",null,"",null,"OK"]
["2021-01-04","",null,"OK",null,"",null,"OK"]
["2021-01-05","",null,"OK",null,"",null,"OK"]
["2021-01-06","",null,"OK",null,"",null,"OK"]
["2021-01-07","",null,"OK",null,"",null,"OK"]
["2021-01-08","",null,"OK",null,"",null,"OK"]
["2021-01-09","",null,"OK",null,"",null,"OK"]
["2021-01-10","",null,"OK",null,"",null,"OK"]
["2021-01-11","",null,"OK",null,"",null,"OK"]
["2021-01-12","",null,"OK",null,"",null,"OK"]
["2021-01-13","",null,"OK",null,"",null,"OK"]
["2021-01-14","",null,"OK",null,"",null,"OK"]
["2021-01-15","",null,"OK",null,"",null,"OK"]
["2021-01-16","",null,"OK",null,"",null,"OK"]
["2021-01-17","",null,"OK",null,"",null,"OK"]
["2021-01-18","",null,"OK",null,"",null,"OK"]
["2021-01-19","",null,"OK",null,"",null,"OK"]
["2021-01-20","",null,"OK",null,"",null,"OK"]
["2021-01-21","",null,"OK",null,"",null,"OK"]
["2021-01-22","",null,"OK",null,"",null,"OK"]
["2021-01-23","",null,"OK",null,"",null,"OK"]
["2021-01-24","",null,"OK",null,"",null,"OK"]
[{"$f":"A259+1","v":"2021-01-25"},"",null,"OK",null,"",null,"OK"]
[{"$f":"A260+1","v":"2021-01-26"},"",null,"OK",null,"",null,"OK"]
["2021-01-27","",null,"OK",null,"",null,"OK"]
["2021-01-28","",null,"OK",null,"",null,"OK"]
["2021-01-29","",null,"OK",null,"",null,"OK"]
["2021-01-30","",null,"OK",null,"",null,"OK"]
[{"$f":"A265+1","v":"2021-01-31"},"",null,"OK",null,"",null,"OK"]
[]
[]
["Relevé des températures"]
[]
[]
[{"$f":"A228","v":"2020-06-01"}]
[{"$nulls":5},"Document de référence :","Directives_Frigos"]
[null,"Fréquence =>",null,null,"le matin et le soir :","Relevé des températures et contrôle des rangements"]
[]
[]
[null,"Frigo S/Sol",{"$nulls":7},"Mesure"]
["Valeurs \ncibles =>","Minimum  7° C                                                                                ",null," Maximum 3°C    ",null,"Minimum  7° C                                                                                ",null," Maximum 3°C    ",null,"en cas de température\nNon-conforme","Visa responsable"]
["Date","Heure","T°","Résultat","Visa","Heure","T°","Résultat","Visa"]
["2021-01-01",{"$f":"IF(C280=\"\",\"\",IF(B280<>\"\",B280,NOW()))","v":""},null,{"$f":"IF(C280<8,\"OK\",\"Contacter le chef\")","v":"OK"},null,{"$f":"IF(G280=\"\",\"\",IF(F280<>\"\",F280,NOW()))","v":""},null,{"$f":"IF(G280<8,\"OK\",\"Contacter le chef\")","v":"OK"}]
[{"$f":"A280+1","v":"2021-01-02"},"",null,{"$f":"IF(C281<8,\"OK\",\"Contacter le chef\")","v":"OK"},null,"",null,"OK"]
[{"$f":"A281+1","v":"2021-01-03"},"",null,"OK",null,"",null,"OK"]
["2021-01-04","",null,"OK",null,"",null,"OK"]
["2021-01-05","",null,"OK",null,"",null,"OK"]
["2021-01-06","",null,"OK",null,"",null,"OK"]
["2021-01-07","",null,"OK",null,"",null,"OK"]
["2021-01-08","",null,"OK",null,"",null,"OK"]
["2021-01-09","",null,"OK",null,"",null,"OK"]
["2021-01-10","",null,"OK",null,"",null,"OK"]
["2021-01-11","",null,"OK",null,"",null,"OK"]
["2021-01-12","",null,"OK",null,"",null,"OK"]
["2021-01-13","",null,"OK",null,"",null,"OK"]
["2021-01-14","",null,"OK",null,"",null,"OK"]
["2021-01-15","",null,"OK",null,"",null,"OK"]
["2021-01-16","",null,"OK",null,"",null,"OK"]
["2021-01-17","",null,"OK",null,"",null,"OK"]
["2021-01-18","",null,"OK",null,"",null,"OK"]
["2021-01-19","",null,"OK",null,"",null,"OK"]
["2021-01-20","",null,"OK",null,"",null,"OK"]
["2021-01-21","",null,"OK",null,"",null,"OK"]
["2021-01-22","",null,"OK",null,"",null,"OK"]
["2021-01-23","",null,"OK",null,"",null,"OK"]
["2021-01-24","",null,"OK",null,"",null,"OK"]
[{"$f":"A303+1","v":"2021-01-25"},"",null,"OK",null,"",null,"OK"]
[{"$f":"A304+1","v":"2021-01-26"},"",null,"OK",null,"",null,"OK"]
["2021-01-27","",null,"OK",null,"",null,"OK"]
["2021-01-28","",null,"OK",null,"",null,"OK"]
["2021-01-29","",null,"OK",null,"",null,"OK"]
["2021-01-30","",null,"OK",null,"",null,"OK"]
[{"$f":"A309+1","v":"2021-01-31"},"",null,"OK",null,"",null,"OK"]

{"sheet":"Juillet","index":6,"n_rows":310,"n_cols":11,"rows_kept":310,"merged":[[0,0,0,9],[1,0,1,9],[4,0,4,9],[9,1,9,8],[50,0,50,9],[51,0,51,9],[54,0,54,9],[59,1,59,8],[93,0,93,9],[94,0,94,9],[97,0,97,9],[102,1,102,8],[103,1,103,2],[103,5,103,6],[137,0,137,9],[138,0,138,9],[141,0,141,10],[146,1,146,8],[147,1,147,2],[147,5,147,6],[180,0,180,9],[181,0,181,9],[184,0,184,9],[189,1,189,8],[190,1,190,2],[190,5,190,6],[223,0,223,9],[224,0,224,9],[227,0,227,9],[232,1,232,8],[233,1,233,2],[233,5,233,6],[267,0,267,9],[268,0,268,9],[271,0,271,9],[276,1,276,8],[277,1,277,2],[277,5,277,6]]}
[]
["Relevé des températures"]
[]
[]
["2021-07-01"]
[{"$nulls":5},"Document de référence :","Directives_Frigos"]
[null,"Fréquence =>",null,null,"le matin et le soir :","Relevé des températures "]
[]
[]
[null,"Congélateur cuisine",{"$nulls":7},"Mesure"]
["Valeurs \ncibles =>","Minimum  -15° C                                                                                ",null," Maximum -22°C    ",null,"Minimum  -15° C                                                                                  ",null,"Maximum -22°C          ",null,"en cas de température\nNon-conforme","Visa responsable"]
["Date","Heure","T°","Résultat","Visa","Heure","T°","Résultat","Visa"]
["2021-01-01",{"$f":"IF(C13=\"\",\"\",IF(B13<>\"\",B13,NOW()))","v":""},null,{"$f":"IF(C13>15,\"OK\",\"Contacter le chef\")","v":"Contacter le chef"},null,{"$f":"IF(G13=\"\",\"\",IF(F13<>\"\",F13,NOW()))","v":""},null,{"$f":"IF(G13>15,\"OK\",\"Contacter le chef\")","v":"Contacter le chef"}]
[{"$f":"A13+1","v":"2021-01-02"},"",null,{"$f":"IF(C14>15,\"OK\",\"Contacter le chef\")","v":"Contacter le chef"},null,"",null,{"$f":"IF(G14>15,\"OK\",\"Contacter le chef\")","v":"Contacter le chef"}]
[{"$f":"A14+1","v":"2021-01-03"},"",null,"Contacter le chef",null,"",null,"Contacter le chef"]
["2021-01-04","",null,"Contacter le chef",null,"",null,"Contacter le chef"]
["2021-01-05","",null,"Contacter le chef",null,"",null,"Contacter le chef"]
["2021-01-06","",null,"Contacter le chef",null,"",null,"Contacter le chef"]
["2021-01-07","",null,"Contacter le chef",null,"",null,"Contacter le chef"]
["2021-01-08","",null,"Contacter le chef",null,"",null,"Contacter le chef"]
["2021-01-09","",null,"Contacter le chef",null,"",null,"Contacter le chef"]
["2021-01-10","",null,"Contacter le chef",null,"",null,"Contacter le chef"]
["2021-01-11","",null,"Contacter le chef",null,"",null,"Contacter le chef"]
["2021-01-12","",null,"Contacter le chef",null,"",null,"Contacter le chef"]
["2021-01-13","",null,"Contacter le chef",null,"",null,"Contacter le chef"]
["2021-01-14","",null,"Contacter le chef",null,"",null,"Contacter le chef"]
["2021-01-15","",null,"Contacter le chef",null,"",null,"Contacter le chef"]
["2021-01-16","",null,"Contacter le chef",null,"",null,"Contacter le chef"]
["2021-01-17","",null,"Contacter le chef",null,"",null,"Contacter le chef"]
["2021-01-18","",null,"Contacter le chef",null,"",null,"Contacter le chef"]
["2021-01-19","",null,"Contacter le chef",null,"",null,"Contacter le chef"]
["2021-01-20","",null,"Contacter le chef",null,"",null,"Contacter le chef"]
["2021-01-21","",null,"Contacter le chef",null,"",null,"Contacter le chef"]
["2021-01-22","",null,"Contacter le chef",null,"",null,"Contacter le chef"]
["2021-01-23","",null,"Contacter le chef",null,"",null,"Contacter le chef"]
["2021-01-24","",null,"Contacter le chef",null,"",null,"Contacter le chef"]
[{"$f":"A36+1","v":"2021-01-25"},"",null,"Contacter le chef",null,"",null,"Contacter le chef"]
[{"$f":"A37+1","v":"2021-01-26"},"",null,"Contacter le chef",null,"",null,"Contacter le chef"]
["2021-01-27","",null,"Contacter le chef",null,"",null,"Contacter le chef"]
["2021-01-28","",null,"Contacter le chef",null,"",null,"Contacter le chef"]
["2021-01-29","",null,"Contacter le chef",null,"",null,"Contacter le chef"]
["2021-01-30","",null,"Contacter le chef",null,"",null,"Contacter le chef"]
[{"$f":"A42+1","v":"2021-01-31"},"",null,"Contacter le chef",null,"",null,"Contacter le chef"]
[]
[null,"Contrôle"]
[null,"Signature"]
[]
[]
[]
[]
[]
["Relevé des températures"]
[]
[]
[{"$f":"A5","v":"2021-07-01"}]
[{"$nulls":5},"Document de référence :","Directives_Frigos"]
[null,"Fréquence =>",null,null,"le matin et le soir :","Relevé des températures et contrôle des rangements"]
[]
[]
[null,"Congélateur S/Sol",{"$nulls":7},"Mesure"]
["Valeurs \ncibles =>","Minimum  -15° C                                                                                ",null," Maximum -22°C    ",null,"Minimum  -15° C                                                                                  ",null,"Maximum -22°C          ",null,"en cas de température\nNon-conforme","Visa responsable"]
["Date","Heure","T°","Résultat","Visa","Heure","T°","Résultat","Visa"]
["2021-01-01",{"$f":"IF(C63=\"\",\"\",IF(B63<>\"\",B63,NOW()))","v":""},null,{"$f":"IF(C63>15,\"OK\",\"Contacter le chef\")","v":"Contacter le chef"},null,{"$f":"IF(G63=\"\",\"\",IF(F63<>\"\",F63,NOW()))","v":""},null,{"$f":"IF(G63>15,\"OK\",\"Contacter le chef\")","v":"Contacter le chef"}]
[{"$f":"A63+1","v":"2021-01-02"},"",null,{"$f":"IF(C64>15,\"OK\",\"Contacter le chef\")","v":"Contacter le chef"},null,"",null,{"$f":"IF(G64>15,\"OK\",\"Contacter le chef\")","v":"Contacter le chef"}]
[{"$f":"A64+1","v":"2021-01-03"},"",null,"Contacter le chef",null,"",null,"Contacter le chef"]
["2021-01-04","",null,"Contacter le chef",null,"",null,"Contacter le chef"]
["2021-01-05","",null,"Contacter le chef",null,"",null,"Contacter le chef"]
["2021-01-06","",null,"Contacter le chef",null,"",null,"Contacter le chef"]
["2021-01-07","",null,"Contacter le chef",null,"",null,"Contacter le chef"]
["2021-01-08","",null,"Contacter le chef",null,"",null,"Contacter le chef"]
["2021-01-09","",null,"Contacter le chef",null,"",null,"Contacter le chef"]
["2021-01-10","",null,"Contacter le chef",null,"",null,"Contacter le chef"]
["2021-01-11","",null,"Contacter le chef",null,"",null,"Contacter le chef"]
["2021-01-12","",null,"Contacter le chef",null,"",null,"Contacter le chef"]
["2021-01-13","",null,"Contacter le chef",null,"",null,"Contacter le chef"]
["2021-01-14","",null,"Contacter le chef",null,"",null,"Contacter le chef"]
["2021-01-15","",null,"Contacter le chef",null,"",null,"Contacter le chef"]
["2021-01-16","",null,"Contacter le chef",null,"",null,"Contacter le chef"]
["2021-01-17","",null,"Contacter le chef",null,"",null,"Contacter le chef"]
["2021-01-18","",null,"Contacter le chef",null,"",null,"Contacter le chef"]
["2021-01-19","",null,"Contacter le chef",null,"",null,"Contacter le chef"]
["2021-01-20","",null,"Contacter le chef",null,"",null,"Contacter le chef"]
["2021-01-21","",null,"Contacter le chef",null,"",null,"Contacter le chef"]
["2021-01-22","",null,"Contacter le chef",null,"",null,"Contacter le chef"]
["2021-01-23","",null,"Contacter le chef",null,"",null,"Contacter le chef"]
["2021-01-24","",null,"Contacter le chef",null,"",null,"Contacter le chef"]
[{"$f":"A86+1","v":"2021-01-25"},"",null,"Contacter le chef",null,"",null,"Contacter le chef"]
[{"$f":"A87+1","v":"2021-01-26"},"",null,"Contacter le chef",null,"",null,"Contacter le chef"]
["2021-01-27","",null,"Contacter le chef",null,"",null,"Contacter le chef"]
["2021-01-28","",null,"Contacter le chef",null,"",null,"Contacter le chef"]
["2021-01-29","",null,"Contacter le chef",null,"",null,"Contacter le chef"]
["2021-01-30","",null,"Contacter le chef",null,"",null,"Contacter le chef"]
[{"$f":"A92+1","v":"2021-01-31"},"",null,"Contacter le chef",null,"",null,"Contacter le chef"]
[]
["Relevé des températures"]
[]
[]
[{"$f":"A5","v":"2021-07-01"}]
[{"$nulls":5},"Document de référence :","Directives_Frigos"]
[null,"Fréquence =>",null,null,"le matin et le soir :","Relevé des températures et contrôle des rangements"]
[]
[]
[null,"Frigo cuisine",{"$nulls":7},"Mesure"]
["Valeurs \ncibles =>","Minimum  7° C                                                                                ",null," Maximum 3°C    ",null,"Minimum  7° C                                                                                ",null," Maximum 3°C    ",null,"en cas de température\nNon-conforme","Visa responsable"]
["Date","Heure","T°","Résultat","Visa","Heure","T°","Résultat","Visa"]
["2021-01-01",{"$f":"IF(C106=\"\",\"\",IF(B106<>\"\",B106,NOW()))","v":""},null,{"$f":"IF(C106<8,\"OK\",\"Contacter le chef\")","v":"OK"},null,{"$f":"IF(G106=\"\",\"\",IF(F106<>\"\",F106,NOW()))","v":""},null,{"$f":"IF(G106<8,\"OK\",\"Contacter le chef\")","v":"OK"}]
[{"$f":"A106+1","v":"2021-01-02"},"",null,"OK",null,"",null,"OK"]
[{"$f":"A107+1","v":"2021-01-03"},"",null,"OK",null,"",null,"OK"]
["2021-01-04","",null,"OK",null,"",null,"OK"]
["2021-01-05","",null,"OK",null,"",null,"OK"]
["2021-01-06","",null,"OK",null,"",null,"OK"]
["2021-01-07","",null,"OK",null,"",null,"OK"]
["2021-01-08","",null,"OK",null,"",null,"OK"]
["2021-01-09","",null,"OK",null,"",null,"OK"]
["2021-01-10","",null,"OK",null,"",null,"OK"]
["2021-01-11","",null,"OK",null,"",null,"OK"]
["2021-01-12","",null,"OK",null,"",null,"OK"]
["2021-01-13","",null,"OK",null,"",null,"OK"]
["2021-01-14","",null,"OK",null,"",null,"OK"]
["2021-01-15","",null,"OK",null,"",null,"OK"]
["2021-01-16","",null,"OK",null,"",null,"OK"]
["2021-01-17","",null,"OK",null,"",null,"OK"]
["2021-01-18","",null,"OK",null,"",null,"OK"]
["2021-01-19","",null,"OK",null,"",null,"OK"]
["2021-01-20","",null,"OK",null,"",null,"OK"]
["2021-01-21","",null,"OK",null,"",null,"OK"]
["2021-01-22","",null,"OK",null,"",null,"OK"]
["2021-01-23","",null,"OK",null,"",null,"OK"]
["2021-01-24","",null,"OK",null,"",null,"OK"]
[{"$f":"A129+1","v":"2021-01-25"},"",null,"OK",null,"",null,"OK"]
[{"$f":"A130+1","v":"2021-01-26"},"",null,"OK",null,"",null,"OK"]
["2021-01-27","",null,"OK",null,"",null,"OK"]
["2021-01-28","",null,"OK",null,"",null,"OK"]
["2021-01-29","",null,"OK",null,"",null,"OK"]
["2021-01-30","",null,"OK",null,"",null,"OK"]
[{"$f":"A135+1","v":"2021-01-31"},"",null,"OK",null,"",null,"OK"]
[]
[]
["Relevé des températures"]
[]
[]
[{"$f":"A98","v":"2021-07-01"}]
[{"$nulls":5},"Document de référence :","Directives_Frigos"]
[null,"Fréquence =>",null,null,"le matin et le soir :","Relevé des températures et contrôle des rangements"]
[]
[]
[null,"Frigo MEP",{"$nulls":7},"Mesure"]
["Valeurs \ncibles =>","Minimum  7° C                                                                                ",null," Maximum 3°C    ",null,"Minimum  7° C                                                                                ",null," Maximum 3°C    ",null,"en cas de température\nNon-conforme","Visa responsable"]
["Date","Heure","T°","Résultat","Visa","Heure","T°","Résultat","Visa"]
["2021-01-01",{"$f":"IF(C150=\"\",\"\",IF(B150<>\"\",B150,NOW()))","v":""},null,{"$f":"IF(C150<8,\"OK\",\"Contacter le chef\")","v":"OK"},null,{"$f":"IF(G150=\"\",\"\",IF(F150<>\"\",F150,NOW()))","v":""},null,{"$f":"IF(G150<8,\"OK\",\"Contacter le chef\")","v":"OK"}]
[{"$f":"A150+1","v":"2021-01-02"},"",null,"OK",null,"",null,"OK"]
[{"$f":"A151+1","v":"2021-01-03"},"",null,"OK",null,"",null,"OK"]
["2021-01-04","",null,"OK",null,"",null,"OK"]
["2021-01-05","",null,"OK",null,"",null,"OK"]
["2021-01-06","",null,"OK",null,"",null,"OK"]
["2021-01-07","",null,"OK",null,"",null,"OK"]
["2021-01-08","",null,"OK",null,"",null,"OK"]
["2021-01-09","",null,"OK",null,"",null,"OK"]
["2021-01-10","",null,"OK",null,"",null,"OK"]
["2021-01-11","",null,"OK",null,"",null,"OK"]
["2021-01-12","",null,"OK",null,"",null,"OK"]
["2021-01-13","",null,"OK",null,"",null,"OK"]
["2021-01-14","",null,"OK",null,"",null,"OK"]
["2021-01-15","",null,"OK",null,"",null,"OK"]
["2021-01-16","",null,"OK",null,"",null,"OK"]
["2021-01-17","",null,"OK",null,"",null,"OK"]
["2021-01-18","",null,"OK",null,"",null,"OK"]
["2021-01-19","",null,"OK",null,"",null,"OK"]
["2021-01-20","",null,"OK",null,"",null,"OK"]
["2021-01-21","",null,"OK",null,"",null,"OK"]
["2021-01-22","",null,"OK",null,"",null,"OK"]
["2021-01-23","",null,"OK",null,"",null,"OK"]
["2021-01-24","",null,"OK",null,"",null,"OK"]
[{"$f":"A173+1","v":"2021-01-25"},"",null,"OK",null,"",null,"OK"]
[{"$f":"A174+1","v":"2021-01-26"},"",null,"OK",null,"",null,"OK"]
["2021-01-27","",null,"OK",null,"",null,"OK"]
["2021-01-28","",null,"OK",null,"",null,"OK"]
["2021-01-29","",null,"OK",null,"",null,"OK"]
["2021-01-30","",null,"OK",null,"",null,"OK"]
[{"$f":"A179+1","v":"2021-01-31"},"",null,"OK",null,"",null,"OK"]
[]
["Relevé des températures"]
[]
[]
[{"$f":"A142","v":"2021-07-01"}]
[{"$nulls":5},"Document de référence :","Directives_Frigos"]
[null,"Fréquence =>",null,null,"le matin et le soir :","Relevé des températures et contrôle des rangements"]
[]
[]
[null,"Frigo pâtisserie",{"$nulls":7},"Mesure"]
["Valeurs \ncibles =>","Minimum  7° C                                                                                ",null," Maximum 3°C    ",null,"Minimum  7° C                                                                                ",null," Maximum 3°C    ",null,"en cas de température\nNon-conforme","Visa responsable"]
["Date","Heure","T°","Résultat","Visa","Heure","T°","Résultat","Visa"]
["2021-01-01",{"$f":"IF(C193=\"\",\"\",IF(B193<>\"\",B193,NOW()))","v":""},null,{"$f":"IF(C193<8,\"OK\",\"Contacter le chef\")","v":"OK"},null,{"$f":"IF(G193=\"\",\"\",IF(F193<>\"\",F193,NOW()))","v":""},null,{"$f":"IF(G193<8,\"OK\",\"Contacter le chef\")","v":"OK"}]
[{"$f":"A193+1","v":"2021-01-02"},"",null,"OK",null,"",null,"OK"]
[{"$f":"A194+1","v":"2021-01-03"},"",null,"OK",null,"",null,"OK"]
["2021-01-04","",null,"OK",null,"",null,"OK"]
["2021-01-05","",null,"OK",null,"",null,"OK"]
["2021-01-06","",null,"OK",null,"",null,"OK"]
["2021-01-07","",null,"OK",null,"",null,"OK"]
["2021-01-08","",null,"OK",null,"",null,"OK"]
["2021-01-09","",null,"OK",null,"",null,"OK"]
["2021-01-10","",null,"OK",null,"",null,"OK"]
["2021-01-11","",null,"OK",null,"",null,"OK"]
["2021-01-12","",null,"OK",null,"",null,"OK"]
["2021-01-13","",null,"OK",null,"",null,"OK"]
["2021-01-14","",null,"OK",null,"",null,"OK"]
["2021-01-15","",null,"OK",null,"",null,"OK"]
["2021-01-16","",null,"OK",null,"",null,"OK"]
["2021-01-17","",null,"OK",null,"",null,"OK"]
["2021-01-18","",null,"OK",null,"",null,"OK"]
["2021-01-19","",null,"OK",null,"",null,"OK"]
["2021-01-20","",null,"OK",null,"",null,"OK"]
["2021-01-21","",null,"OK",null,"",null,"OK"]
["2021-01-22","",null,"OK",null,"",null,"OK"]
["2021-01-23","",null,"OK",null,"",null,"OK"]
["2021-01-24","",null,"OK",null,"",null,"OK"]
[{"$f":"A216+1","v":"2021-01-25"},"",null,"OK",null,"",null,"OK"]
[{"$f":"A217+1","v":"2021-01-26"},"",null,"OK",null,"",null,"OK"]
["2021-01-27","",null,"OK",null,"",null,"OK"]
["2021-01-28","",null,"OK",null,"",null,"OK"]
["2021-01-29","",null,"OK",null,"",null,"OK"]
["2021-01-30","",null,"OK",null,"",null,"OK"]
[{"$f":"A222+1","v":"2021-01-31"},"",null,"OK",null,"",null,"OK"]
[]
["Relevé des températures"]
[]
[]
[{"$f":"A185","v":"2021-07-01"}]
[{"$nulls":5},"Document de référence :","Directives_Frigos"]
[null,"Fréquence =>",null,null,"le matin et le soir :","Relevé des températures et contrôle des rangements"]
[]
[]
[null,"Frigo produits laitiers",{"$nulls":7},"Mesure"]
["Valeurs \ncibles =>","Minimum  7° C                                                                                ",null," Maximum 3°C    ",null,"Minimum  7° C                                                                                ",null," Maximum 3°C    ",null,"en cas de température\nNon-conforme","Visa responsable"]
["Date","Heure","T°","Résultat","Visa","Heure","T°","Résultat","Visa"]
["2021-01-01",{"$f":"IF(C236=\"\",\"\",IF(B236<>\"\",B236,NOW()))","v":""},null,{"$f":"IF(C236<8,\"OK\",\"Contacter le chef\")","v":"OK"},null,{"$f":"IF(G236=\"\",\"\",IF(F236<>\"\",F236,NOW()))","v":""},null,{"$f":"IF(G236<8,\"OK\",\"Contacter le chef\")","v":"OK"}]
[{"$f":"A236+1","v":"2021-01-02"},"",null,"OK",null,"",null,"OK"]
[{"$f":"A237+1","v":"2021-01-03"},"",null,"OK",null,"",null,"OK"]
["2021-01-04","",null,"OK",null,"",null,"OK"]
["2021-01-05","",null,"OK",null,"",null,"OK"]
["2021-01-06","",null,"OK",null,"",null,"OK"]
["2021-01-07","",null,"OK",null,"",null,"OK"]
["2021-01-08","",null,"OK",null,"",null,"OK"]
["2021-01-09","",null,"OK",null,"",null,"OK"]
["2021-01-10","",null,"OK",null,"",null,"OK"]
["2021-01-11","",null,"OK",null,"",null,"OK"]
["2021-01-12","",null,"OK",null,"",null,"OK"]
["2021-01-13","",null,"OK",null,"",null,"OK"]
["2021-01-14","",null,"OK",null,"",null,"OK"]
["2021-01-15","",null,"OK",null,"",null,"OK"]
["2021-01-16","",null,"OK",null,"",null,"OK"]
["2021-01-17","",null,"OK",null,"",null,"OK"]
["2021-01-18","",null,"OK",null,"",null,"OK"]
["2021-01-19","",null,"OK",null,"",null,"OK"]
["2021-01-20","",null,"OK",null,"",null,"OK"]
["2021-01-21","",null,"OK",null,"",null,"OK"]
["2021-01-22","",null,"OK",null,"",null,"OK"]
["2021-01-23","",null,"OK",null,"",null,"OK"]
["2021-01-24","",null,"OK",null,"",null,"OK"]
[{"$f":"A259+1","v":"2021-01-25"},"",null,"OK",null,"",null,"OK"]
[{"$f":"A260+1","v":"2021-01-26"},"",null,"OK",null,"",null,"OK"]
["2021-01-27","",null,"OK",null,"",null,"OK"]
["2021-01-28","",null,"OK",null,"",null,"OK"]
["2021-01-29","",null,"OK",null,"",null,"OK"]
["2021-01-30","",null,"OK",null,"",null,"OK"]
[{"$f":"A265+1","v":"2021-01-31"},"",null,"OK",null,"",null,"OK"]
[]
[]
["Relevé des températures"]
[]
[]
[{"$f":"A228","v":"2021-07-01"}]
[{"$nulls":5},"Document de référence :","Directives_Frigos"]
[null,"Fréquence =>",null,null,"le matin et le soir :","Relevé des températures et contrôle des rangements"]
[]
[]
[null,"Frigo S/Sol",{"$nulls":7},"Mesure"]
["Valeurs \ncibles =>","Minimum  7° C                                                                                ",null," Maximum 3°C    ",null,"Minimum  7° C                                                                                ",null," Maximum 3°C    ",null,"en cas de température\nNon-conforme","Visa responsable"]
["Date","Heure","T°","Résultat","Visa","Heure","T°","Résultat","Visa"]
["2021-01-01",{"$f":"IF(C280=\"\",\"\",IF(B280<>\"\",B280,NOW()))","v":""},null,{"$f":"IF(C280<8,\"OK\",\"Contacter le chef\")","v":"OK"},null,{"$f":"IF(G280=\"\",\"\",IF(F280<>\"\",F280,NOW()))","v":""},null,{"$f":"IF(G280<8,\"OK\",\"Contacter le chef\")","v":"OK"}]
[{"$f":"A280+1","v":"2021-01-02"},"",null,{"$f":"IF(C281<8,\"OK\",\"Contacter le chef\")","v":"OK"},null,"",null,"OK"]
[{"$f":"A281+1","v":"2021-01-03"},"",null,"OK",null,"",null,"OK"]
["2021-01-04","",null,"OK",null,"",null,"OK"]
["2021-01-05","",null,"OK",null,"",null,"OK"]
["2021-01-06","",null,"OK",null,"",null,"OK"]
["2021-01-07","",null,"OK",null,"",null,"OK"]
["2021-01-08","",null,"OK",null,"",null,"OK"]
["2021-01-09","",null,"OK",null,"",null,"OK"]
["2021-01-10","",null,"OK",null,"",null,"OK"]
["2021-01-11","",null,"OK",null,"",null,"OK"]
["2021-01-12","",null,"OK",null,"",null,"OK"]
["2021-01-13","",null,"OK",null,"",null,"OK"]
["2021-01-14","",null,"OK",null,"",null,"OK"]
["2021-01-15","",null,"OK",null,"",null,"OK"]
["2021-01-16","",null,"OK",null,"",null,"OK"]
["2021-01-17","",null,"OK",null,"",null,"OK"]
["2021-01-18","",null,"OK",null,"",null,"OK"]
["2021-01-19","",null,"OK",null,"",null,"OK"]
["2021-01-20","",null,"OK",null,"",null,"OK"]
["2021-01-21","",null,"OK",null,"",null,"OK"]
["2021-01-22","",null,"OK",null,"",null,"OK"]
["2021-01-23","",null,"OK",null,"",null,"OK"]
["2021-01-24","",null,"OK",null,"",null,"OK"]
[{"$f":"A303+1","v":"2021-01-25"},"",null,"OK",null,"",null,"OK"]
[{"$f":"A304+1","v":"2021-01-26"},"",null,"OK",null,"",null,"OK"]
["2021-01-27","",null,"OK",null,"",null,"OK"]
["2021-01-28","",null,"OK",null,"",null,"OK"]
["2021-01-29","",null,"OK",null,"",null,"OK"]
["2021-01-30","",null,"OK",null,"",null,"OK"]
[{"$f":"A309+1","v":"2021-01-31"},"",null,"OK",null,"",null,"OK"]

{"sheet":"Août","index":7,"n_rows":310,"n_cols":11,"rows_kept":310,"merged":[[0,0,0,9],[1,0,1,9],[4,0,4,9],[9,1,9,8],[50,0,50,9],[51,0,51,9],[54,0,54,9],[59,1,59,8],[93,0,93,9],[94,0,94,9],[97,0,97,9],[102,1,102,8],[103,1,103,2],[103,5,103,6],[137,0,137,9],[138,0,138,9],[141,0,141,10],[146,1,146,8],[147,1,147,2],[147,5,147,6],[180,0,180,9],[181,0,181,9],[184,0,184,9],[189,1,189,8],[190,1,190,2],[190,5,190,6],[223,0,223,9],[224,0,224,9],[227,0,227,9],[232,1,232,8],[233,1,233,2],[233,5,233,6],[267,0,267,9],[268,0,268,9],[271,0,271,9],[276,1,276,8],[277,1,277,2],[277,5,277,6]]}
[]
["Relevé des températures"]
[]
[]
["2020-08-01"]
[{"$nulls":5},"Document de référence :","Directives_Frigos"]
[null,"Fréquence =>",null,null,"le matin et le soir :","Relevé des températures "]
[]
[]
[null,"Congélateur cuisine",{"$nulls":7},"Mesure"]
["Valeurs \ncibles =>","Minimum  -15° C                                                                                ",null," Maximum -22°C    ",null,"Minimum  -15° C                                                                                  ",null,"Maximum -22°C          ",null,"en cas de température\nNon-conforme","Visa responsable"]
["Date","Heure","T°","Résultat","Visa","Heure","T°","Résultat","Visa"]
["2021-01-01",{"$f":"IF(C13=\"\",\"\",IF(B13<>\"\",B13,NOW()))","v":""},null,{"$f":"IF(C13>15,\"OK\",\"Contacter le chef\")","v":"Contacter le chef"},null,{"$f":"IF(G13=\"\",\"\",IF(F13<>\"\",F13,NOW()))","v":""},null,{"$f":"IF(G13>15,\"OK\",\"Contacter le chef\")","v":"Contacter le chef"}]
[{"$f":"A13+1","v":"2021-01-02"},"",null,{"$f":"IF(C14>15,\"OK\",\"Contacter le chef\")","v":"Contacter le chef"},null,"",null,{"$f":"IF(G14>15,\"OK\",\"Contacter le chef\")","v":"Contacter le chef"}]
[{"$f":"A14+1","v":"2021-01-03"},"",null,"Contacter le chef",null,"",null,"Contacter le chef"]
["2021-01-04","",null,"Contacter le chef",null,"",null,"Contacter le chef"]
["2021-01-05","",null,"Contacter le chef",null,"",null,"Contacter le chef"]
["2021-01-06","",null,"Contacter le chef",null,"",null,"Contacter le chef"]
["2021-01-07","",null,"Contacter le chef",null,"",null,"Contacter le chef"]
["2021-01-08","",null,"Contacter le chef",null,"",null,"Contacter le chef"]
["2021-01-09","",null,"Contacter le chef",null,"",null,"Contacter le chef"]
["2021-01-10","",null,"Contacter le chef",null,"",null,"Contacter le chef"]
["2021-01-11","",null,"Contacter le chef",null,"",null,"Contacter le chef"]
["2021-01-12","",null,"Contacter le chef",null,"",null,"Contacter le chef"]
["2021-01-13","",null,"Contacter le chef",null,"",null,"Contacter le chef"]
["2021-01-14","",null,"Contacter le chef",null,"",null,"Contacter le chef"]
["2021-01-15","",null,"Contacter le chef",null,"",null,"Contacter le chef"]
["2021-01-16","",null,"Contacter le chef",null,"",null,"Contacter le chef"]
["2021-01-17","",null,"Contacter le chef",null,"",null,"Contacter le chef"]
["2021-01-18","",null,"Contacter le chef",null,"",null,"Contacter le chef"]
["2021-01-19","",null,"Contacter le chef",null,"",null,"Contacter le chef"]
["2021-01-20","",null,"Contacter le chef",null,"",null,"Contacter le chef"]
["2021-01-21","",null,"Contacter le chef",null,"",null,"Contacter le chef"]
["2021-01-22","",null,"Contacter le chef",null,"",null,"Contacter le chef"]
["2021-01-23","",null,"Contacter le chef",null,"",null,"Contacter le chef"]
["2021-01-24","",null,"Contacter le chef",null,"",null,"Contacter le chef"]
[{"$f":"A36+1","v":"2021-01-25"},"",null,"Contacter le chef",null,"",null,"Contacter le chef"]
[{"$f":"A37+1","v":"2021-01-26"},"",null,"Contacter le chef",null,"",null,"Contacter le chef"]
["2021-01-27","",null,"Contacter le chef",null,"",null,"Contacter le chef"]
["2021-01-28","",null,"Contacter le chef",null,"",null,"Contacter le chef"]
["2021-01-29","",null,"Contacter le chef",null,"",null,"Contacter le chef"]
["2021-01-30","",null,"Contacter le chef",null,"",null,"Contacter le chef"]
[{"$f":"A42+1","v":"2021-01-31"},"",null,"Contacter le chef",null,"",null,"Contacter le chef"]
[]
[null,"Contrôle"]
[null,"Signature"]
[]
[]
[]
[]
[]
["Relevé des températures"]
[]
[]
[{"$f":"A5","v":"2020-08-01"}]
[{"$nulls":5},"Document de référence :","Directives_Frigos"]
[null,"Fréquence =>",null,null,"le matin et le soir :","Relevé des températures et contrôle des rangements"]
[]
[]
[null,"Congélateur S/Sol",{"$nulls":7},"Mesure"]
["Valeurs \ncibles =>","Minimum  -15° C                                                                                ",null," Maximum -22°C    ",null,"Minimum  -15° C                                                                                  ",null,"Maximum -22°C          ",null,"en cas de température\nNon-conforme","Visa responsable"]
["Date","Heure","T°","Résultat","Visa","Heure","T°","Résultat","Visa"]
["2021-01-01",{"$f":"IF(C63=\"\",\"\",IF(B63<>\"\",B63,NOW()))","v":""},null,{"$f":"IF(C63>15,\"OK\",\"Contacter le chef\")","v":"Contacter le chef"},null,{"$f":"IF(G63=\"\",\"\",IF(F63<>\"\",F63,NOW()))","v":""},null,{"$f":"IF(G63>15,\"OK\",\"Contacter le chef\")","v":"Contacter le chef"}]
[{"$f":"A63+1","v":"2021-01-02"},"",null,{"$f":"IF(C64>15,\"OK\",\"Contacter le chef\")","v":"Contacter le chef"},null,"",null,{"$f":"IF(G64>15,\"OK\",\"Contacter le chef\")","v":"Contacter le chef"}]
[{"$f":"A64+1","v":"2021-01-03"},"",null,"Contacter le chef",null,"",null,"Contacter le chef"]
["2021-01-04","",null,"Contacter le chef",null,"",null,"Contacter le chef"]
["2021-01-05","",null,"Contacter le chef",null,"",null,"Contacter le chef"]
["2021-01-06","",null,"Contacter le chef",null,"",null,"Contacter le chef"]
["2021-01-07","",null,"Contacter le chef",null,"",null,"Contacter le chef"]
["2021-01-08","",null,"Contacter le chef",null,"",null,"Contacter le chef"]
["2021-01-09","",null,"Contacter le chef",null,"",null,"Contacter le chef"]
["2021-01-10","",null,"Contacter le chef",null,"",null,"Contacter le chef"]
["2021-01-11","",null,"Contacter le chef",null,"",null,"Contacter le chef"]
["2021-01-12","",null,"Contacter le chef",null,"",null,"Contacter le chef"]
["2021-01-13","",null,"Contacter le chef",null,"",null,"Contacter le chef"]
["2021-01-14","",null,"Contacter le chef",null,"",null,"Contacter le chef"]
["2021-01-15","",null,"Contacter le chef",null,"",null,"Contacter le chef"]
["2021-01-16","",null,"Contacter le chef",null,"",null,"Contacter le chef"]
["2021-01-17","",null,"Contacter le chef",null,"",null,"Contacter le chef"]
["2021-01-18","",null,"Contacter le chef",null,"",null,"Contacter le chef"]
["2021-01-19","",null,"Contacter le chef",null,"",null,"Contacter le chef"]
["2021-01-20","",null,"Contacter le chef",null,"",null,"Contacter le chef"]
["2021-01-21","",null,"Contacter le chef",null,"",null,"Contacter le chef"]
["2021-01-22","",null,"Contacter le chef",null,"",null,"Contacter le chef"]
["2021-01-23","",null,"Contacter le chef",null,"",null,"Contacter le chef"]
["2021-01-24","",null,"Contacter le chef",null,"",null,"Contacter le chef"]
[{"$f":"A86+1","v":"2021-01-25"},"",null,"Contacter le chef",null,"",null,"Contacter le chef"]
[{"$f":"A87+1","v":"2021-01-26"},"",null,"Contacter le chef",null,"",null,"Contacter le chef"]
["2021-01-27","",null,"Contacter le chef",null,"",null,"Contacter le chef"]
["2021-01-28","",null,"Contacter le chef",null,"",null,"Contacter le chef"]
["2021-01-29","",null,"Contacter le chef",null,"",null,"Contacter le chef"]
["2021-01-30","",null,"Contacter le chef",null,"",null,"Contacter le chef"]
[{"$f":"A92+1","v":"2021-01-31"},"",null,"Contacter le chef",null,"",null,"Contacter le chef"]
[]
["Relevé des températures"]
[]
[]
[{"$f":"A5","v":"2020-08-01"}]
[{"$nulls":5},"Document de référence :","Directives_Frigos"]
[null,"Fréquence =>",null,null,"le matin et le soir :","Relevé des températures et contrôle des rangements"]
[]
[]
[null,"Frigo cuisine",{"$nulls":7},"Mesure"]
["Valeurs \ncibles =>","Minimum  7° C                                                                                ",null," Maximum 3°C    ",null,"Minimum  7° C                                                                                ",null," Maximum 3°C    ",null,"en cas de température\nNon-conforme","Visa responsable"]
["Date","Heure","T°","Résultat","Visa","Heure","T°","Résultat","Visa"]
["2021-01-01",{"$f":"IF(C106=\"\",\"\",IF(B106<>\"\",B106,NOW()))","v":""},null,{"$f":"IF(C106<8,\"OK\",\"Contacter le chef\")","v":"OK"},null,{"$f":"IF(G106=\"\",\"\",IF(F106<>\"\",F106,NOW()))","v":""},null,{"$f":"IF(G106<8,\"OK\",\"Contacter le chef\")","v":"OK"}]
[{"$f":"A106+1","v":"2021-01-02"},"",null,"OK",null,"",null,"OK"]
[{"$f":"A107+1","v":"2021-01-03"},"",null,"OK",null,"",null,"OK"]
["2021-01-04","",null,"OK",null,"",null,"OK"]
["2021-01-05","",null,"OK",null,"",null,"OK"]
["2021-01-06","",null,"OK",null,"",null,"OK"]
["2021-01-07","",null,"OK",null,"",null,"OK"]
["2021-01-08","",null,"OK",null,"",null,"OK"]
["2021-01-09","",null,"OK",null,"",null,"OK"]
["2021-01-10","",null,"OK",null,"",null,"OK"]
["2021-01-11","",null,"OK",null,"",null,"OK"]
["2021-01-12","",null,"OK",null,"",null,"OK"]
["2021-01-13","",null,"OK",null,"",null,"OK"]
["2021-01-14","",null,"OK",null,"",null,"OK"]
["2021-01-15","",null,"OK",null,"",null,"OK"]
["2021-01-16","",null,"OK",null,"",null,"OK"]
["2021-01-17","",null,"OK",null,"",null,"OK"]
["2021-01-18","",null,"OK",null,"",null,"OK"]
["2021-01-19","",null,"OK",null,"",null,"OK"]
["2021-01-20","",null,"OK",null,"",null,"OK"]
["2021-01-21","",null,"OK",null,"",null,"OK"]
["2021-01-22","",null,"OK",null,"",null,"OK"]
["2021-01-23","",null,"OK",null,"",null,"OK"]
["2021-01-24","",null,"OK",null,"",null,"OK"]
[{"$f":"A129+1","v":"2021-01-25"},"",null,"OK",null,"",null,"OK"]
[{"$f":"A130+1","v":"2021-01-26"},"",null,"OK",null,"",null,"OK"]
["2021-01-27","",null,"OK",null,"",null,"OK"]
["2021-01-28","",null,"OK",null,"",null,"OK"]
["2021-01-29","",null,"OK",null,"",null,"OK"]
["2021-01-30","",null,"OK",null,"",null,"OK"]
[{"$f":"A135+1","v":"2021-01-31"},"",null,"OK",null,"",null,"OK"]
[]
[]
["Relevé des températures"]
[]
[]
[{"$f":"A98","v":"2020-08-01"}]
[{"$nulls":5},"Document de référence :","Directives_Frigos"]
[null,"Fréquence =>",null,null,"le matin et le soir :","Relevé des températures et contrôle des rangements"]
[]
[]
[null,"Frigo MEP",{"$nulls":7},"Mesure"]
["Valeurs \ncibles =>","Minimum  7° C                                                                                ",null," Maximum 3°C    ",null,"Minimum  7° C                                                                                ",null," Maximum 3°C    ",null,"en cas de température\nNon-conforme","Visa responsable"]
["Date","Heure","T°","Résultat","Visa","Heure","T°","Résultat","Visa"]
["2021-01-01",{"$f":"IF(C150=\"\",\"\",IF(B150<>\"\",B150,NOW()))","v":""},null,{"$f":"IF(C150<8,\"OK\",\"Contacter le chef\")","v":"OK"},null,{"$f":"IF(G150=\"\",\"\",IF(F150<>\"\",F150,NOW()))","v":""},null,{"$f":"IF(G150<8,\"OK\",\"Contacter le chef\")","v":"OK"}]
[{"$f":"A150+1","v":"2021-01-02"},"",null,"OK",null,"",null,"OK"]
[{"$f":"A151+1","v":"2021-01-03"},"",null,"OK",null,"",null,"OK"]
["2021-01-04","",null,"OK",null,"",null,"OK"]
["2021-01-05","",null,"OK",null,"",null,"OK"]
["2021-01-06","",null,"OK",null,"",null,"OK"]
["2021-01-07","",null,"OK",null,"",null,"OK"]
["2021-01-08","",null,"OK",null,"",null,"OK"]
["2021-01-09","",null,"OK",null,"",null,"OK"]
["2021-01-10","",null,"OK",null,"",null,"OK"]
["2021-01-11","",null,"OK",null,"",null,"OK"]
["2021-01-12","",null,"OK",null,"",null,"OK"]
["2021-01-13","",null,"OK",null,"",null,"OK"]
["2021-01-14","",null,"OK",null,"",null,"OK"]
["2021-01-15","",null,"OK",null,"",null,"OK"]
["2021-01-16","",null,"OK",null,"",null,"OK"]
["2021-01-17","",null,"OK",null,"",null,"OK"]
["2021-01-18","",null,"OK",null,"",null,"OK"]
["2021-01-19","",null,"OK",null,"",null,"OK"]
["2021-01-20","",null,"OK",null,"",null,"OK"]
["2021-01-21","",null,"OK",null,"",null,"OK"]
["2021-01-22","",null,"OK",null,"",null,"OK"]
["2021-01-23","",null,"OK",null,"",null,"OK"]
["2021-01-24","",null,"OK",null,"",null,"OK"]
[{"$f":"A173+1","v":"2021-01-25"},"",null,"OK",null,"",null,"OK"]
[{"$f":"A174+1","v":"2021-01-26"},"",null,"OK",null,"",null,"OK"]
["2021-01-27","",null,"OK",null,"",null,"OK"]
["2021-01-28","",null,"OK",null,"",null,"OK"]
["2021-01-29","",null,"OK",null,"",null,"OK"]
["2021-01-30","",null,"OK",null,"",null,"OK"]
[{"$f":"A179+1","v":"2021-01-31"},"",null,"OK",null,"",null,"OK"]
[]
["Relevé des températures"]
[]
[]
[{"$f":"A142","v":"2020-08-01"}]
[{"$nulls":5},"Document de référence :","Directives_Frigos"]
[null,"Fréquence =>",null,null,"le matin et le soir :","Relevé des températures et contrôle des rangements"]
[]
[]
[null,"Frigo pâtisserie",{"$nulls":7},"Mesure"]
["Valeurs \ncibles =>","Minimum  7° C                                                                                ",null," Maximum 3°C    ",null,"Minimum  7° C                                                                                ",null," Maximum 3°C    ",null,"en cas de température\nNon-conforme","Visa responsable"]
["Date","Heure","T°","Résultat","Visa","Heure","T°","Résultat","Visa"]
["2021-01-01",{"$f":"IF(C193=\"\",\"\",IF(B193<>\"\",B193,NOW()))","v":""},null,{"$f":"IF(C193<8,\"OK\",\"Contacter le chef\")","v":"OK"},null,{"$f":"IF(G193=\"\",\"\",IF(F193<>\"\",F193,NOW()))","v":""},null,{"$f":"IF(G193<8,\"OK\",\"Contacter le chef\")","v":"OK"}]
[{"$f":"A193+1","v":"2021-01-02"},"",null,"OK",null,"",null,"OK"]
[{"$f":"A194+1","v":"2021-01-03"},"",null,"OK",null,"",null,"OK"]
["2021-01-04","",null,"OK",null,"",null,"OK"]
["2021-01-05","",null,"OK",null,"",null,"OK"]
["2021-01-06","",null,"OK",null,"",null,"OK"]
["2021-01-07","",null,"OK",null,"",null,"OK"]
["2021-01-08","",null,"OK",null,"",null,"OK"]
["2021-01-09","",null,"OK",null,"",null,"OK"]
["2021-01-10","",null,"OK",null,"",null,"OK"]
["2021-01-11","",null,"OK",null,"",null,"OK"]
["2021-01-12","",null,"OK",null,"",null,"OK"]
["2021-01-13","",null,"OK",null,"",null,"OK"]
["2021-01-14","",null,"OK",null,"",null,"OK"]
["2021-01-15","",null,"OK",null,"",null,"OK"]
["2021-01-16","",null,"OK",null,"",null,"OK"]
["2021-01-17","",null,"OK",null,"",null,"OK"]
["2021-01-18","",null,"OK",null,"",null,"OK"]
["2021-01-19","",null,"OK",null,"",null,"OK"]
["2021-01-20","",null,"OK",null,"",null,"OK"]
["2021-01-21","",null,"OK",null,"",null,"OK"]
["2021-01-22","",null,"OK",null,"",null,"OK"]
["2021-01-23","",null,"OK",null,"",null,"OK"]
["2021-01-24","",null,"OK",null,"",null,"OK"]
[{"$f":"A216+1","v":"2021-01-25"},"",null,"OK",null,"",null,"OK"]
[{"$f":"A217+1","v":"2021-01-26"},"",null,"OK",null,"",null,"OK"]
["2021-01-27","",null,"OK",null,"",null,"OK"]
["2021-01-28","",null,"OK",null,"",null,"OK"]
["2021-01-29","",null,"OK",null,"",null,"OK"]
["2021-01-30","",null,"OK",null,"",null,"OK"]
[{"$f":"A222+1","v":"2021-01-31"},"",null,"OK",null,"",null,"OK"]
[]
["Relevé des températures"]
[]
[]
[{"$f":"A185","v":"2020-08-01"}]
[{"$nulls":5},"Document de référence :","Directives_Frigos"]
[null,"Fréquence =>",null,null,"le matin et le soir :","Relevé des températures et contrôle des rangements"]
[]
[]
[null,"Frigo produits laitiers",{"$nulls":7},"Mesure"]
["Valeurs \ncibles =>","Minimum  7° C                                                                                ",null," Maximum 3°C    ",null,"Minimum  7° C                                                                                ",null," Maximum 3°C    ",null,"en cas de température\nNon-conforme","Visa responsable"]
["Date","Heure","T°","Résultat","Visa","Heure","T°","Résultat","Visa"]
["2021-01-01",{"$f":"IF(C236=\"\",\"\",IF(B236<>\"\",B236,NOW()))","v":""},null,{"$f":"IF(C236<8,\"OK\",\"Contacter le chef\")","v":"OK"},null,{"$f":"IF(G236=\"\",\"\",IF(F236<>\"\",F236,NOW()))","v":""},null,{"$f":"IF(G236<8,\"OK\",\"Contacter le chef\")","v":"OK"}]
[{"$f":"A236+1","v":"2021-01-02"},"",null,"OK",null,"",null,"OK"]
[{"$f":"A237+1","v":"2021-01-03"},"",null,"OK",null,"",null,"OK"]
["2021-01-04","",null,"OK",null,"",null,"OK"]
["2021-01-05","",null,"OK",null,"",null,"OK"]
["2021-01-06","",null,"OK",null,"",null,"OK"]
["2021-01-07","",null,"OK",null,"",null,"OK"]
["2021-01-08","",null,"OK",null,"",null,"OK"]
["2021-01-09","",null,"OK",null,"",null,"OK"]
["2021-01-10","",null,"OK",null,"",null,"OK"]
["2021-01-11","",null,"OK",null,"",null,"OK"]
["2021-01-12","",null,"OK",null,"",null,"OK"]
["2021-01-13","",null,"OK",null,"",null,"OK"]
["2021-01-14","",null,"OK",null,"",null,"OK"]
["2021-01-15","",null,"OK",null,"",null,"OK"]
["2021-01-16","",null,"OK",null,"",null,"OK"]
["2021-01-17","",null,"OK",null,"",null,"OK"]
["2021-01-18","",null,"OK",null,"",null,"OK"]
["2021-01-19","",null,"OK",null,"",null,"OK"]
["2021-01-20","",null,"OK",null,"",null,"OK"]
["2021-01-21","",null,"OK",null,"",null,"OK"]
["2021-01-22","",null,"OK",null,"",null,"OK"]
["2021-01-23","",null,"OK",null,"",null,"OK"]
["2021-01-24","",null,"OK",null,"",null,"OK"]
[{"$f":"A259+1","v":"2021-01-25"},"",null,"OK",null,"",null,"OK"]
[{"$f":"A260+1","v":"2021-01-26"},"",null,"OK",null,"",null,"OK"]
["2021-01-27","",null,"OK",null,"",null,"OK"]
["2021-01-28","",null,"OK",null,"",null,"OK"]
["2021-01-29","",null,"OK",null,"",null,"OK"]
["2021-01-30","",null,"OK",null,"",null,"OK"]
[{"$f":"A265+1","v":"2021-01-31"},"",null,"OK",null,"",null,"OK"]
[]
[]
["Relevé des températures"]
[]
[]
[{"$f":"A228","v":"2020-08-01"}]
[{"$nulls":5},"Document de référence :","Directives_Frigos"]
[null,"Fréquence =>",null,null,"le matin et le soir :","Relevé des températures et contrôle des rangements"]
[]
[]
[null,"Frigo S/Sol",{"$nulls":7},"Mesure"]
["Valeurs \ncibles =>","Minimum  7° C                                                                                ",null," Maximum 3°C    ",null,"Minimum  7° C                                                                                ",null," Maximum 3°C    ",null,"en cas de température\nNon-conforme","Visa responsable"]
["Date","Heure","T°","Résultat","Visa","Heure","T°","Résultat","Visa"]
["2021-01-01",{"$f":"IF(C280=\"\",\"\",IF(B280<>\"\",B280,NOW()))","v":""},null,{"$f":"IF(C280<8,\"OK\",\"Contacter le chef\")","v":"OK"},null,{"$f":"IF(G280=\"\",\"\",IF(F280<>\"\",F280,NOW()))","v":""},null,{"$f":"IF(G280<8,\"OK\",\"Contacter le chef\")","v":"OK"}]
[{"$f":"A280+1","v":"2021-01-02"},"",null,{"$f":"IF(C281<8,\"OK\",\"Contacter le chef\")","v":"OK"},null,"",null,"OK"]
[{"$f":"A281+1","v":"2021-01-03"},"",null,"OK",null,"",null,"OK"]
["2021-01-04","",null,"OK",null,"",null,"OK"]
["2021-01-05","",null,"OK",null,"",null,"OK"]
["2021-01-06","",null,"OK",null,"",null,"OK"]
["2021-01-07","",null,"OK",null,"",null,"OK"]
["2021-01-08","",null,"OK",null,"",null,"OK"]
["2021-01-09","",null,"OK",null,"",null,"OK"]
["2021-01-10","",null,"OK",null,"",null,"OK"]
["2021-01-11","",null,"OK",null,"",null,"OK"]
["2021-01-12","",null,"OK",null,"",null,"OK"]
["2021-01-13","",null,"OK",null,"",null,"OK"]
["2021-01-14","",null,"OK",null,"",null,"OK"]
["2021-01-15","",null,"OK",null,"",null,"OK"]
["2021-01-16","",null,"OK",null,"",null,"OK"]
["2021-01-17","",null,"OK",null,"",null,"OK"]
["2021-01-18","",null,"OK",null,"",null,"OK"]
["2021-01-19","",null,"OK",null,"",null,"OK"]
["2021-01-20","",null,"OK",null,"",null,"OK"]
["2021-01-21","",null,"OK",null,"",null,"OK"]
["2021-01-22","",null,"OK",null,"",null,"OK"]
["2021-01-23","",null,"OK",null,"",null,"OK"]
["2021-01-24","",null,"OK",null,"",null,"OK"]
[{"$f":"A303+1","v":"2021-01-25"},"",null,"OK",null,"",null,"OK"]
[{"$f":"A304+1","v":"2021-01-26"},"",null,"OK",null,"",null,"OK"]
["2021-01-27","",null,"OK",null,"",null,"OK"]
["2021-01-28","",null,"OK",null,"",null,"OK"]
["2021-01-29","",null,"OK",null,"",null,"OK"]
["2021-01-30","",null,"OK",null,"",null,"OK"]
[{"$f":"A309+1","v":"2021-01-31"},"",null,"OK",null,"",null,"OK"]

{"sheet":"Septembre","index":8,"n_rows":310,"n_cols":11,"rows_kept":310,"merged":[[0,0,0,9],[1,0,1,9],[4,0,4,9],[9,1,9,8],[50,0,50,9],[51,0,51,9],[54,0,54,9],[59,1,59,8],[93,0,93,9],[94,0,94,9],[97,0,97,9],[102,1,102,8],[103,1,103,2],[103,5,103,6],[137,0,137,9],[138,0,138,9],[141,0,141,10],[146,1,146,8],[147,1,147,2],[147,5,147,6],[180,0,180,9],[181,0,181,9],[184,0,184,9],[189,1,189,8],[190,1,190,2],[190,5,190,6],[223,0,223,9],[224,0,224,9],[227,0,227,9],[232,1,232,8],[233,1,233,2],[233,5,233,6],[267,0,267,9],[268,0,268,9],[271,0,271,9],[276,1,276,8],[277,1,277,2],[277,5,277,6]]}
[]
["Relevé des températures"]
[]
[]
["2020-09-01"]
[{"$nulls":5},"Document de référence :","Directives_Frigos"]
[null,"Fréquence =>",null,null,"le matin et le soir :","Relevé des températures "]
[]
[]
[null,"Congélateur cuisine",{"$nulls":7},"Mesure"]
["Valeurs \ncibles =>","Minimum  -15° C                                                                                ",null," Maximum -22°C    ",null,"Minimum  -15° C                                                                                  ",null,"Maximum -22°C          ",null,"en cas de température\nNon-conforme","Visa responsable"]
["Date","Heure","T°","Résultat","Visa","Heure","T°","Résultat","Visa"]
["2021-01-01",{"$f":"IF(C13=\"\",\"\",IF(B13<>\"\",B13,NOW()))","v":""},null,{"$f":"IF(C13>15,\"OK\",\"Contacter le chef\")","v":"Contacter le chef"},null,{"$f":"IF(G13=\"\",\"\",IF(F13<>\"\",F13,NOW()))","v":""},null,{"$f":"IF(G13>15,\"OK\",\"Contacter le chef\")","v":"Contacter le chef"}]
[{"$f":"A13+1","v":"2021-01-02"},"",null,{"$f":"IF(C14>15,\"OK\",\"Contacter le chef\")","v":"Contacter le chef"},null,"",null,{"$f":"IF(G14>15,\"OK\",\"Contacter le chef\")","v":"Contacter le chef"}]
[{"$f":"A14+1","v":"2021-01-03"},"",null,"Contacter le chef",null,"",null,"Contacter le chef"]
["2021-01-04","",null,"Contacter le chef",null,"",null,"Contacter le chef"]
["2021-01-05","",null,"Contacter le chef",null,"",null,"Contacter le chef"]
["2021-01-06","",null,"Contacter le chef",null,"",null,"Contacter le chef"]
["2021-01-07","",null,"Contacter le chef",null,"",null,"Contacter le chef"]
["2021-01-08","",null,"Contacter le chef",null,"",null,"Contacter le chef"]
["2021-01-09","",null,"Contacter le chef",null,"",null,"Contacter le chef"]
["2021-01-10","",null,"Contacter le chef",null,"",null,"Contacter le chef"]
["2021-01-11","",null,"Contacter le chef",null,"",null,"Contacter le chef"]
["2021-01-12","",null,"Contacter le chef",null,"",null,"Contacter le chef"]
["2021-01-13","",null,"Contacter le chef",null,"",null,"Contacter le chef"]
["2021-01-14","",null,"Contacter le chef",null,"",null,"Contacter le chef"]
["2021-01-15","",null,"Contacter le chef",null,"",null,"Contacter le chef"]
["2021-01-16","",null,"Contacter le chef",null,"",null,"Contacter le chef"]
["2021-01-17","",null,"Contacter le chef",null,"",null,"Contacter le chef"]
["2021-01-18","",null,"Contacter le chef",null,"",null,"Contacter le chef"]
["2021-01-19","",null,"Contacter le chef",null,"",null,"Contacter le chef"]
["2021-01-20","",null,"Contacter le chef",null,"",null,"Contacter le chef"]
["2021-01-21","",null,"Contacter le chef",null,"",null,"Contacter le chef"]
["2021-01-22","",null,"Contacter le chef",null,"",null,"Contacter le chef"]
["2021-01-23","",null,"Contacter le chef",null,"",null,"Contacter le chef"]
["2021-01-24","",null,"Contacter le chef",null,"",null,"Contacter le chef"]
[{"$f":"A36+1","v":"2021-01-25"},"",null,"Contacter le chef",null,"",null,"Contacter le chef"]
[{"$f":"A37+1","v":"2021-01-26"},"",null,"Contacter le chef",null,"",null,"Contacter le chef"]
["2021-01-27","",null,"Contacter le chef",null,"",null,"Contacter le chef"]
["2021-01-28","",null,"Contacter le chef",null,"",null,"Contacter le chef"]
["2021-01-29","",null,"Contacter le chef",null,"",null,"Contacter le chef"]
["2021-01-30","",null,"Contacter le chef",null,"",null,"Contacter le chef"]
[{"$f":"A42+1","v":"2021-01-31"},"",null,"Contacter le chef",null,"",null,"Contacter le chef"]
[]
[null,"Contrôle"]
[null,"Signature"]
[]
[]
[]
[]
[]
["Relevé des températures"]
[]
[]
[{"$f":"A5","v":"2020-09-01"}]
[{"$nulls":5},"Document de référence :","Directives_Frigos"]
[null,"Fréquence =>",null,null,"le matin et le soir :","Relevé des températures et contrôle des rangements"]
[]
[]
[null,"Congélateur S/Sol",{"$nulls":7},"Mesure"]
["Valeurs \ncibles =>","Minimum  -15° C                                                                                ",null," Maximum -22°C    ",null,"Minimum  -15° C                                                                                  ",null,"Maximum -22°C          ",null,"en cas de température\nNon-conforme","Visa responsable"]
["Date","Heure","T°","Résultat","Visa","Heure","T°","Résultat","Visa"]
["2021-01-01",{"$f":"IF(C63=\"\",\"\",IF(B63<>\"\",B63,NOW()))","v":""},null,{"$f":"IF(C63>15,\"OK\",\"Contacter le chef\")","v":"Contacter le chef"},null,{"$f":"IF(G63=\"\",\"\",IF(F63<>\"\",F63,NOW()))","v":""},null,{"$f":"IF(G63>15,\"OK\",\"Contacter le chef\")","v":"Contacter le chef"}]
[{"$f":"A63+1","v":"2021-01-02"},"",null,{"$f":"IF(C64>15,\"OK\",\"Contacter le chef\")","v":"Contacter le chef"},null,"",null,{"$f":"IF(G64>15,\"OK\",\"Contacter le chef\")","v":"Contacter le chef"}]
[{"$f":"A64+1","v":"2021-01-03"},"",null,"Contacter le chef",null,"",null,"Contacter le chef"]
["2021-01-04","",null,"Contacter le chef",null,"",null,"Contacter le chef"]
["2021-01-05","",null,"Contacter le chef",null,"",null,"Contacter le chef"]
["2021-01-06","",null,"Contacter le chef",null,"",null,"Contacter le chef"]
["2021-01-07","",null,"Contacter le chef",null,"",null,"Contacter le chef"]
["2021-01-08","",null,"Contacter le chef",null,"",null,"Contacter le chef"]
["2021-01-09","",null,"Contacter le chef",null,"",null,"Contacter le chef"]
["2021-01-10","",null,"Contacter le chef",null,"",null,"Contacter le chef"]
["2021-01-11","",null,"Contacter le chef",null,"",null,"Contacter le chef"]
["2021-01-12","",null,"Contacter le chef",null,"",null,"Contacter le chef"]
["2021-01-13","",null,"Contacter le chef",null,"",null,"Contacter le chef"]
["2021-01-14","",null,"Contacter le chef",null,"",null,"Contacter le chef"]
["2021-01-15","",null,"Contacter le chef",null,"",null,"Contacter le chef"]
["2021-01-16","",null,"Contacter le chef",null,"",null,"Contacter le chef"]
["2021-01-17","",null,"Contacter le chef",null,"",null,"Contacter le chef"]
["2021-01-18","",null,"Contacter le chef",null,"",null,"Contacter le chef"]
["2021-01-19","",null,"Contacter le chef",null,"",null,"Contacter le chef"]
["2021-01-20","",null,"Contacter le chef",null,"",null,"Contacter le chef"]
["2021-01-21","",null,"Contacter le chef",null,"",null,"Contacter le chef"]
["2021-01-22","",null,"Contacter le chef",null,"",null,"Contacter le chef"]
["2021-01-23","",null,"Contacter le chef",null,"",null,"Contacter le chef"]
["2021-01-24","",null,"Contacter le chef",null,"",null,"Contacter le chef"]
[{"$f":"A86+1","v":"2021-01-25"},"",null,"Contacter le chef",null,"",null,"Contacter le chef"]
[{"$f":"A87+1","v":"2021-01-26"},"",null,"Contacter le chef",null,"",null,"Contacter le chef"]
["2021-01-27","",null,"Contacter le chef",null,"",null,"Contacter le chef"]
["2021-01-28","",null,"Contacter le chef",null,"",null,"Contacter le chef"]
["2021-01-29","",null,"Contacter le chef",null,"",null,"Contacter le chef"]
["2021-01-30","",null,"Contacter le chef",null,"",null,"Contacter le chef"]
[{"$f":"A92+1","v":"2021-01-31"},"",null,"Contacter le chef",null,"",null,"Contacter le chef"]
[]
["Relevé des températures"]
[]
[]
[{"$f":"A5","v":"2020-09-01"}]
[{"$nulls":5},"Document de référence :","Directives_Frigos"]
[null,"Fréquence =>",null,null,"le matin et le soir :","Relevé des températures et contrôle des rangements"]
[]
[]
[null,"Frigo cuisine",{"$nulls":7},"Mesure"]
["Valeurs \ncibles =>","Minimum  7° C                                                                                ",null," Maximum 3°C    ",null,"Minimum  7° C                                                                                ",null," Maximum 3°C    ",null,"en cas de température\nNon-conforme","Visa responsable"]
["Date","Heure","T°","Résultat","Visa","Heure","T°","Résultat","Visa"]
["2021-01-01",{"$f":"IF(C106=\"\",\"\",IF(B106<>\"\",B106,NOW()))","v":""},null,{"$f":"IF(C106<8,\"OK\",\"Contacter le chef\")","v":"OK"},null,{"$f":"IF(G106=\"\",\"\",IF(F106<>\"\",F106,NOW()))","v":""},null,{"$f":"IF(G106<8,\"OK\",\"Contacter le chef\")","v":"OK"}]
[{"$f":"A106+1","v":"2021-01-02"},"",null,"OK",null,"",null,"OK"]
[{"$f":"A107+1","v":"2021-01-03"},"",null,"OK",null,"",null,"OK"]
["2021-01-04","",null,"OK",null,"",null,"OK"]
["2021-01-05","",null,"OK",null,"",null,"OK"]
["2021-01-06","",null,"OK",null,"",null,"OK"]
["2021-01-07","",null,"OK",null,"",null,"OK"]
["2021-01-08","",null,"OK",null,"",null,"OK"]
["2021-01-09","",null,"OK",null,"",null,"OK"]
["2021-01-10","",null,"OK",null,"",null,"OK"]
["2021-01-11","",null,"OK",null,"",null,"OK"]
["2021-01-12","",null,"OK",null,"",null,"OK"]
["2021-01-13","",null,"OK",null,"",null,"OK"]
["2021-01-14","",null,"OK",null,"",null,"OK"]
["2021-01-15","",null,"OK",null,"",null,"OK"]
["2021-01-16","",null,"OK",null,"",null,"OK"]
["2021-01-17","",null,"OK",null,"",null,"OK"]
["2021-01-18","",null,"OK",null,"",null,"OK"]
["2021-01-19","",null,"OK",null,"",null,"OK"]
["2021-01-20","",null,"OK",null,"",null,"OK"]
["2021-01-21","",null,"OK",null,"",null,"OK"]
["2021-01-22","",null,"OK",null,"",null,"OK"]
["2021-01-23","",null,"OK",null,"",null,"OK"]
["2021-01-24","",null,"OK",null,"",null,"OK"]
[{"$f":"A129+1","v":"2021-01-25"},"",null,"OK",null,"",null,"OK"]
[{"$f":"A130+1","v":"2021-01-26"},"",null,"OK",null,"",null,"OK"]
["2021-01-27","",null,"OK",null,"",null,"OK"]
["2021-01-28","",null,"OK",null,"",null,"OK"]
["2021-01-29","",null,"OK",null,"",null,"OK"]
["2021-01-30","",null,"OK",null,"",null,"OK"]
[{"$f":"A135+1","v":"2021-01-31"},"",null,"OK",null,"",null,"OK"]
[]
[]
["Relevé des températures"]
[]
[]
[{"$f":"A98","v":"2020-09-01"}]
[{"$nulls":5},"Document de référence :","Directives_Frigos"]
[null,"Fréquence =>",null,null,"le matin et le soir :","Relevé des températures et contrôle des rangements"]
[]
[]
[null,"Frigo MEP",{"$nulls":7},"Mesure"]
["Valeurs \ncibles =>","Minimum  7° C                                                                                ",null," Maximum 3°C    ",null,"Minimum  7° C                                                                                ",null," Maximum 3°C    ",null,"en cas de température\nNon-conforme","Visa responsable"]
["Date","Heure","T°","Résultat","Visa","Heure","T°","Résultat","Visa"]
["2021-01-01",{"$f":"IF(C150=\"\",\"\",IF(B150<>\"\",B150,NOW()))","v":""},null,{"$f":"IF(C150<8,\"OK\",\"Contacter le chef\")","v":"OK"},null,{"$f":"IF(G150=\"\",\"\",IF(F150<>\"\",F150,NOW()))","v":""},null,{"$f":"IF(G150<8,\"OK\",\"Contacter le chef\")","v":"OK"}]
[{"$f":"A150+1","v":"2021-01-02"},"",null,"OK",null,"",null,"OK"]
[{"$f":"A151+1","v":"2021-01-03"},"",null,"OK",null,"",null,"OK"]
["2021-01-04","",null,"OK",null,"",null,"OK"]
["2021-01-05","",null,"OK",null,"",null,"OK"]
["2021-01-06","",null,"OK",null,"",null,"OK"]
["2021-01-07","",null,"OK",null,"",null,"OK"]
["2021-01-08","",null,"OK",null,"",null,"OK"]
["2021-01-09","",null,"OK",null,"",null,"OK"]
["2021-01-10","",null,"OK",null,"",null,"OK"]
["2021-01-11","",null,"OK",null,"",null,"OK"]
["2021-01-12","",null,"OK",null,"",null,"OK"]
["2021-01-13","",null,"OK",null,"",null,"OK"]
["2021-01-14","",null,"OK",null,"",null,"OK"]
["2021-01-15","",null,"OK",null,"",null,"OK"]
["2021-01-16","",null,"OK",null,"",null,"OK"]
["2021-01-17","",null,"OK",null,"",null,"OK"]
["2021-01-18","",null,"OK",null,"",null,"OK"]
["2021-01-19","",null,"OK",null,"",null,"OK"]
["2021-01-20","",null,"OK",null,"",null,"OK"]
["2021-01-21","",null,"OK",null,"",null,"OK"]
["2021-01-22","",null,"OK",null,"",null,"OK"]
["2021-01-23","",null,"OK",null,"",null,"OK"]
["2021-01-24","",null,"OK",null,"",null,"OK"]
[{"$f":"A173+1","v":"2021-01-25"},"",null,"OK",null,"",null,"OK"]
[{"$f":"A174+1","v":"2021-01-26"},"",null,"OK",null,"",null,"OK"]
["2021-01-27","",null,"OK",null,"",null,"OK"]
["2021-01-28","",null,"OK",null,"",null,"OK"]
["2021-01-29","",null,"OK",null,"",null,"OK"]
["2021-01-30","",null,"OK",null,"",null,"OK"]
[{"$f":"A179+1","v":"2021-01-31"},"",null,"OK",null,"",null,"OK"]
[]
["Relevé des températures"]
[]
[]
[{"$f":"A142","v":"2020-09-01"}]
[{"$nulls":5},"Document de référence :","Directives_Frigos"]
[null,"Fréquence =>",null,null,"le matin et le soir :","Relevé des températures et contrôle des rangements"]
[]
[]
[null,"Frigo pâtisserie",{"$nulls":7},"Mesure"]
["Valeurs \ncibles =>","Minimum  7° C                                                                                ",null," Maximum 3°C    ",null,"Minimum  7° C                                                                                ",null," Maximum 3°C    ",null,"en cas de température\nNon-conforme","Visa responsable"]
["Date","Heure","T°","Résultat","Visa","Heure","T°","Résultat","Visa"]
["2021-01-01",{"$f":"IF(C193=\"\",\"\",IF(B193<>\"\",B193,NOW()))","v":""},null,{"$f":"IF(C193<8,\"OK\",\"Contacter le chef\")","v":"OK"},null,{"$f":"IF(G193=\"\",\"\",IF(F193<>\"\",F193,NOW()))","v":""},null,{"$f":"IF(G193<8,\"OK\",\"Contacter le chef\")","v":"OK"}]
[{"$f":"A193+1","v":"2021-01-02"},"",null,"OK",null,"",null,"OK"]
[{"$f":"A194+1","v":"2021-01-03"},"",null,"OK",null,"",null,"OK"]
["2021-01-04","",null,"OK",null,"",null,"OK"]
["2021-01-05","",null,"OK",null,"",null,"OK"]
["2021-01-06","",null,"OK",null,"",null,"OK"]
["2021-01-07","",null,"OK",null,"",null,"OK"]
["2021-01-08","",null,"OK",null,"",null,"OK"]
["2021-01-09","",null,"OK",null,"",null,"OK"]
["2021-01-10","",null,"OK",null,"",null,"OK"]
["2021-01-11","",null,"OK",null,"",null,"OK"]
["2021-01-12","",null,"OK",null,"",null,"OK"]
["2021-01-13","",null,"OK",null,"",null,"OK"]
["2021-01-14","",null,"OK",null,"",null,"OK"]
["2021-01-15","",null,"OK",null,"",null,"OK"]
["2021-01-16","",null,"OK",null,"",null,"OK"]
["2021-01-17","",null,"OK",null,"",null,"OK"]
["2021-01-18","",null,"OK",null,"",null,"OK"]
["2021-01-19","",null,"OK",null,"",null,"OK"]
["2021-01-20","",null,"OK",null,"",null,"OK"]
["2021-01-21","",null,"OK",null,"",null,"OK"]
["2021-01-22","",null,"OK",null,"",null,"OK"]
["2021-01-23","",null,"OK",null,"",null,"OK"]
["2021-01-24","",null,"OK",null,"",null,"OK"]
[{"$f":"A216+1","v":"2021-01-25"},"",null,"OK",null,"",null,"OK"]
[{"$f":"A217+1","v":"2021-01-26"},"",null,"OK",null,"",null,"OK"]
["2021-01-27","",null,"OK",null,"",null,"OK"]
["2021-01-28","",null,"OK",null,"",null,"OK"]
["2021-01-29","",null,"OK",null,"",null,"OK"]
["2021-01-30","",null,"OK",null,"",null,"OK"]
[{"$f":"A222+1","v":"2021-01-31"},"",null,"OK",null,"",null,"OK"]
[]
["Relevé des températures"]
[]
[]
[{"$f":"A185","v":"2020-09-01"}]
[{"$nulls":5},"Document de référence :","Directives_Frigos"]
[null,"Fréquence =>",null,null,"le matin et le soir :","Relevé des températures et contrôle des rangements"]
[]
[]
[null,"Frigo produits laitiers",{"$nulls":7},"Mesure"]
["Valeurs \ncibles =>","Minimum  7° C                                                                                ",null," Maximum 3°C    ",null,"Minimum  7° C                                                                                ",null," Maximum 3°C    ",null,"en cas de température\nNon-conforme","Visa responsable"]
["Date","Heure","T°","Résultat","Visa","Heure","T°","Résultat","Visa"]
["2021-01-01",{"$f":"IF(C236=\"\",\"\",IF(B236<>\"\",B236,NOW()))","v":""},null,{"$f":"IF(C236<8,\"OK\",\"Contacter le chef\")","v":"OK"},null,{"$f":"IF(G236=\"\",\"\",IF(F236<>\"\",F236,NOW()))","v":""},null,{"$f":"IF(G236<8,\"OK\",\"Contacter le chef\")","v":"OK"}]
[{"$f":"A236+1","v":"2021-01-02"},"",null,"OK",null,"",null,"OK"]
[{"$f":"A237+1","v":"2021-01-03"},"",null,"OK",null,"",null,"OK"]
["2021-01-04","",null,"OK",null,"",null,"OK"]
["2021-01-05","",null,"OK",null,"",null,"OK"]
["2021-01-06","",null,"OK",null,"",null,"OK"]
["2021-01-07","",null,"OK",null,"",null,"OK"]
["2021-01-08","",null,"OK",null,"",null,"OK"]
["2021-01-09","",null,"OK",null,"",null,"OK"]
["2021-01-10","",null,"OK",null,"",null,"OK"]
["2021-01-11","",null,"OK",null,"",null,"OK"]
["2021-01-12","",null,"OK",null,"",null,"OK"]
["2021-01-13","",null,"OK",null,"",null,"OK"]
["2021-01-14","",null,"OK",null,"",null,"OK"]
["2021-01-15","",null,"OK",null,"",null,"OK"]
["2021-01-16","",null,"OK",null,"",null,"OK"]
["2021-01-17","",null,"OK",null,"",null,"OK"]
["2021-01-18","",null,"OK",null,"",null,"OK"]
["2021-01-19","",null,"OK",null,"",null,"OK"]
["2021-01-20","",null,"OK",null,"",null,"OK"]
["2021-01-21","",null,"OK",null,"",null,"OK"]
["2021-01-22","",null,"OK",null,"",null,"OK"]
["2021-01-23","",null,"OK",null,"",null,"OK"]
["2021-01-24","",null,"OK",null,"",null,"OK"]
[{"$f":"A259+1","v":"2021-01-25"},"",null,"OK",null,"",null,"OK"]
[{"$f":"A260+1","v":"2021-01-26"},"",null,"OK",null,"",null,"OK"]
["2021-01-27","",null,"OK",null,"",null,"OK"]
["2021-01-28","",null,"OK",null,"",null,"OK"]
["2021-01-29","",null,"OK",null,"",null,"OK"]
["2021-01-30","",null,"OK",null,"",null,"OK"]
[{"$f":"A265+1","v":"2021-01-31"},"",null,"OK",null,"",null,"OK"]
[]
[]
["Relevé des températures"]
[]
[]
[{"$f":"A228","v":"2020-09-01"}]
[{"$nulls":5},"Document de référence :","Directives_Frigos"]
[null,"Fréquence =>",null,null,"le matin et le soir :","Relevé des températures et contrôle des rangements"]
[]
[]
[null,"Frigo S/Sol",{"$nulls":7},"Mesure"]
["Valeurs \ncibles =>","Minimum  7° C                                                                                ",null," Maximum 3°C    ",null,"Minimum  7° C                                                                                ",null," Maximum 3°C    ",null,"en cas de température\nNon-conforme","Visa responsable"]
["Date","Heure","T°","Résultat","Visa","Heure","T°","Résultat","Visa"]
["2021-01-01",{"$f":"IF(C280=\"\",\"\",IF(B280<>\"\",B280,NOW()))","v":""},null,{"$f":"IF(C280<8,\"OK\",\"Contacter le chef\")","v":"OK"},null,{"$f":"IF(G280=\"\",\"\",IF(F280<>\"\",F280,NOW()))","v":""},null,{"$f":"IF(G280<8,\"OK\",\"Contacter le chef\")","v":"OK"}]
[{"$f":"A280+1","v":"2021-01-02"},"",null,{"$f":"IF(C281<8,\"OK\",\"Contacter le chef\")","v":"OK"},null,"",null,"OK"]
[{"$f":"A281+1","v":"2021-01-03"},"",null,"OK",null,"",null,"OK"]
["2021-01-04","",null,"OK",null,"",null,"OK"]
["2021-01-05","",null,"OK",null,"",null,"OK"]
["2021-01-06","",null,"OK",null,"",null,"OK"]
["2021-01-07","",null,"OK",null,"",null,"OK"]
["2021-01-08","",null,"OK",null,"",null,"OK"]
["2021-01-09","",null,"OK",null,"",null,"OK"]
["2021-01-10","",null,"OK",null,"",null,"OK"]
["2021-01-11","",null,"OK",null,"",null,"OK"]
["2021-01-12","",null,"OK",null,"",null,"OK"]
["2021-01-13","",null,"OK",null,"",null,"OK"]
["2021-01-14","",null,"OK",null,"",null,"OK"]
["2021-01-15","",null,"OK",null,"",null,"OK"]
["2021-01-16","",null,"OK",null,"",null,"OK"]
["2021-01-17","",null,"OK",null,"",null,"OK"]
["2021-01-18","",null,"OK",null,"",null,"OK"]
["2021-01-19","",null,"OK",null,"",null,"OK"]
["2021-01-20","",null,"OK",null,"",null,"OK"]
["2021-01-21","",null,"OK",null,"",null,"OK"]
["2021-01-22","",null,"OK",null,"",null,"OK"]
["2021-01-23","",null,"OK",null,"",null,"OK"]
["2021-01-24","",null,"OK",null,"",null,"OK"]
[{"$f":"A303+1","v":"2021-01-25"},"",null,"OK",null,"",null,"OK"]
[{"$f":"A304+1","v":"2021-01-26"},"",null,"OK",null,"",null,"OK"]
["2021-01-27","",null,"OK",null,"",null,"OK"]
["2021-01-28","",null,"OK",null,"",null,"OK"]
["2021-01-29","",null,"OK",null,"",null,"OK"]
["2021-01-30","",null,"OK",null,"",null,"OK"]
[{"$f":"A309+1","v":"2021-01-31"},"",null,"OK",null,"",null,"OK"]

{"sheet":"Octobre","index":9,"n_rows":310,"n_cols":13,"rows_kept":310,"merged":[[0,0,0,9],[1,0,1,9],[4,0,4,9],[9,1,9,8],[50,0,50,9],[51,0,51,9],[54,0,54,9],[59,1,59,8],[93,0,93,9],[94,0,94,9],[97,0,97,9],[102,1,102,8],[103,1,103,2],[103,5,103,6],[137,0,137,9],[138,0,138,9],[141,0,141,10],[146,1,146,8],[147,1,147,2],[147,5,147,6],[180,0,180,9],[181,0,181,9],[184,0,184,9],[189,1,189,8],[190,1,190,2],[190,5,190,6],[223,0,223,9],[224,0,224,9],[227,0,227,9],[232,1,232,8],[233,1,233,2],[233,5,233,6],[267,0,267,9],[268,0,268,9],[271,0,271,9],[276,1,276,8],[277,1,277,2],[277,5,277,6]]}
[]
["Relevé des températures"]
[]
[]
["2020-10-01"]
[{"$nulls":5},"Document de référence :","Directives_Frigos"]
[null,"Fréquence =>",null,null,"le matin et le soir :","Relevé des températures "]
[]
[]
[null,"Congélateur cuisine",{"$nulls":7},"Mesure"]
["Valeurs \ncibles =>","Minimum  -15° C                                                                                ",null," Maximum -22°C    ",null,"Minimum  -15° C                                                                                  ",null,"Maximum -22°C          ",null,"en cas de température\nNon-conforme","Visa responsable"]
["Date","Heure","T°","Résultat","Visa","Heure","T°","Résultat","Visa"]
["2021-01-01",{"$f":"IF(C13=\"\",\"\",IF(B13<>\"\",B13,NOW()))","v":""},null,{"$f":"IF(C13>15,\"OK\",\"Contacter le chef\")","v":"Contacter le chef"},null,{"$f":"IF(G13=\"\",\"\",IF(F13<>\"\",F13,NOW()))","v":""},null,{"$f":"IF(G13>15,\"OK\",\"Contacter le chef\")","v":"Contacter le chef"}]
[{"$f":"A13+1","v":"2021-01-02"},"",null,{"$f":"IF(C14>15,\"OK\",\"Contacter le chef\")","v":"Contacter le chef"},null,"",null,{"$f":"IF(G14>15,\"OK\",\"Contacter le chef\")","v":"Contacter le chef"}]
[{"$f":"A14+1","v":"2021-01-03"},"",null,"Contacter le chef",null,"",null,"Contacter le chef"]
["2021-01-04","",null,"Contacter le chef",null,"",null,"Contacter le chef"]
["2021-01-05","",null,"Contacter le chef",null,"",null,"Contacter le chef"]
["2021-01-06","",null,"Contacter le chef",null,"",null,"Contacter le chef"]
["2021-01-07","",null,"Contacter le chef",null,"",null,"Contacter le chef"]
["2021-01-08","",null,"Contacter le chef",null,"",null,"Contacter le chef"]
["2021-01-09","",null,"Contacter le chef",null,"",null,"Contacter le chef"]
["2021-01-10","",null,"Contacter le chef",null,"",null,"Contacter le chef"]
["2021-01-11","",null,"Contacter le chef",null,"",null,"Contacter le chef",{"$nulls":4},"O"]
["2021-01-12","",null,"Contacter le chef",null,"",null,"Contacter le chef"]
["2021-01-13","",null,"Contacter le chef",null,"",null,"Contacter le chef"]
["2021-01-14","",null,"Contacter le chef",null,"",null,"Contacter le chef"]
["2021-01-15","",null,"Contacter le chef",null,"",null,"Contacter le chef"]
["2021-01-16","",null,"Contacter le chef",null,"",null,"Contacter le chef"]
["2021-01-17","",null,"Contacter le chef",null,"",null,"Contacter le chef"]
["2021-01-18","",null,"Contacter le chef",null,"",null,"Contacter le chef"]
["2021-01-19","",null,"Contacter le chef",null,"",null,"Contacter le chef"]
["2021-01-20","",null,"Contacter le chef",null,"",null,"Contacter le chef"]
["2021-01-21","",null,"Contacter le chef",null,"",null,"Contacter le chef"]
["2021-01-22","",null,"Contacter le chef",null,"",null,"Contacter le chef"]
["2021-01-23","",null,"Contacter le chef",null,"",null,"Contacter le chef"]
["2021-01-24","",null,"Contacter le chef",null,"",null,"Contacter le chef"]
[{"$f":"A36+1","v":"2021-01-25"},"",null,"Contacter le chef",null,"",null,"Contacter le chef"]
[{"$f":"A37+1","v":"2021-01-26"},"",null,"Contacter le chef",null,"",null,"Contacter le chef"]
["2021-01-27","",null,"Contacter le chef",null,"",null,"Contacter le chef"]
["2021-01-28","",null,"Contacter le chef",null,"",null,"Contacter le chef"]
["2021-01-29","",null,"Contacter le chef",null,"",null,"Contacter le chef"]
["2021-01-30","",null,"Contacter le chef",null,"",null,"Contacter le chef"]
[{"$f":"A42+1","v":"2021-01-31"},"",null,"Contacter le chef",null,"",null,"Contacter le chef"]
[]
[null,"Contrôle"]
[null,"Signature"]
[]
[]
[]
[]
[]
["Relevé des températures"]
[]
[]
[{"$f":"A5","v":"2020-10-01"}]
[{"$nulls":5},"Document de référence :","Directives_Frigos"]
[null,"Fréquence =>",null,null,"le matin et le soir :","Relevé des températures et contrôle des rangements"]
[]
[]
[null,"Congélateur S/Sol",{"$nulls":7},"Mesure"]
["Valeurs \ncibles =>","Minimum  -15° C                                                                                ",null," Maximum -22°C    ",null,"Minimum  -15° C                                                                                  ",null,"Maximum -22°C          ",null,"en cas de température\nNon-conforme","Visa responsable"]
["Date","Heure","T°","Résultat","Visa","Heure","T°","Résultat","Visa"]
["2021-01-01",{"$f":"IF(C63=\"\",\"\",IF(B63<>\"\",B63,NOW()))","v":""},null,{"$f":"IF(C63>15,\"OK\",\"Contacter le chef\")","v":"Contacter le chef"},null,{"$f":"IF(G63=\"\",\"\",IF(F63<>\"\",F63,NOW()))","v":""},null,{"$f":"IF(G63>15,\"OK\",\"Contacter le chef\")","v":"Contacter le chef"}]
[{"$f":"A63+1","v":"2021-01-02"},"",null,{"$f":"IF(C64>15,\"OK\",\"Contacter le chef\")","v":"Contacter le chef"},null,"",null,{"$f":"IF(G64>15,\"OK\",\"Contacter le chef\")","v":"Contacter le chef"}]
[{"$f":"A64+1","v":"2021-01-03"},"",null,"Contacter le chef",null,"",null,"Contacter le chef"]
["2021-01-04","",null,"Contacter le chef",null,"",null,"Contacter le chef"]
["2021-01-05","",null,"Contacter le chef",null,"",null,"Contacter le chef"]
["2021-01-06","",null,"Contacter le chef",null,"",null,"Contacter le chef"]
["2021-01-07","",null,"Contacter le chef",null,"",null,"Contacter le chef"]
["2021-01-08","",null,"Contacter le chef",null,"",null,"Contacter le chef"]
["2021-01-09","",null,"Contacter le chef",null,"",null,"Contacter le chef"]
["2021-01-10","",null,"Contacter le chef",null,"",null,"Contacter le chef"]
["2021-01-11","",null,"Contacter le chef",null,"",null,"Contacter le chef"]
["2021-01-12","",null,"Contacter le chef",null,"",null,"Contacter le chef"]
["2021-01-13","",null,"Contacter le chef",null,"",null,"Contacter le chef"]
["2021-01-14","",null,"Contacter le chef",null,"",null,"Contacter le chef"]
["2021-01-15","",null,"Contacter le chef",null,"",null,"Contacter le chef"]
["2021-01-16","",null,"Contacter le chef",null,"",null,"Contacter le chef"]
["2021-01-17","",null,"Contacter le chef",null,"",null,"Contacter le chef"]
["2021-01-18","",null,"Contacter le chef",null,"",null,"Contacter le chef"]
["2021-01-19","",null,"Contacter le chef",null,"",null,"Contacter le chef"]
["2021-01-20","",null,"Contacter le chef",null,"",null,"Contacter le chef"]
["2021-01-21","",null,"Contacter le chef",null,"",null,"Contacter le chef"]
["2021-01-22","",null,"Contacter le chef",null,"",null,"Contacter le chef"]
["2021-01-23","",null,"Contacter le chef",null,"",null,"Contacter le chef"]
["2021-01-24","",null,"Contacter le chef",null,"",null,"Contacter le chef"]
[{"$f":"A86+1","v":"2021-01-25"},"",null,"Contacter le chef",null,"",null,"Contacter le chef"]
[{"$f":"A87+1","v":"2021-01-26"},"",null,"Contacter le chef",null,"",null,"Contacter le chef"]
["2021-01-27","",null,"Contacter le chef",null,"",null,"Contacter le chef"]
["2021-01-28","",null,"Contacter le chef",null,"",null,"Contacter le chef"]
["2021-01-29","",null,"Contacter le chef",null,"",null,"Contacter le chef"]
["2021-01-30","",null,"Contacter le chef",null,"",null,"Contacter le chef"]
[{"$f":"A92+1","v":"2021-01-31"},"",null,"Contacter le chef",null,"",null,"Contacter le chef"]
[]
["Relevé des températures"]
[]
[]
[{"$f":"A5","v":"2020-10-01"}]
[{"$nulls":5},"Document de référence :","Directives_Frigos"]
[null,"Fréquence =>",null,null,"le matin et le soir :","Relevé des températures et contrôle des rangements"]
[]
[]
[null,"Frigo cuisine",{"$nulls":7},"Mesure"]
["Valeurs \ncibles =>","Minimum  7° C                                                                                ",null," Maximum 3°C    ",null,"Minimum  7° C                                                                                ",null," Maximum 3°C    ",null,"en cas de température\nNon-conforme","Visa responsable"]
["Date","Heure","T°","Résultat","Visa","Heure","T°","Résultat","Visa"]
["2021-01-01",{"$f":"IF(C106=\"\",\"\",IF(B106<>\"\",B106,NOW()))","v":""},null,{"$f":"IF(C106<8,\"OK\",\"Contacter le chef\")","v":"OK"},null,{"$f":"IF(G106=\"\",\"\",IF(F106<>\"\",F106,NOW()))","v":""},null,{"$f":"IF(G106<8,\"OK\",\"Contacter le chef\")","v":"OK"}]
[{"$f":"A106+1","v":"2021-01-02"},"",null,"OK",null,"",null,"OK"]
[{"$f":"A107+1","v":"2021-01-03"},"",null,"OK",null,"",null,"OK"]
["2021-01-04","",null,"OK",null,"",null,"OK"]
["2021-01-05","",null,"OK",null,"",null,"OK"]
["2021-01-06","",null,"OK",null,"",null,"OK"]
["2021-01-07","",null,"OK",null,"",null,"OK"]
["2021-01-08","",null,"OK",null,"",null,"OK"]
["2021-01-09","",null,"OK",null,"",null,"OK"]
["2021-01-10","",null,"OK",null,"",null,"OK"]
["2021-01-11","",null,"OK",null,"",null,"OK"]
["2021-01-12","",null,"OK",null,"",null,"OK"]
["2021-01-13","",null,"OK",null,"",null,"OK"]
["2021-01-14","",null,"OK",null,"",null,"OK"]
["2021-01-15","",null,"OK",null,"",null,"OK"]
["2021-01-16","",null,"OK",null,"",null,"OK"]
["2021-01-17","",null,"OK",null,"",null,"OK"]
["2021-01-18","",null,"OK",null,"",null,"OK"]
["2021-01-19","",null,"OK",null,"",null,"OK"]
["2021-01-20","",null,"OK",null,"",null,"OK"]
["2021-01-21","",null,"OK",null,"",null,"OK"]
["2021-01-22","",null,"OK",null,"",null,"OK"]
["2021-01-23","",null,"OK",null,"",null,"OK"]
["2021-01-24","",null,"OK",null,"",null,"OK"]
[{"$f":"A129+1","v":"2021-01-25"},"",null,"OK",null,"",null,"OK"]
[{"$f":"A130+1","v":"2021-01-26"},"",null,"OK",null,"",null,"OK"]
["2021-01-27","",null,"OK",null,"",null,"OK"]
["2021-01-28","",null,"OK",null,"",null,"OK"]
["2021-01-29","",null,"OK",null,"",null,"OK"]
["2021-01-30","",null,"OK",null,"",null,"OK"]
[{"$f":"A135+1","v":"2021-01-31"},"",null,"OK",null,"",null,"OK"]
[]
[]
["Relevé des températures"]
[]
[]
[{"$f":"A98","v":"2020-10-01"}]
[{"$nulls":5},"Document de référence :","Directives_Frigos"]
[null,"Fréquence =>",null,null,"le matin et le soir :","Relevé des températures et contrôle des rangements"]
[]
[]
[null,"Frigo MEP",{"$nulls":7},"Mesure"]
["Valeurs \ncibles =>","Minimum  7° C                                                                                ",null," Maximum 3°C    ",null,"Minimum  7° C                                                                                ",null," Maximum 3°C    ",null,"en cas de température\nNon-conforme","Visa responsable"]
["Date","Heure","T°","Résultat","Visa","Heure","T°","Résultat","Visa"]
["2021-01-01",{"$f":"IF(C150=\"\",\"\",IF(B150<>\"\",B150,NOW()))","v":""},null,{"$f":"IF(C150<8,\"OK\",\"Contacter le chef\")","v":"OK"},null,{"$f":"IF(G150=\"\",\"\",IF(F150<>\"\",F150,NOW()))","v":""},null,{"$f":"IF(G150<8,\"OK\",\"Contacter le chef\")","v":"OK"}]
[{"$f":"A150+1","v":"2021-01-02"},"",null,"OK",null,"",null,"OK"]
[{"$f":"A151+1","v":"2021-01-03"},"",null,"OK",null,"",null,"OK"]
["2021-01-04","",null,"OK",null,"",null,"OK"]
["2021-01-05","",null,"OK",null,"",null,"OK"]
["2021-01-06","",null,"OK",null,"",null,"OK"]
["2021-01-07","",null,"OK",null,"",null,"OK"]
["2021-01-08","",null,"OK",null,"",null,"OK"]
["2021-01-09","",null,"OK",null,"",null,"OK"]
["2021-01-10","",null,"OK",null,"",null,"OK"]
["2021-01-11","",null,"OK",null,"",null,"OK"]
["2021-01-12","",null,"OK",null,"",null,"OK"]
["2021-01-13","",null,"OK",null,"",null,"OK"]
["2021-01-14","",null,"OK",null,"",null,"OK"]
["2021-01-15","",null,"OK",null,"",null,"OK"]
["2021-01-16","",null,"OK",null,"",null,"OK"]
["2021-01-17","",null,"OK",null,"",null,"OK"]
["2021-01-18","",null,"OK",null,"",null,"OK"]
["2021-01-19","",null,"OK",null,"",null,"OK"]
["2021-01-20","",null,"OK",null,"",null,"OK"]
["2021-01-21","",null,"OK",null,"",null,"OK"]
["2021-01-22","",null,"OK",null,"",null,"OK"]
["2021-01-23","",null,"OK",null,"",null,"OK"]
["2021-01-24","",null,"OK",null,"",null,"OK"]
[{"$f":"A173+1","v":"2021-01-25"},"",null,"OK",null,"",null,"OK"]
[{"$f":"A174+1","v":"2021-01-26"},"",null,"OK",null,"",null,"OK"]
["2021-01-27","",null,"OK",null,"",null,"OK"]
["2021-01-28","",null,"OK",null,"",null,"OK"]
["2021-01-29","",null,"OK",null,"",null,"OK"]
["2021-01-30","",null,"OK",null,"",null,"OK"]
[{"$f":"A179+1","v":"2021-01-31"},"",null,"OK",null,"",null,"OK"]
[]
["Relevé des températures"]
[]
[]
[{"$f":"A142","v":"2020-10-01"}]
[{"$nulls":5},"Document de référence :","Directives_Frigos"]
[null,"Fréquence =>",null,null,"le matin et le soir :","Relevé des températures et contrôle des rangements"]
[]
[]
[null,"Frigo pâtisserie",{"$nulls":7},"Mesure"]
["Valeurs \ncibles =>","Minimum  7° C                                                                                ",null," Maximum 3°C    ",null,"Minimum  7° C                                                                                ",null," Maximum 3°C    ",null,"en cas de température\nNon-conforme","Visa responsable"]
["Date","Heure","T°","Résultat","Visa","Heure","T°","Résultat","Visa"]
["2021-01-01",{"$f":"IF(C193=\"\",\"\",IF(B193<>\"\",B193,NOW()))","v":""},null,{"$f":"IF(C193<8,\"OK\",\"Contacter le chef\")","v":"OK"},null,{"$f":"IF(G193=\"\",\"\",IF(F193<>\"\",F193,NOW()))","v":""},null,{"$f":"IF(G193<8,\"OK\",\"Contacter le chef\")","v":"OK"}]
[{"$f":"A193+1","v":"2021-01-02"},"",null,"OK",null,"",null,"OK"]
[{"$f":"A194+1","v":"2021-01-03"},"",null,"OK",null,"",null,"OK"]
["2021-01-04","",null,"OK",null,"",null,"OK"]
["2021-01-05","",null,"OK",null,"",null,"OK"]
["2021-01-06","",null,"OK",null,"",null,"OK"]
["2021-01-07","",null,"OK",null,"",null,"OK"]
["2021-01-08","",null,"OK",null,"",null,"OK"]
["2021-01-09","",null,"OK",null,"",null,"OK"]
["2021-01-10","",null,"OK",null,"",null,"OK"]
["2021-01-11","",null,"OK",null,"",null,"OK"]
["2021-01-12","",null,"OK",null,"",null,"OK"]
["2021-01-13","",null,"OK",null,"",null,"OK"]
["2021-01-14","",null,"OK",null,"",null,"OK"]
["2021-01-15","",null,"OK",null,"",null,"OK"]
["2021-01-16","",null,"OK",null,"",null,"OK"]
["2021-01-17","",null,"OK",null,"",null,"OK"]
["2021-01-18","",null,"OK",null,"",null,"OK"]
["2021-01-19","",null,"OK",null,"",null,"OK"]
["2021-01-20","",null,"OK",null,"",null,"OK"]
["2021-01-21","",null,"OK",null,"",null,"OK"]
["2021-01-22","",null,"OK",null,"",null,"OK"]
["2021-01-23","",null,"OK",null,"",null,"OK"]
["2021-01-24","",null,"OK",null,"",null,"OK"]
[{"$f":"A216+1","v":"2021-01-25"},"",null,"OK",null,"",null,"OK"]
[{"$f":"A217+1","v":"2021-01-26"},"",null,"OK",null,"",null,"OK"]
["2021-01-27","",null,"OK",null,"",null,"OK"]
["2021-01-28","",null,"OK",null,"",null,"OK"]
["2021-01-29","",null,"OK",null,"",null,"OK"]
["2021-01-30","",null,"OK",null,"",null,"OK"]
[{"$f":"A222+1","v":"2021-01-31"},"",null,"OK",null,"",null,"OK"]
[]
["Relevé des températures"]
[]
[]
[{"$f":"A185","v":"2020-10-01"}]
[{"$nulls":5},"Document de référence :","Directives_Frigos"]
[null,"Fréquence =>",null,null,"le matin et le soir :","Relevé des températures et contrôle des rangements"]
[]
[]
[null,"Frigo produits laitiers",{"$nulls":7},"Mesure"]
["Valeurs \ncibles =>","Minimum  7° C                                                                                ",null," Maximum 3°C    ",null,"Minimum  7° C                                                                                ",null," Maximum 3°C    ",null,"en cas de température\nNon-conforme","Visa responsable"]
["Date","Heure","T°","Résultat","Visa","Heure","T°","Résultat","Visa"]
["2021-01-01",{"$f":"IF(C236=\"\",\"\",IF(B236<>\"\",B236,NOW()))","v":""},null,{"$f":"IF(C236<8,\"OK\",\"Contacter le chef\")","v":"OK"},null,{"$f":"IF(G236=\"\",\"\",IF(F236<>\"\",F236,NOW()))","v":""},null,{"$f":"IF(G236<8,\"OK\",\"Contacter le chef\")","v":"OK"}]
[{"$f":"A236+1","v":"2021-01-02"},"",null,"OK",null,"",null,"OK"]
[{"$f":"A237+1","v":"2021-01-03"},"",null,"OK",null,"",null,"OK"]
["2021-01-04","",null,"OK",null,"",null,"OK"]
["2021-01-05","",null,"OK",null,"",null,"OK"]
["2021-01-06","",null,"OK",null,"",null,"OK"]
["2021-01-07","",null,"OK",null,"",null,"OK"]
["2021-01-08","",null,"OK",null,"",null,"OK"]
["2021-01-09","",null,"OK",null,"",null,"OK"]
["2021-01-10","",null,"OK",null,"",null,"OK"]
["2021-01-11","",null,"OK",null,"",null,"OK"]
["2021-01-12","",null,"OK",null,"",null,"OK"]
["2021-01-13","",null,"OK",null,"",null,"OK"]
["2021-01-14","",null,"OK",null,"",null,"OK"]
["2021-01-15","",null,"OK",null,"",null,"OK"]
["2021-01-16","",null,"OK",null,"",null,"OK"]
["2021-01-17","",null,"OK",null,"",null,"OK"]
["2021-01-18","",null,"OK",null,"",null,"OK"]
["2021-01-19","",null,"OK",null,"",null,"OK"]
["2021-01-20","",null,"OK",null,"",null,"OK"]
["2021-01-21","",null,"OK",null,"",null,"OK"]
["2021-01-22","",null,"OK",null,"",null,"OK"]
["2021-01-23","",null,"OK",null,"",null,"OK"]
["2021-01-24","",null,"OK",null,"",null,"OK"]
[{"$f":"A259+1","v":"2021-01-25"},"",null,"OK",null,"",null,"OK"]
[{"$f":"A260+1","v":"2021-01-26"},"",null,"OK",null,"",null,"OK"]
["2021-01-27","",null,"OK",null,"",null,"OK"]
["2021-01-28","",null,"OK",null,"",null,"OK"]
["2021-01-29","",null,"OK",null,"",null,"OK"]
["2021-01-30","",null,"OK",null,"",null,"OK"]
[{"$f":"A265+1","v":"2021-01-31"},"",null,"OK",null,"",null,"OK"]
[]
[]
["Relevé des températures"]
[]
[]
[{"$f":"A228","v":"2020-10-01"}]
[{"$nulls":5},"Document de référence :","Directives_Frigos"]
[null,"Fréquence =>",null,null,"le matin et le soir :","Relevé des températures et contrôle des rangements"]
[]
[]
[null,"Frigo S/Sol",{"$nulls":7},"Mesure"]
["Valeurs \ncibles =>","Minimum  7° C                                                                                ",null," Maximum 3°C    ",null,"Minimum  7° C                                                                                ",null," Maximum 3°C    ",null,"en cas de température\nNon-conforme","Visa responsable"]
["Date","Heure","T°","Résultat","Visa","Heure","T°","Résultat","Visa"]
["2021-01-01",{"$f":"IF(C280=\"\",\"\",IF(B280<>\"\",B280,NOW()))","v":""},null,{"$f":"IF(C280<8,\"OK\",\"Contacter le chef\")","v":"OK"},null,{"$f":"IF(G280=\"\",\"\",IF(F280<>\"\",F280,NOW()))","v":""},null,{"$f":"IF(G280<8,\"OK\",\"Contacter le chef\")","v":"OK"}]
[{"$f":"A280+1","v":"2021-01-02"},"",null,{"$f":"IF(C281<8,\"OK\",\"Contacter le chef\")","v":"OK"},null,"",null,"OK"]
[{"$f":"A281+1","v":"2021-01-03"},"",null,"OK",null,"",null,"OK"]
["2021-01-04","",null,"OK",null,"",null,"OK"]
["2021-01-05","",null,"OK",null,"",null,"OK"]
["2021-01-06","",null,"OK",null,"",null,"OK"]
["2021-01-07","",null,"OK",null,"",null,"OK"]
["2021-01-08","",null,"OK",null,"",null,"OK"]
["2021-01-09","",null,"OK",null,"",null,"OK"]
["2021-01-10","",null,"OK",null,"",null,"OK"]
["2021-01-11","",null,"OK",null,"",null,"OK"]
["2021-01-12","",null,"OK",null,"",null,"OK"]
["2021-01-13","",null,"OK",null,"",null,"OK"]
["2021-01-14","",null,"OK",null,"",null,"OK"]
["2021-01-15","",null,"OK",null,"",null,"OK"]
["2021-01-16","",null,"OK",null,"",null,"OK"]
["2021-01-17","",null,"OK",null,"",null,"OK"]
["2021-01-18","",null,"OK",null,"",null,"OK"]
["2021-01-19","",null,"OK",null,"",null,"OK"]
["2021-01-20","",null,"OK",null,"",null,"OK"]
["2021-01-21","",null,"OK",null,"",null,"OK"]
["2021-01-22","",null,"OK",null,"",null,"OK"]
["2021-01-23","",null,"OK",null,"",null,"OK"]
["2021-01-24","",null,"OK",null,"",null,"OK"]
[{"$f":"A303+1","v":"2021-01-25"},"",null,"OK",null,"",null,"OK"]
[{"$f":"A304+1","v":"2021-01-26"},"",null,"OK",null,"",null,"OK"]
["2021-01-27","",null,"OK",null,"",null,"OK"]
["2021-01-28","",null,"OK",null,"",null,"OK"]
["2021-01-29","",null,"OK",null,"",null,"OK"]
["2021-01-30","",null,"OK",null,"",null,"OK"]
[{"$f":"A309+1","v":"2021-01-31"},"",null,"OK",null,"",null,"OK"]

{"sheet":"Novembre","index":10,"n_rows":310,"n_cols":13,"rows_kept":310,"merged":[[0,0,0,9],[1,0,1,9],[4,0,4,9],[9,1,9,8],[50,0,50,9],[51,0,51,9],[54,0,54,9],[59,1,59,8],[93,0,93,9],[94,0,94,9],[97,0,97,9],[102,1,102,8],[103,1,103,2],[103,5,103,6],[137,0,137,9],[138,0,138,9],[141,0,141,10],[146,1,146,8],[147,1,147,2],[147,5,147,6],[180,0,180,9],[181,0,181,9],[184,0,184,9],[189,1,189,8],[190,1,190,2],[190,5,190,6],[223,0,223,9],[224,0,224,9],[227,0,227,9],[232,1,232,8],[233,1,233,2],[233,5,233,6],[267,0,267,9],[268,0,268,9],[271,0,271,9],[276,1,276,8],[277,1,277,2],[277,5,277,6]]}
[]
["Relevé des températures"]
[]
[]
["2020-11-01"]
[{"$nulls":5},"Document de référence :","Directives_Frigos"]
[null,"Fréquence =>",null,null,"le matin et le soir :","Relevé des températures "]
[]
[]
[null,"Congélateur cuisine",{"$nulls":7},"Mesure"]
["Valeurs \ncibles =>","Minimum  -15° C                                                                                ",null," Maximum -22°C    ",null,"Minimum  -15° C                                                                                  ",null,"Maximum -22°C          ",null,"en cas de température\nNon-conforme","Visa responsable"]
["Date","Heure","T°","Résultat","Visa","Heure","T°","Résultat","Visa"]
["2021-01-01",{"$f":"IF(C13=\"\",\"\",IF(B13<>\"\",B13,NOW()))","v":""},null,{"$f":"IF(C13>15,\"OK\",\"Contacter le chef\")","v":"Contacter le chef"},null,{"$f":"IF(G13=\"\",\"\",IF(F13<>\"\",F13,NOW()))","v":""},null,{"$f":"IF(G13>15,\"OK\",\"Contacter le chef\")","v":"Contacter le chef"}]
[{"$f":"A13+1","v":"2021-01-02"},"",null,{"$f":"IF(C14>15,\"OK\",\"Contacter le chef\")","v":"Contacter le chef"},null,"",null,{"$f":"IF(G14>15,\"OK\",\"Contacter le chef\")","v":"Contacter le chef"}]
[{"$f":"A14+1","v":"2021-01-03"},"",null,"Contacter le chef",null,"",null,"Contacter le chef"]
["2021-01-04","",null,"Contacter le chef",null,"",null,"Contacter le chef"]
["2021-01-05","",null,"Contacter le chef",null,"",null,"Contacter le chef"]
["2021-01-06","",null,"Contacter le chef",null,"",null,"Contacter le chef"]
["2021-01-07","",null,"Contacter le chef",null,"",null,"Contacter le chef"]
["2021-01-08","",null,"Contacter le chef",null,"",null,"Contacter le chef"]
["2021-01-09","",null,"Contacter le chef",null,"",null,"Contacter le chef"]
["2021-01-10","",null,"Contacter le chef",null,"",null,"Contacter le chef"]
["2021-01-11","",null,"Contacter le chef",null,"",null,"Contacter le chef",{"$nulls":4},"O"]
["2021-01-12","",null,"Contacter le chef",null,"",null,"Contacter le chef"]
["2021-01-13","",null,"Contacter le chef",null,"",null,"Contacter le chef"]
["2021-01-14","",null,"Contacter le chef",null,"",null,"Contacter le chef"]
["2021-01-15","",null,"Contacter le chef",null,"",null,"Contacter le chef"]
["2021-01-16","",null,"Contacter le chef",null,"",null,"Contacter le chef"]
["2021-01-17","",null,"Contacter le chef",null,"",null,"Contacter le chef"]
["2021-01-18","",null,"Contacter le chef",null,"",null,"Contacter le chef"]
["2021-01-19","",null,"Contacter le chef",null,"",null,"Contacter le chef"]
["2021-01-20","",null,"Contacter le chef",null,"",null,"Contacter le chef"]
["2021-01-21","",null,"Contacter le chef",null,"",null,"Contacter le chef"]
["2021-01-22","",null,"Contacter le chef",null,"",null,"Contacter le chef"]
["2021-01-23","",null,"Contacter le chef",null,"",null,"Contacter le chef"]
["2021-01-24","",null,"Contacter le chef",null,"",null,"Contacter le chef"]
[{"$f":"A36+1","v":"2021-01-25"},"",null,"Contacter le chef",null,"",null,"Contacter le chef"]
[{"$f":"A37+1","v":"2021-01-26"},"",null,"Contacter le chef",null,"",null,"Contacter le chef"]
["2021-01-27","",null,"Contacter le chef",null,"",null,"Contacter le chef"]
["2021-01-28","",null,"Contacter le chef",null,"",null,"Contacter le chef"]
["2021-01-29","",null,"Contacter le chef",null,"",null,"Contacter le chef"]
["2021-01-30","",null,"Contacter le chef",null,"",null,"Contacter le chef"]
[{"$f":"A42+1","v":"2021-01-31"},"",null,"Contacter le chef",null,"",null,"Contacter le chef"]
[]
[null,"Contrôle"]
[null,"Signature"]
[]
[]
[]
[]
[]
["Relevé des températures"]
[]
[]
[{"$f":"A5","v":"2020-11-01"}]
[{"$nulls":5},"Document de référence :","Directives_Frigos"]
[null,"Fréquence =>",null,null,"le matin et le soir :","Relevé des températures et contrôle des rangements"]
[]
[]
[null,"Congélateur S/Sol",{"$nulls":7},"Mesure"]
["Valeurs \ncibles =>","Minimum  -15° C                                                                                ",null," Maximum -22°C    ",null,"Minimum  -15° C                                                                                  ",null,"Maximum -22°C          ",null,"en cas de température\nNon-conforme","Visa responsable"]
["Date","Heure","T°","Résultat","Visa","Heure","T°","Résultat","Visa"]
["2021-01-01",{"$f":"IF(C63=\"\",\"\",IF(B63<>\"\",B63,NOW()))","v":""},null,{"$f":"IF(C63>15,\"OK\",\"Contacter le chef\")","v":"Contacter le chef"},null,{"$f":"IF(G63=\"\",\"\",IF(F63<>\"\",F63,NOW()))","v":""},null,{"$f":"IF(G63>15,\"OK\",\"Contacter le chef\")","v":"Contacter le chef"}]
[{"$f":"A63+1","v":"2021-01-02"},"",null,{"$f":"IF(C64>15,\"OK\",\"Contacter le chef\")","v":"Contacter le chef"},null,"",null,{"$f":"IF(G64>15,\"OK\",\"Contacter le chef\")","v":"Contacter le chef"}]
[{"$f":"A64+1","v":"2021-01-03"},"",null,"Contacter le chef",null,"",null,"Contacter le chef"]
["2021-01-04","",null,"Contacter le chef",null,"",null,"Contacter le chef"]
["2021-01-05","",null,"Contacter le chef",null,"",null,"Contacter le chef"]
["2021-01-06","",null,"Contacter le chef",null,"",null,"Contacter le chef"]
["2021-01-07","",null,"Contacter le chef",null,"",null,"Contacter le chef"]
["2021-01-08","",null,"Contacter le chef",null,"",null,"Contacter le chef"]
["2021-01-09","",null,"Contacter le chef",null,"",null,"Contacter le chef"]
["2021-01-10","",null,"Contacter le chef",null,"",null,"Contacter le chef"]
["2021-01-11","",null,"Contacter le chef",null,"",null,"Contacter le chef"]
["2021-01-12","",null,"Contacter le chef",null,"",null,"Contacter le chef"]
["2021-01-13","",null,"Contacter le chef",null,"",null,"Contacter le chef"]
["2021-01-14","",null,"Contacter le chef",null,"",null,"Contacter le chef"]
["2021-01-15","",null,"Contacter le chef",null,"",null,"Contacter le chef"]
["2021-01-16","",null,"Contacter le chef",null,"",null,"Contacter le chef"]
["2021-01-17","",null,"Contacter le chef",null,"",null,"Contacter le chef"]
["2021-01-18","",null,"Contacter le chef",null,"",null,"Contacter le chef"]
["2021-01-19","",null,"Contacter le chef",null,"",null,"Contacter le chef"]
["2021-01-20","",null,"Contacter le chef",null,"",null,"Contacter le chef"]
["2021-01-21","",null,"Contacter le chef",null,"",null,"Contacter le chef"]
["2021-01-22","",null,"Contacter le chef",null,"",null,"Contacter le chef"]
["2021-01-23","",null,"Contacter le chef",null,"",null,"Contacter le chef"]
["2021-01-24","",null,"Contacter le chef",null,"",null,"Contacter le chef"]
[{"$f":"A86+1","v":"2021-01-25"},"",null,"Contacter le chef",null,"",null,"Contacter le chef"]
[{"$f":"A87+1","v":"2021-01-26"},"",null,"Contacter le chef",null,"",null,"Contacter le chef"]
["2021-01-27","",null,"Contacter le chef",null,"",null,"Contacter le chef"]
["2021-01-28","",null,"Contacter le chef",null,"",null,"Contacter le chef"]
["2021-01-29","",null,"Contacter le chef",null,"",null,"Contacter le chef"]
["2021-01-30","",null,"Contacter le chef",null,"",null,"Contacter le chef"]
[{"$f":"A92+1","v":"2021-01-31"},"",null,"Contacter le chef",null,"",null,"Contacter le chef"]
[]
["Relevé des températures"]
[]
[]
[{"$f":"A5","v":"2020-11-01"}]
[{"$nulls":5},"Document de référence :","Directives_Frigos"]
[null,"Fréquence =>",null,null,"le matin et le soir :","Relevé des températures et contrôle des rangements"]
[]
[]
[null,"Frigo cuisine",{"$nulls":7},"Mesure"]
["Valeurs \ncibles =>","Minimum  7° C                                                                                ",null," Maximum 3°C    ",null,"Minimum  7° C                                                                                ",null," Maximum 3°C    ",null,"en cas de température\nNon-conforme","Visa responsable"]
["Date","Heure","T°","Résultat","Visa","Heure","T°","Résultat","Visa"]
["2021-01-01",{"$f":"IF(C106=\"\",\"\",IF(B106<>\"\",B106,NOW()))","v":""},null,{"$f":"IF(C106<8,\"OK\",\"Contacter le chef\")","v":"OK"},null,{"$f":"IF(G106=\"\",\"\",IF(F106<>\"\",F106,NOW()))","v":""},null,{"$f":"IF(G106<8,\"OK\",\"Contacter le chef\")","v":"OK"}]
[{"$f":"A106+1","v":"2021-01-02"},"",null,"OK",null,"",null,"OK"]
[{"$f":"A107+1","v":"2021-01-03"},"",null,"OK",null,"",null,"OK"]
["2021-01-04","",null,"OK",null,"",null,"OK"]
["2021-01-05","",null,"OK",null,"",null,"OK"]
["2021-01-06","",null,"OK",null,"",null,"OK"]
["2021-01-07","",null,"OK",null,"",null,"OK"]
["2021-01-08","",null,"OK",null,"",null,"OK"]
["2021-01-09","",null,"OK",null,"",null,"OK"]
["2021-01-10","",null,"OK",null,"",null,"OK"]
["2021-01-11","",null,"OK",null,"",null,"OK"]
["2021-01-12","",null,"OK",null,"",null,"OK"]
["2021-01-13","",null,"OK",null,"",null,"OK"]
["2021-01-14","",null,"OK",null,"",null,"OK"]
["2021-01-15","",null,"OK",null,"",null,"OK"]
["2021-01-16","",null,"OK",null,"",null,"OK"]
["2021-01-17","",null,"OK",null,"",null,"OK"]
["2021-01-18","",null,"OK",null,"",null,"OK"]
["2021-01-19","",null,"OK",null,"",null,"OK"]
["2021-01-20","",null,"OK",null,"",null,"OK"]
["2021-01-21","",null,"OK",null,"",null,"OK"]
["2021-01-22","",null,"OK",null,"",null,"OK"]
["2021-01-23","",null,"OK",null,"",null,"OK"]
["2021-01-24","",null,"OK",null,"",null,"OK"]
[{"$f":"A129+1","v":"2021-01-25"},"",null,"OK",null,"",null,"OK"]
[{"$f":"A130+1","v":"2021-01-26"},"",null,"OK",null,"",null,"OK"]
["2021-01-27","",null,"OK",null,"",null,"OK"]
["2021-01-28","",null,"OK",null,"",null,"OK"]
["2021-01-29","",null,"OK",null,"",null,"OK"]
["2021-01-30","",null,"OK",null,"",null,"OK"]
[{"$f":"A135+1","v":"2021-01-31"},"",null,"OK",null,"",null,"OK"]
[]
[]
["Relevé des températures"]
[]
[]
[{"$f":"A98","v":"2020-11-01"}]
[{"$nulls":5},"Document de référence :","Directives_Frigos"]
[null,"Fréquence =>",null,null,"le matin et le soir :","Relevé des températures et contrôle des rangements"]
[]
[]
[null,"Frigo MEP",{"$nulls":7},"Mesure"]
["Valeurs \ncibles =>","Minimum  7° C                                                                                ",null," Maximum 3°C    ",null,"Minimum  7° C                                                                                ",null," Maximum 3°C    ",null,"en cas de température\nNon-conforme","Visa responsable"]
["Date","Heure","T°","Résultat","Visa","Heure","T°","Résultat","Visa"]
["2021-01-01",{"$f":"IF(C150=\"\",\"\",IF(B150<>\"\",B150,NOW()))","v":""},null,{"$f":"IF(C150<8,\"OK\",\"Contacter le chef\")","v":"OK"},null,{"$f":"IF(G150=\"\",\"\",IF(F150<>\"\",F150,NOW()))","v":""},null,{"$f":"IF(G150<8,\"OK\",\"Contacter le chef\")","v":"OK"}]
[{"$f":"A150+1","v":"2021-01-02"},"",null,"OK",null,"",null,"OK"]
[{"$f":"A151+1","v":"2021-01-03"},"",null,"OK",null,"",null,"OK"]
["2021-01-04","",null,"OK",null,"",null,"OK"]
["2021-01-05","",null,"OK",null,"",null,"OK"]
["2021-01-06","",null,"OK",null,"",null,"OK"]
["2021-01-07","",null,"OK",null,"",null,"OK"]
["2021-01-08","",null,"OK",null,"",null,"OK"]
["2021-01-09","",null,"OK",null,"",null,"OK"]
["2021-01-10","",null,"OK",null,"",null,"OK"]
["2021-01-11","",null,"OK",null,"",null,"OK"]
["2021-01-12","",null,"OK",null,"",null,"OK"]
["2021-01-13","",null,"OK",null,"",null,"OK"]
["2021-01-14","",null,"OK",null,"",null,"OK"]
["2021-01-15","",null,"OK",null,"",null,"OK"]
["2021-01-16","",null,"OK",null,"",null,"OK"]
["2021-01-17","",null,"OK",null,"",null,"OK"]
["2021-01-18","",null,"OK",null,"",null,"OK"]
["2021-01-19","",null,"OK",null,"",null,"OK"]
["2021-01-20","",null,"OK",null,"",null,"OK"]
["2021-01-21","",null,"OK",null,"",null,"OK"]
["2021-01-22","",null,"OK",null,"",null,"OK"]
["2021-01-23","",null,"OK",null,"",null,"OK"]
["2021-01-24","",null,"OK",null,"",null,"OK"]
[{"$f":"A173+1","v":"2021-01-25"},"",null,"OK",null,"",null,"OK"]
[{"$f":"A174+1","v":"2021-01-26"},"",null,"OK",null,"",null,"OK"]
["2021-01-27","",null,"OK",null,"",null,"OK"]
["2021-01-28","",null,"OK",null,"",null,"OK"]
["2021-01-29","",null,"OK",null,"",null,"OK"]
["2021-01-30","",null,"OK",null,"",null,"OK"]
[{"$f":"A179+1","v":"2021-01-31"},"",null,"OK",null,"",null,"OK"]
[]
["Relevé des températures"]
[]
[]
[{"$f":"A142","v":"2020-11-01"}]
[{"$nulls":5},"Document de référence :","Directives_Frigos"]
[null,"Fréquence =>",null,null,"le matin et le soir :","Relevé des températures et contrôle des rangements"]
[]
[]
[null,"Frigo pâtisserie",{"$nulls":7},"Mesure"]
["Valeurs \ncibles =>","Minimum  7° C                                                                                ",null," Maximum 3°C    ",null,"Minimum  7° C                                                                                ",null," Maximum 3°C    ",null,"en cas de température\nNon-conforme","Visa responsable"]
["Date","Heure","T°","Résultat","Visa","Heure","T°","Résultat","Visa"]
["2021-01-01",{"$f":"IF(C193=\"\",\"\",IF(B193<>\"\",B193,NOW()))","v":""},null,{"$f":"IF(C193<8,\"OK\",\"Contacter le chef\")","v":"OK"},null,{"$f":"IF(G193=\"\",\"\",IF(F193<>\"\",F193,NOW()))","v":""},null,{"$f":"IF(G193<8,\"OK\",\"Contacter le chef\")","v":"OK"}]
[{"$f":"A193+1","v":"2021-01-02"},"",null,"OK",null,"",null,"OK"]
[{"$f":"A194+1","v":"2021-01-03"},"",null,"OK",null,"",null,"OK"]
["2021-01-04","",null,"OK",null,"",null,"OK"]
["2021-01-05","",null,"OK",null,"",null,"OK"]
["2021-01-06","",null,"OK",null,"",null,"OK"]
["2021-01-07","",null,"OK",null,"",null,"OK"]
["2021-01-08","",null,"OK",null,"",null,"OK"]
["2021-01-09","",null,"OK",null,"",null,"OK"]
["2021-01-10","",null,"OK",null,"",null,"OK"]
["2021-01-11","",null,"OK",null,"",null,"OK"]
["2021-01-12","",null,"OK",null,"",null,"OK"]
["2021-01-13","",null,"OK",null,"",null,"OK"]
["2021-01-14","",null,"OK",null,"",null,"OK"]
["2021-01-15","",null,"OK",null,"",null,"OK"]
["2021-01-16","",null,"OK",null,"",null,"OK"]
["2021-01-17","",null,"OK",null,"",null,"OK"]
["2021-01-18","",null,"OK",null,"",null,"OK"]
["2021-01-19","",null,"OK",null,"",null,"OK"]
["2021-01-20","",null,"OK",null,"",null,"OK"]
["2021-01-21","",null,"OK",null,"",null,"OK"]
["2021-01-22","",null,"OK",null,"",null,"OK"]
["2021-01-23","",null,"OK",null,"",null,"OK"]
["2021-01-24","",null,"OK",null,"",null,"OK"]
[{"$f":"A216+1","v":"2021-01-25"},"",null,"OK",null,"",null,"OK"]
[{"$f":"A217+1","v":"2021-01-26"},"",null,"OK",null,"",null,"OK"]
["2021-01-27","",null,"OK",null,"",null,"OK"]
["2021-01-28","",null,"OK",null,"",null,"OK"]
["2021-01-29","",null,"OK",null,"",null,"OK"]
["2021-01-30","",null,"OK",null,"",null,"OK"]
[{"$f":"A222+1","v":"2021-01-31"},"",null,"OK",null,"",null,"OK"]
[]
["Relevé des températures"]
[]
[]
[{"$f":"A185","v":"2020-11-01"}]
[{"$nulls":5},"Document de référence :","Directives_Frigos"]
[null,"Fréquence =>",null,null,"le matin et le soir :","Relevé des températures et contrôle des rangements"]
[]
[]
[null,"Frigo produits laitiers",{"$nulls":7},"Mesure"]
["Valeurs \ncibles =>","Minimum  7° C                                                                                ",null," Maximum 3°C    ",null,"Minimum  7° C                                                                                ",null," Maximum 3°C    ",null,"en cas de température\nNon-conforme","Visa responsable"]
["Date","Heure","T°","Résultat","Visa","Heure","T°","Résultat","Visa"]
["2021-01-01",{"$f":"IF(C236=\"\",\"\",IF(B236<>\"\",B236,NOW()))","v":""},null,{"$f":"IF(C236<8,\"OK\",\"Contacter le chef\")","v":"OK"},null,{"$f":"IF(G236=\"\",\"\",IF(F236<>\"\",F236,NOW()))","v":""},null,{"$f":"IF(G236<8,\"OK\",\"Contacter le chef\")","v":"OK"}]
[{"$f":"A236+1","v":"2021-01-02"},"",null,"OK",null,"",null,"OK"]
[{"$f":"A237+1","v":"2021-01-03"},"",null,"OK",null,"",null,"OK"]
["2021-01-04","",null,"OK",null,"",null,"OK"]
["2021-01-05","",null,"OK",null,"",null,"OK"]
["2021-01-06","",null,"OK",null,"",null,"OK"]
["2021-01-07","",null,"OK",null,"",null,"OK"]
["2021-01-08","",null,"OK",null,"",null,"OK"]
["2021-01-09","",null,"OK",null,"",null,"OK"]
["2021-01-10","",null,"OK",null,"",null,"OK"]
["2021-01-11","",null,"OK",null,"",null,"OK"]
["2021-01-12","",null,"OK",null,"",null,"OK"]
["2021-01-13","",null,"OK",null,"",null,"OK"]
["2021-01-14","",null,"OK",null,"",null,"OK"]
["2021-01-15","",null,"OK",null,"",null,"OK"]
["2021-01-16","",null,"OK",null,"",null,"OK"]
["2021-01-17","",null,"OK",null,"",null,"OK"]
["2021-01-18","",null,"OK",null,"",null,"OK"]
["2021-01-19","",null,"OK",null,"",null,"OK"]
["2021-01-20","",null,"OK",null,"",null,"OK"]
["2021-01-21","",null,"OK",null,"",null,"OK"]
["2021-01-22","",null,"OK",null,"",null,"OK"]
["2021-01-23","",null,"OK",null,"",null,"OK"]
["2021-01-24","",null,"OK",null,"",null,"OK"]
[{"$f":"A259+1","v":"2021-01-25"},"",null,"OK",null,"",null,"OK"]
[{"$f":"A260+1","v":"2021-01-26"},"",null,"OK",null,"",null,"OK"]
["2021-01-27","",null,"OK",null,"",null,"OK"]
["2021-01-28","",null,"OK",null,"",null,"OK"]
["2021-01-29","",null,"OK",null,"",null,"OK"]
["2021-01-30","",null,"OK",null,"",null,"OK"]
[{"$f":"A265+1","v":"2021-01-31"},"",null,"OK",null,"",null,"OK"]
[]
[]
["Relevé des températures"]
[]
[]
[{"$f":"A228","v":"2020-11-01"}]
[{"$nulls":5},"Document de référence :","Directives_Frigos"]
[null,"Fréquence =>",null,null,"le matin et le soir :","Relevé des températures et contrôle des rangements"]
[]
[]
[null,"Frigo S/Sol",{"$nulls":7},"Mesure"]
["Valeurs \ncibles =>","Minimum  7° C                                                                                ",null," Maximum 3°C    ",null,"Minimum  7° C                                                                                ",null," Maximum 3°C    ",null,"en cas de température\nNon-conforme","Visa responsable"]
["Date","Heure","T°","Résultat","Visa","Heure","T°","Résultat","Visa"]
["2021-01-01",{"$f":"IF(C280=\"\",\"\",IF(B280<>\"\",B280,NOW()))","v":""},null,{"$f":"IF(C280<8,\"OK\",\"Contacter le chef\")","v":"OK"},null,{"$f":"IF(G280=\"\",\"\",IF(F280<>\"\",F280,NOW()))","v":""},null,{"$f":"IF(G280<8,\"OK\",\"Contacter le chef\")","v":"OK"}]
[{"$f":"A280+1","v":"2021-01-02"},"",null,{"$f":"IF(C281<8,\"OK\",\"Contacter le chef\")","v":"OK"},null,"",null,"OK"]
[{"$f":"A281+1","v":"2021-01-03"},"",null,"OK",null,"",null,"OK"]
["2021-01-04","",null,"OK",null,"",null,"OK"]
["2021-01-05","",null,"OK",null,"",null,"OK"]
["2021-01-06","",null,"OK",null,"",null,"OK"]
["2021-01-07","",null,"OK",null,"",null,"OK"]
["2021-01-08","",null,"OK",null,"",null,"OK"]
["2021-01-09","",null,"OK",null,"",null,"OK"]
["2021-01-10","",null,"OK",null,"",null,"OK"]
["2021-01-11","",null,"OK",null,"",null,"OK"]
["2021-01-12","",null,"OK",null,"",null,"OK"]
["2021-01-13","",null,"OK",null,"",null,"OK"]
["2021-01-14","",null,"OK",null,"",null,"OK"]
["2021-01-15","",null,"OK",null,"",null,"OK"]
["2021-01-16","",null,"OK",null,"",null,"OK"]
["2021-01-17","",null,"OK",null,"",null,"OK"]
["2021-01-18","",null,"OK",null,"",null,"OK"]
["2021-01-19","",null,"OK",null,"",null,"OK"]
["2021-01-20","",null,"OK",null,"",null,"OK"]
["2021-01-21","",null,"OK",null,"",null,"OK"]
["2021-01-22","",null,"OK",null,"",null,"OK"]
["2021-01-23","",null,"OK",null,"",null,"OK"]
["2021-01-24","",null,"OK",null,"",null,"OK"]
[{"$f":"A303+1","v":"2021-01-25"},"",null,"OK",null,"",null,"OK"]
[{"$f":"A304+1","v":"2021-01-26"},"",null,"OK",null,"",null,"OK"]
["2021-01-27","",null,"OK",null,"",null,"OK"]
["2021-01-28","",null,"OK",null,"",null,"OK"]
["2021-01-29","",null,"OK",null,"",null,"OK"]
["2021-01-30","",null,"OK",null,"",null,"OK"]
[{"$f":"A309+1","v":"2021-01-31"},"",null,"OK",null,"",null,"OK"]

{"sheet":"Décembre","index":11,"n_rows":310,"n_cols":13,"rows_kept":310,"merged":[[0,0,0,9],[1,0,1,9],[4,0,4,9],[9,1,9,8],[50,0,50,9],[51,0,51,9],[54,0,54,9],[59,1,59,8],[93,0,93,9],[94,0,94,9],[97,0,97,9],[102,1,102,8],[103,1,103,2],[103,5,103,6],[137,0,137,9],[138,0,138,9],[141,0,141,10],[146,1,146,8],[147,1,147,2],[147,5,147,6],[180,0,180,9],[181,0,181,9],[184,0,184,9],[189,1,189,8],[190,1,190,2],[190,5,190,6],[223,0,223,9],[224,0,224,9],[227,0,227,9],[232,1,232,8],[233,1,233,2],[233,5,233,6],[267,0,267,9],[268,0,268,9],[271,0,271,9],[276,1,276,8],[277,1,277,2],[277,5,277,6]]}
[]
["Relevé des températures"]
[]
[]
["2020-12-01"]
[{"$nulls":5},"Document de référence :","Directives_Frigos"]
[null,"Fréquence =>",null,null,"le matin et le soir :","Relevé des températures "]
[]
[]
[null,"Congélateur cuisine",{"$nulls":7},"Mesure"]
["Valeurs \ncibles =>","Minimum  -15° C                                                                                ",null," Maximum -22°C    ",null,"Minimum  -15° C                                                                                  ",null,"Maximum -22°C          ",null,"en cas de température\nNon-conforme","Visa responsable"]
["Date","Heure","T°","Résultat","Visa","Heure","T°","Résultat","Visa"]
["2021-01-01",{"$f":"IF(C13=\"\",\"\",IF(B13<>\"\",B13,NOW()))","v":""},{"v":24,"d":"-24°C"},{"$f":"IF(C13>15,\"OK\",\"Contacter le chef\")","v":"OK"},null,{"$f":"IF(G13=\"\",\"\",IF(F13<>\"\",F13,NOW()))","v":""},null,{"$f":"IF(G13>15,\"OK\",\"Contacter le chef\")","v":"Contacter le chef"}]
[{"$f":"A13+1","v":"2021-01-02"},"",null,{"$f":"IF(C14>15,\"OK\",\"Contacter le chef\")","v":"Contacter le chef"},null,"",null,{"$f":"IF(G14>15,\"OK\",\"Contacter le chef\")","v":"Contacter le chef"}]
[{"$f":"A14+1","v":"2021-01-03"},"",null,"Contacter le chef",null,"",null,"Contacter le chef"]
["2021-01-04","",null,"Contacter le chef",null,"",null,"Contacter le chef"]
["2021-01-05","",null,"Contacter le chef",null,"",null,"Contacter le chef"]
["2021-01-06","",null,"Contacter le chef",null,"",null,"Contacter le chef"]
["2021-01-07","",null,"Contacter le chef",null,"",null,"Contacter le chef"]
["2021-01-08","",null,"Contacter le chef",null,"",null,"Contacter le chef"]
["2021-01-09","",null,"Contacter le chef",null,"",null,"Contacter le chef"]
["2021-01-10","",null,"Contacter le chef",null,"",null,"Contacter le chef"]
["2021-01-11","",null,"Contacter le chef",null,"",null,"Contacter le chef",{"$nulls":4},"O"]
["2021-01-12","",null,"Contacter le chef",null,"",null,"Contacter le chef"]
["2021-01-13","",null,"Contacter le chef",null,"",null,"Contacter le chef"]
["2021-01-14","",null,"Contacter le chef",null,"",null,"Contacter le chef"]
["2021-01-15","",null,"Contacter le chef",null,"",null,"Contacter le chef"]
["2021-01-16","",null,"Contacter le chef",null,"",null,"Contacter le chef"]
["2021-01-17","",null,"Contacter le chef",null,"",null,"Contacter le chef"]
["2021-01-18","",null,"Contacter le chef",null,"",null,"Contacter le chef"]
["2021-01-19","",null,"Contacter le chef",null,"",null,"Contacter le chef"]
["2021-01-20","",null,"Contacter le chef",null,"",null,"Contacter le chef"]
["2021-01-21","",null,"Contacter le chef",null,"",null,"Contacter le chef"]
["2021-01-22","",null,"Contacter le chef",null,"",null,"Contacter le chef"]
["2021-01-23","",null,"Contacter le chef",null,"",null,"Contacter le chef"]
["2021-01-24","",null,"Contacter le chef",null,"",null,"Contacter le chef"]
[{"$f":"A36+1","v":"2021-01-25"},"",null,"Contacter le chef",null,"",null,"Contacter le chef"]
[{"$f":"A37+1","v":"2021-01-26"},"",null,"Contacter le chef",null,"",null,"Contacter le chef"]
["2021-01-27","",null,"Contacter le chef",null,"",null,"Contacter le chef"]
["2021-01-28","",null,"Contacter le chef",null,"",null,"Contacter le chef"]
["2021-01-29","",null,"Contacter le chef",null,"",null,"Contacter le chef"]
["2021-01-30","",null,"Contacter le chef",null,"",null,"Contacter le chef"]
[{"$f":"A42+1","v":"2021-01-31"},"",null,"Contacter le chef",null,"",null,"Contacter le chef"]
[]
[null,"Contrôle"]
[null,"Signature"]
[]
[]
[]
[]
[]
["Relevé des températures"]
[]
[]
[{"$f":"A5","v":"2020-12-01"}]
[{"$nulls":5},"Document de référence :","Directives_Frigos"]
[null,"Fréquence =>",null,null,"le matin et le soir :","Relevé des températures et contrôle des rangements"]
[]
[]
[null,"Congélateur S/Sol",{"$nulls":7},"Mesure"]
["Valeurs \ncibles =>","Minimum  -15° C                                                                                ",null," Maximum -22°C    ",null,"Minimum  -15° C                                                                                  ",null,"Maximum -22°C          ",null,"en cas de température\nNon-conforme","Visa responsable"]
["Date","Heure","T°","Résultat","Visa","Heure","T°","Résultat","Visa"]
["2021-01-01",{"$f":"IF(C63=\"\",\"\",IF(B63<>\"\",B63,NOW()))","v":""},null,{"$f":"IF(C63>15,\"OK\",\"Contacter le chef\")","v":"Contacter le chef"},null,{"$f":"IF(G63=\"\",\"\",IF(F63<>\"\",F63,NOW()))","v":""},null,{"$f":"IF(G63>15,\"OK\",\"Contacter le chef\")","v":"Contacter le chef"}]
[{"$f":"A63+1","v":"2021-01-02"},"",null,{"$f":"IF(C64>15,\"OK\",\"Contacter le chef\")","v":"Contacter le chef"},null,"",null,{"$f":"IF(G64>15,\"OK\",\"Contacter le chef\")","v":"Contacter le chef"}]
[{"$f":"A64+1","v":"2021-01-03"},"",null,"Contacter le chef",null,"",null,"Contacter le chef"]
["2021-01-04","",null,"Contacter le chef",null,"",null,"Contacter le chef"]
["2021-01-05","",null,"Contacter le chef",null,"",null,"Contacter le chef"]
["2021-01-06","",null,"Contacter le chef",null,"",null,"Contacter le chef"]
["2021-01-07","",null,"Contacter le chef",null,"",null,"Contacter le chef"]
["2021-01-08","",null,"Contacter le chef",null,"",null,"Contacter le chef"]
["2021-01-09","",null,"Contacter le chef",null,"",null,"Contacter le chef"]
["2021-01-10","",null,"Contacter le chef",null,"",null,"Contacter le chef"]
["2021-01-11","",null,"Contacter le chef",null,"",null,"Contacter le chef"]
["2021-01-12","",null,"Contacter le chef",null,"",null,"Contacter le chef"]
["2021-01-13","",null,"Contacter le chef",null,"",null,"Contacter le chef"]
["2021-01-14","",null,"Contacter le chef",null,"",null,"Contacter le chef"]
["2021-01-15","",null,"Contacter le chef",null,"",null,"Contacter le chef"]
["2021-01-16","",null,"Contacter le chef",null,"",null,"Contacter le chef"]
["2021-01-17","",null,"Contacter le chef",null,"",null,"Contacter le chef"]
["2021-01-18","",null,"Contacter le chef",null,"",null,"Contacter le chef"]
["2021-01-19","",null,"Contacter le chef",null,"",null,"Contacter le chef"]
["2021-01-20","",null,"Contacter le chef",null,"",null,"Contacter le chef"]
["2021-01-21","",null,"Contacter le chef",null,"",null,"Contacter le chef"]
["2021-01-22","",null,"Contacter le chef",null,"",null,"Contacter le chef"]
["2021-01-23","",null,"Contacter le chef",null,"",null,"Contacter le chef"]
["2021-01-24","",null,"Contacter le chef",null,"",null,"Contacter le chef"]
[{"$f":"A86+1","v":"2021-01-25"},"",null,"Contacter le chef",null,"",null,"Contacter le chef"]
[{"$f":"A87+1","v":"2021-01-26"},"",null,"Contacter le chef",null,"",null,"Contacter le chef"]
["2021-01-27","",null,"Contacter le chef",null,"",null,"Contacter le chef"]
["2021-01-28","",null,"Contacter le chef",null,"",null,"Contacter le chef"]
["2021-01-29","",null,"Contacter le chef",null,"",null,"Contacter le chef"]
["2021-01-30","",null,"Contacter le chef",null,"",null,"Contacter le chef"]
[{"$f":"A92+1","v":"2021-01-31"},"",null,"Contacter le chef",null,"",null,"Contacter le chef"]
[]
["Relevé des températures"]
[]
[]
[{"$f":"A5","v":"2020-12-01"}]
[{"$nulls":5},"Document de référence :","Directives_Frigos"]
[null,"Fréquence =>",null,null,"le matin et le soir :","Relevé des températures et contrôle des rangements"]
[]
[]
[null,"Frigo cuisine",{"$nulls":7},"Mesure"]
["Valeurs \ncibles =>","Minimum  7° C                                                                                ",null," Maximum 3°C    ",null,"Minimum  7° C                                                                                ",null," Maximum 3°C    ",null,"en cas de température\nNon-conforme","Visa responsable"]
["Date","Heure","T°","Résultat","Visa","Heure","T°","Résultat","Visa"]
["2021-01-01",{"$f":"IF(C106=\"\",\"\",IF(B106<>\"\",B106,NOW()))","v":""},null,{"$f":"IF(C106<8,\"OK\",\"Contacter le chef\")","v":"OK"},null,{"$f":"IF(G106=\"\",\"\",IF(F106<>\"\",F106,NOW()))","v":""},null,{"$f":"IF(G106<8,\"OK\",\"Contacter le chef\")","v":"OK"}]
[{"$f":"A106+1","v":"2021-01-02"},"",null,"OK",null,"",null,"OK"]
[{"$f":"A107+1","v":"2021-01-03"},"",null,"OK",null,"",null,"OK"]
["2021-01-04","",null,"OK",null,"",null,"OK"]
["2021-01-05","",null,"OK",null,"",null,"OK"]
["2021-01-06","",null,"OK",null,"",null,"OK"]
["2021-01-07","",null,"OK",null,"",null,"OK"]
["2021-01-08","",null,"OK",null,"",null,"OK"]
["2021-01-09","",null,"OK",null,"",null,"OK"]
["2021-01-10","",null,"OK",null,"",null,"OK"]
["2021-01-11","",null,"OK",null,"",null,"OK"]
["2021-01-12","",null,"OK",null,"",null,"OK"]
["2021-01-13","",null,"OK",null,"",null,"OK"]
["2021-01-14","",null,"OK",null,"",null,"OK"]
["2021-01-15","",null,"OK",null,"",null,"OK"]
["2021-01-16","",null,"OK",null,"",null,"OK"]
["2021-01-17","",null,"OK",null,"",null,"OK"]
["2021-01-18","",null,"OK",null,"",null,"OK"]
["2021-01-19","",null,"OK",null,"",null,"OK"]
["2021-01-20","",null,"OK",null,"",null,"OK"]
["2021-01-21","",null,"OK",null,"",null,"OK"]
["2021-01-22","",null,"OK",null,"",null,"OK"]
["2021-01-23","",null,"OK",null,"",null,"OK"]
["2021-01-24","",null,"OK",null,"",null,"OK"]
[{"$f":"A129+1","v":"2021-01-25"},"",null,"OK",null,"",null,"OK"]
[{"$f":"A130+1","v":"2021-01-26"},"",null,"OK",null,"",null,"OK"]
["2021-01-27","",null,"OK",null,"",null,"OK"]
["2021-01-28","",null,"OK",null,"",null,"OK"]
["2021-01-29","",null,"OK",null,"",null,"OK"]
["2021-01-30","",null,"OK",null,"",null,"OK"]
[{"$f":"A135+1","v":"2021-01-31"},"",null,"OK",null,"",null,"OK"]
[]
[]
["Relevé des températures"]
[]
[]
[{"$f":"A98","v":"2020-12-01"}]
[{"$nulls":5},"Document de référence :","Directives_Frigos"]
[null,"Fréquence =>",null,null,"le matin et le soir :","Relevé des températures et contrôle des rangements"]
[]
[]
[null,"Frigo MEP",{"$nulls":7},"Mesure"]
["Valeurs \ncibles =>","Minimum  7° C                                                                                ",null," Maximum 3°C    ",null,"Minimum  7° C                                                                                ",null," Maximum 3°C    ",null,"en cas de température\nNon-conforme","Visa responsable"]
["Date","Heure","T°","Résultat","Visa","Heure","T°","Résultat","Visa"]
["2021-01-01",{"$f":"IF(C150=\"\",\"\",IF(B150<>\"\",B150,NOW()))","v":""},null,{"$f":"IF(C150<8,\"OK\",\"Contacter le chef\")","v":"OK"},null,{"$f":"IF(G150=\"\",\"\",IF(F150<>\"\",F150,NOW()))","v":""},null,{"$f":"IF(G150<8,\"OK\",\"Contacter le chef\")","v":"OK"}]
[{"$f":"A150+1","v":"2021-01-02"},"",null,"OK",null,"",null,"OK"]
[{"$f":"A151+1","v":"2021-01-03"},"",null,"OK",null,"",null,"OK"]
["2021-01-04","",null,"OK",null,"",null,"OK"]
["2021-01-05","",null,"OK",null,"",null,"OK"]
["2021-01-06","",null,"OK",null,"",null,"OK"]
["2021-01-07","",null,"OK",null,"",null,"OK"]
["2021-01-08","",null,"OK",null,"",null,"OK"]
["2021-01-09","",null,"OK",null,"",null,"OK"]
["2021-01-10","",null,"OK",null,"",null,"OK"]
["2021-01-11","",null,"OK",null,"",null,"OK"]
["2021-01-12","",null,"OK",null,"",null,"OK"]
["2021-01-13","",null,"OK",null,"",null,"OK"]
["2021-01-14","",null,"OK",null,"",null,"OK"]
["2021-01-15","",null,"OK",null,"",null,"OK"]
["2021-01-16","",null,"OK",null,"",null,"OK"]
["2021-01-17","",null,"OK",null,"",null,"OK"]
["2021-01-18","",null,"OK",null,"",null,"OK"]
["2021-01-19","",null,"OK",null,"",null,"OK"]
["2021-01-20","",null,"OK",null,"",null,"OK"]
["2021-01-21","",null,"OK",null,"",null,"OK"]
["2021-01-22","",null,"OK",null,"",null,"OK"]
["2021-01-23","",null,"OK",null,"",null,"OK"]
["2021-01-24","",null,"OK",null,"",null,"OK"]
[{"$f":"A173+1","v":"2021-01-25"},"",null,"OK",null,"",null,"OK"]
[{"$f":"A174+1","v":"2021-01-26"},"",null,"OK",null,"",null,"OK"]
["2021-01-27","",null,"OK",null,"",null,"OK"]
["2021-01-28","",null,"OK",null,"",null,"OK"]
["2021-01-29","",null,"OK",null,"",null,"OK"]
["2021-01-30","",null,"OK",null,"",null,"OK"]
[{"$f":"A179+1","v":"2021-01-31"},"",null,"OK",null,"",null,"OK"]
[]
["Relevé des températures"]
[]
[]
[{"$f":"A142","v":"2020-12-01"}]
[{"$nulls":5},"Document de référence :","Directives_Frigos"]
[null,"Fréquence =>",null,null,"le matin et le soir :","Relevé des températures et contrôle des rangements"]
[]
[]
[null,"Frigo pâtisserie",{"$nulls":7},"Mesure"]
["Valeurs \ncibles =>","Minimum  7° C                                                                                ",null," Maximum 3°C    ",null,"Minimum  7° C                                                                                ",null," Maximum 3°C    ",null,"en cas de température\nNon-conforme","Visa responsable"]
["Date","Heure","T°","Résultat","Visa","Heure","T°","Résultat","Visa"]
["2021-01-01",{"$f":"IF(C193=\"\",\"\",IF(B193<>\"\",B193,NOW()))","v":""},null,{"$f":"IF(C193<8,\"OK\",\"Contacter le chef\")","v":"OK"},null,{"$f":"IF(G193=\"\",\"\",IF(F193<>\"\",F193,NOW()))","v":""},null,{"$f":"IF(G193<8,\"OK\",\"Contacter le chef\")","v":"OK"}]
[{"$f":"A193+1","v":"2021-01-02"},"",null,"OK",null,"",null,"OK"]
[{"$f":"A194+1","v":"2021-01-03"},"",null,"OK",null,"",null,"OK"]
["2021-01-04","",null,"OK",null,"",null,"OK"]
["2021-01-05","",null,"OK",null,"",null,"OK"]
["2021-01-06","",null,"OK",null,"",null,"OK"]
["2021-01-07","",null,"OK",null,"",null,"OK"]
["2021-01-08","",null,"OK",null,"",null,"OK"]
["2021-01-09","",null,"OK",null,"",null,"OK"]
["2021-01-10","",null,"OK",null,"",null,"OK"]
["2021-01-11","",null,"OK",null,"",null,"OK"]
["2021-01-12","",null,"OK",null,"",null,"OK"]
["2021-01-13","",null,"OK",null,"",null,"OK"]
["2021-01-14","",null,"OK",null,"",null,"OK"]
["2021-01-15","",null,"OK",null,"",null,"OK"]
["2021-01-16","",null,"OK",null,"",null,"OK"]
["2021-01-17","",null,"OK",null,"",null,"OK"]
["2021-01-18","",null,"OK",null,"",null,"OK"]
["2021-01-19","",null,"OK",null,"",null,"OK"]
["2021-01-20","",null,"OK",null,"",null,"OK"]
["2021-01-21","",null,"OK",null,"",null,"OK"]
["2021-01-22","",null,"OK",null,"",null,"OK"]
["2021-01-23","",null,"OK",null,"",null,"OK"]
["2021-01-24","",null,"OK",null,"",null,"OK"]
[{"$f":"A216+1","v":"2021-01-25"},"",null,"OK",null,"",null,"OK"]
[{"$f":"A217+1","v":"2021-01-26"},"",null,"OK",null,"",null,"OK"]
["2021-01-27","",null,"OK",null,"",null,"OK"]
["2021-01-28","",null,"OK",null,"",null,"OK"]
["2021-01-29","",null,"OK",null,"",null,"OK"]
["2021-01-30","",null,"OK",null,"",null,"OK"]
[{"$f":"A222+1","v":"2021-01-31"},"",null,"OK",null,"",null,"OK"]
[]
["Relevé des températures"]
[]
[]
[{"$f":"A185","v":"2020-12-01"}]
[{"$nulls":5},"Document de référence :","Directives_Frigos"]
[null,"Fréquence =>",null,null,"le matin et le soir :","Relevé des températures et contrôle des rangements"]
[]
[]
[null,"Frigo produits laitiers",{"$nulls":7},"Mesure"]
["Valeurs \ncibles =>","Minimum  7° C                                                                                ",null," Maximum 3°C    ",null,"Minimum  7° C                                                                                ",null," Maximum 3°C    ",null,"en cas de température\nNon-conforme","Visa responsable"]
["Date","Heure","T°","Résultat","Visa","Heure","T°","Résultat","Visa"]
["2021-01-01",{"$f":"IF(C236=\"\",\"\",IF(B236<>\"\",B236,NOW()))","v":""},null,{"$f":"IF(C236<8,\"OK\",\"Contacter le chef\")","v":"OK"},null,{"$f":"IF(G236=\"\",\"\",IF(F236<>\"\",F236,NOW()))","v":""},null,{"$f":"IF(G236<8,\"OK\",\"Contacter le chef\")","v":"OK"}]
[{"$f":"A236+1","v":"2021-01-02"},"",null,"OK",null,"",null,"OK"]
[{"$f":"A237+1","v":"2021-01-03"},"",null,"OK",null,"",null,"OK"]
["2021-01-04","",null,"OK",null,"",null,"OK"]
["2021-01-05","",null,"OK",null,"",null,"OK"]
["2021-01-06","",null,"OK",null,"",null,"OK"]
["2021-01-07","",null,"OK",null,"",null,"OK"]
["2021-01-08","",null,"OK",null,"",null,"OK"]
["2021-01-09","",null,"OK",null,"",null,"OK"]
["2021-01-10","",null,"OK",null,"",null,"OK"]
["2021-01-11","",null,"OK",null,"",null,"OK"]
["2021-01-12","",null,"OK",null,"",null,"OK"]
["2021-01-13","",null,"OK",null,"",null,"OK"]
["2021-01-14","",null,"OK",null,"",null,"OK"]
["2021-01-15","",null,"OK",null,"",null,"OK"]
["2021-01-16","",null,"OK",null,"",null,"OK"]
["2021-01-17","",null,"OK",null,"",null,"OK"]
["2021-01-18","",null,"OK",null,"",null,"OK"]
["2021-01-19","",null,"OK",null,"",null,"OK"]
["2021-01-20","",null,"OK",null,"",null,"OK"]
["2021-01-21","",null,"OK",null,"",null,"OK"]
["2021-01-22","",null,"OK",null,"",null,"OK"]
["2021-01-23","",null,"OK",null,"",null,"OK"]
["2021-01-24","",null,"OK",null,"",null,"OK"]
[{"$f":"A259+1","v":"2021-01-25"},"",null,"OK",null,"",null,"OK"]
[{"$f":"A260+1","v":"2021-01-26"},"",null,"OK",null,"",null,"OK"]
["2021-01-27","",null,"OK",null,"",null,"OK"]
["2021-01-28","",null,"OK",null,"",null,"OK"]
["2021-01-29","",null,"OK",null,"",null,"OK"]
["2021-01-30","",null,"OK",null,"",null,"OK"]
[{"$f":"A265+1","v":"2021-01-31"},"",null,"OK",null,"",null,"OK"]
[]
[]
["Relevé des températures"]
[]
[]
[{"$f":"A228","v":"2020-12-01"}]
[{"$nulls":5},"Document de référence :","Directives_Frigos"]
[null,"Fréquence =>",null,null,"le matin et le soir :","Relevé des températures et contrôle des rangements"]
[]
[]
[null,"Frigo S/Sol",{"$nulls":7},"Mesure"]
["Valeurs \ncibles =>","Minimum  7° C                                                                                ",null," Maximum 3°C    ",null,"Minimum  7° C                                                                                ",null," Maximum 3°C    ",null,"en cas de température\nNon-conforme","Visa responsable"]
["Date","Heure","T°","Résultat","Visa","Heure","T°","Résultat","Visa"]
["2021-01-01",{"$f":"IF(C280=\"\",\"\",IF(B280<>\"\",B280,NOW()))","v":""},null,{"$f":"IF(C280<8,\"OK\",\"Contacter le chef\")","v":"OK"},null,{"$f":"IF(G280=\"\",\"\",IF(F280<>\"\",F280,NOW()))","v":""},null,{"$f":"IF(G280<8,\"OK\",\"Contacter le chef\")","v":"OK"}]
[{"$f":"A280+1","v":"2021-01-02"},"",null,{"$f":"IF(C281<8,\"OK\",\"Contacter le chef\")","v":"OK"},null,"",null,"OK"]
[{"$f":"A281+1","v":"2021-01-03"},"",null,"OK",null,"",null,"OK"]
["2021-01-04","",null,"OK",null,"",null,"OK"]
["2021-01-05","",null,"OK",null,"",null,"OK"]
["2021-01-06","",null,"OK",null,"",null,"OK"]
["2021-01-07","",null,"OK",null,"",null,"OK"]
["2021-01-08","",null,"OK",null,"",null,"OK"]
["2021-01-09","",null,"OK",null,"",null,"OK"]
["2021-01-10","",null,"OK",null,"",null,"OK"]
["2021-01-11","",null,"OK",null,"",null,"OK"]
["2021-01-12","",null,"OK",null,"",null,"OK"]
["2021-01-13","",null,"OK",null,"",null,"OK"]
["2021-01-14","",null,"OK",null,"",null,"OK"]
["2021-01-15","",null,"OK",null,"",null,"OK"]
["2021-01-16","",null,"OK",null,"",null,"OK"]
["2021-01-17","",null,"OK",null,"",null,"OK"]
["2021-01-18","",null,"OK",null,"",null,"OK"]
["2021-01-19","",null,"OK",null,"",null,"OK"]
["2021-01-20","",null,"OK",null,"",null,"OK"]
["2021-01-21","",null,"OK",null,"",null,"OK"]
["2021-01-22","",null,"OK",null,"",null,"OK"]
["2021-01-23","",null,"OK",null,"",null,"OK"]
["2021-01-24","",null,"OK",null,"",null,"OK"]
[{"$f":"A303+1","v":"2021-01-25"},"",null,"OK",null,"",null,"OK"]
[{"$f":"A304+1","v":"2021-01-26"},"",null,"OK",null,"",null,"OK"]
["2021-01-27","",null,"OK",null,"",null,"OK"]
["2021-01-28","",null,"OK",null,"",null,"OK"]
["2021-01-29","",null,"OK",null,"",null,"OK"]
["2021-01-30","",null,"OK",null,"",null,"OK"]
[{"$f":"A309+1","v":"2021-01-31"},"",null,"OK",null,"",null,"OK"]

{"sheet":"Nom accés ","index":12,"n_rows":7,"n_cols":20,"rows_kept":7}
["Julien",null,"Reprendre la température dans une heure",{"$nulls":3},"Faustino",null,"2020-01-01","2020-02-01","2020-03-01","2020-04-01","2020-05-01","2020-06-01","2020-07-01","2020-08-01","2020-09-01","2020-10-01","2020-11-01","2020-12-01"]
["Agosthino",null,"Contacter le frigoriste",{"$nulls":3},"Pierre-Alain",null,"2021-01-01","2021-02-02","2021-03-01","2021-04-01","2021-05-01","2021-06-01","2021-07-01","2021-08-01","2021-09-01","2021-10-01","2021-11-01","2021-12-01"]
["Jessica",null,"Contrôle du condensateur",{"$nulls":3},"André",null,"2022-01-01","1900-01-02","2022-03-01","2022-04-01","2022-05-01","2022-06-01","2022-07-01","2022-08-01","2022-09-01","2022-10-01","2022-11-01","2022-12-01"]
["Gerry",null,"Nettoyage du condensateur",{"$nulls":3},"Yann",null,"2023-01-01","2023-02-04","2023-03-01","2023-04-01","2023-05-01","2023-06-01","2023-07-01","2023-08-01","2023-09-01","2023-10-01","2023-11-01","2023-12-01"]
["Ana",{"$nulls":7},"2024-01-01","2024-02-05","2024-03-01","2024-04-01","2024-05-01","2024-06-01","2024-07-01","2024-08-01","2024-09-01","2024-10-01","2024-11-01","2024-12-01"]
["Salomé",{"$nulls":7},"2025-01-01","2025-02-06","2025-03-01","2025-04-01","2025-05-01","2025-06-01","2025-07-01","2025-08-01","2025-09-01","2025-10-01","2025-11-01","2025-12-01"]
[{"$nulls":8},"2026-01-01","2026-02-07","2026-03-01","2026-04-01","2026-05-01","2026-06-01","2026-07-01","2026-08-01","2026-09-01","2026-10-01","2026-11-01","2026-12-01"]