{"text_format":"3","workbook":"xlsx","n_sheets":3,"sheets":["Planning","Etudes","Données"],"not_rendered":{"macros":1},"read":"whole","date_system":"1900"}

{"sheet":"Planning","index":0,"n_rows":41,"n_cols":7309,"rows_kept":41}
[{"$nulls":3},{"$f":"YEAR(D5)","v":2020},{"$f":"YEAR(E5)","v":2020},2020,2020,2020,2020,2020,2020,2020,2020,2020,2020,2020,2020,2020,2020,2020,2020,2020,2020,2020,2020,2020,2020,2020,2020,2020,2020,2020,2020,2020,2020,2020,2020,2020,2020,2020,2020,2020,2020,2020,2020,2020,2020,2020,2020,2020,2020,2020,2020,2020,2020,2020,2020,2020,2020,2020,2020,2020,2020,2020,2020,2020,2020,2020,{"$f":"YEAR(BQ5)","v":2020},2020,2020,2020,2020,2020,2020,2020,2020,2020,2020,2020,2020,2020,2020,2020,2020,2020,2020,2020,2020,2020,2020,2020,2020,2020,2020,2020,2020,2020,2020,2020,2020,2020,2020,2020,2020,2020,2020,2020,2020,2020,2020,2020,2020,2020,2020,2020,2020,2020,2020,2020,2020,2020,2020,2020,2020,2020,2020,2020,2020,2020,2020,2020,{"$f":"YEAR(EC5)","v":2020},2020,2020,2020,2020,2020,2020,2020,2020,2020,2020,2020,2020,2020,2020,2020,2020,2020,2020,2020,2020,2020,2020,2020,2020,2020,2020,2020,2020,2020,2020,2020,2020,2020,2020,2020,2020,2020,2020,2020,2020,2020,2020,2020,2020,2020,2020,2020,2020,2020,2020,2020,2020,2020,2020,2020,2020,2020,2020,2020,2020,2020,2020,2020,{"$f":"YEAR(GO5)","v":2020},2020,2020,2020,2020,2020,2020,2020,2020,2020,2020,2020,2020,2020,2020,2020,2020,2020,2020,2020,2020,2020,2020,2020,2020,2020,2020,2020,2020,2020,2020,2020,2020,2020,2020,2020,2020,2020,2020,2020,2020,2020,2020,2020,2020,2020,2020,2020,2020,2020,2020,2020,2020,2020,2020,2020,2020,2020,2020,2020,2020,2020,2020,2020,{"$f":"YEAR(JA5)","v":2020},2020,2020,2020,2020,2020,2020,2020,2020,2020,2020,2020,2020,2020,2020,2020,2020,2020,2020,2020,2020,2020,2020,2020,2020,2020,2020,2020,2020,2020,2020,2020,2020,2020,2020,2020,2020,2020,2020,2020,2020,2020,2020,2020,2020,2020,2020,2020,2020,2020,2020,2020,2020,2020,2020,2020,2020,2020,2020,2020,2020,2020,2020,2020,{"$f":"YEAR(LM5)","v":2020},2020,2020,2020,2020,2020,2020,2020,2020,2020,2020,2020,2020,2020,2020,2020,2020,2020,2020,2020,2020,2020,2020,2020,2020,2020,2020,2020,2020,2020,2020,2020,2020,2020,2020,2020,2020,2020,2020,2020,2020,2020,2020,2020,2020,{"$f":"YEAR(NF5)","v":2021},2021,2021,2021,2021,2021,2021,2021,2021,2021,2021,2021,2021,2021,2021,2021,2021,2021,2021,{"$f":"YEAR(NY5)","v":2021},2021,2021,2021,2021,2021,2021,2021,2021,2021,2021,2021,2021,2021,2021,2021,2021,2021,2021,2021,2021,2021,2021,2021,2021,2021,2021,2021,2021,2021,2021,2021,2021,2021,2021,2021,2021,2021,2021,2021,2021,2021,2021,2021,2021,2021,2021,2021,2021,2021,2021,2021,2021,2021,2021,2021,2021,2021,2021,2021,2021,2021,2021,2021,{"$f":"YEAR(QK5)","v":2021},2021,2021,2021,2021,2021,2021,2021,2021,2021,2021,2021,2021,2021,2021,2021,2021,2021,2021,2021,2021,2021,2021,2021,2021,2021,2021,2021,2021,2021,2021,2021,2021,2021,2021,2021,2021,2021,2021,2021,2021,2021,2021,2021,2021,2021,2021,2021,2021,2021,2021,2021,2021,2021,2021,2021,2021,2021,2021,2021,2021,2021,2021,2021,{"$f":"YEAR(SW5)","v":2021},2021,2021,2021,2021,2021,2021,2021,2021,2021,2021,2021,2021,2021,2021,2021,2021,2021,2021,2021,2021,2021,2021,2021,2021,2021,2021,2021,2021,2021,2021,2021,2021,2021,2021,2021,2021,2021,2021,2021,2021,2021,2021,2021,2021,2021,2021,2021,2021,2021,2021,2021,2021,2021,2021,2021,2021,2021,2021,2021,2021,2021,2021,2021,{"$f":"YEAR(VI5)","v":2021},2021,2021,2021,2021,2021,2021,2021,2021,2021,2021,2021,2021,2021,2021,2021,2021,2021,2021,2021,2021,2021,2021,2021,2021,2021,2021,2021,2021,2021,2021,2021,2021,2021,2021,2021,2021,2021,2021,2021,2021,2021,2021,2021,2021,2021,2021,2021,2021,2021,2021,2021,2021,2021,2021,2021,2021,2021,2021,2021,2021,2021,2021,2021,{"$f":"YEAR(XU5)","v":2021},2021,2021,2021,2021,2021,2021,2021,2021,2021,2021,2021,2021,2021,2021,2021,2021,2021,2021,2021,2021,2021,2021,2021,2021,2021,2021,2021,2021,2021,2021,2021,2021,2021,2021,2021,2021,2021,2021,2021,2021,2021,2021,2021,2021,2021,2021,2021,2021,2021,2021,2021,2021,2021,2021,2021,2021,2021,2021,2021,2021,2021,2021,2021,{"$f":"YEAR(AAG5)","v":2021},2021,2021,2021,2021,2021,2021,2021,2021,2021,2021,2021,2021,2021,2021,2021,2021,2021,2021,2021,2021,2021,2021,2021,2021,2021,2022,2022,2022,2022,2022,2022,2022,2022,2022,2022,2022,2022,2022,2022,2022,2022,2022,2022,2022,2022,2022,2022,2022,2022,2022,2022,2022,2022,2022,2022,2022,2022,2022,2022,2022,2022,2022,2022,{"$f":"YEAR(ACS5)","v":2022},2022,2022,2022,2022,2022,2022,2022,2022,2022,2022,2022,2022,2022,2022,2022,2022,2022,2022,2022,2022,2022,2022,2022,2022,2022,2022,2022,2022,2022,2022,2022,2022,2022,2022,2022,2022,2022,2022,2022,2022,2022,2022,2022,2022,2022,2022,2022,2022,2022,2022,2022,2022,2022,2022,2022,2022,2022,2022,2022,2022,2022,2022,2022,{"$f":"YEAR(AFE5)","v":2022},2022,2022,2022,2022,2022,2022,2022,2022,2022,2022,2022,2022,2022,2022,2022,2022,2022,2022,2022,2022,2022,2022,2022,2022,2022,2022,2022,2022,2022,2022,2022,2022,2022,2022,2022,2022,2022,2022,2022,2022,2022,2022,2022,2022,2022,2022,2022,2022,2022,2022,2022,2022,2022,2022,2022,2022,2022,2022,2022,2022,2022,2022,2022,{"$f":"YEAR(AHQ5)","v":2022},2022,2022,2022,2022,2022,2022,2022,2022,2022,2022,2022,2022,2022,2022,2022,2022,2022,2022,2022,2022,2022,2022,2022,2022,2022,2022,2022,2022,2022,2022,2022,2022,2022,2022,2022,2022,2022,2022,2022,2022,2022,2022,2022,2022,2022,2022,2022,2022,2022,2022,2022,2022,2022,2022,2022,2022,2022,2022,2022,2022,2022,2022,2022,{"$f":"YEAR(AKC5)","v":2022},2022,2022,2022,2022,2022,2022,2022,2022,2022,2022,2022,2022,2022,2022,2022,2022,2022,2022,2022,2022,2022,2022,2022,2022,2022,2022,2022,2022,2022,2022,2022,2022,2022,2022,2022,2022,2022,2022,2022,2022,2022,2022,2022,2022,2022,2022,2022,2022,2022,2022,2022,2022,2022,2022,2022,2022,2022,2022,2022,2022,2022,2022,2022,{"$f":"YEAR(AMO5)","v":2022},2022,2022,2022,2022,2022,2022,2022,2022,2022,2022,2022,2022,2022,2022,2022,2022,2022,2022,2022,2022,2022,2022,2022,2022,2022,2022,2022,2022,2022,2022,2022,2022,2022,2022,2022,2022,2022,2022,2022,2022,2022,2022,2022,2022,2022,2022,2022,2022,2022,2022,2022,2022,2022,2022,2022,2022,2022,2022,2022,2022,2022,2022,2022,{"$f":"YEAR(APA5)","v":2022},2022,2022,2022,2022,2022,2022,2023,2023,2023,2023,2023,2023,2023,2023,2023,2023,2023,2023,2023,2023,2023,2023,2023,2023,2023,2023,2023,2023,2023,2023,2023,2023,2023,2023,2023,2023,2023,2023,2023,2023,2023,2023,2023,2023,2023,2023,2023,2023,2023,2023,2023,2023,2023,2023,2023,2023,2023,2023,2023,2023,2023,2023,2023,{"$f":"YEAR(ARM5)","v":2023},2023,2023,2023,2023,2023,2023,2023,2023,2023,2023,2023,2023,2023,2023,2023,2023,2023,2023,2023,2023,2023,2023,2023,2023,2023,2023,2023,2023,2023,2023,2023,2023,2023,2023,2023,2023,2023,2023,2023,2023,2023,2023,2023,2023,2023,2023,2023,2023,2023,2023,2023,2023,2023,2023,2023,2023,2023,2023,2023,2023,2023,2023,2023,{"$f":"YEAR(ATY5)","v":2023},2023,2023,2023,2023,2023,2023,2023,2023,2023,2023,2023,2023,2023,2023,2023,2023,2023,2023,2023,2023,2023,2023,2023,2023,2023,2023,2023,2023,2023,2023,2023,2023,2023,2023,2023,2023,2023,2023,2023,2023,2023,2023,2023,2023,2023,2023,2023,2023,2023,2023,2023,2023,2023,2023,2023,2023,2023,2023,2023,2023,2023,2023,2023,{"$f":"YEAR(AWK5)","v":2023},2023,2023,2023,2023,2023,2023,2023,2023,2023,2023,2023,2023,2023,2023,2023,2023,2023,2023,2023,2023,2023,2023,2023,2023,2023,2023,2023,2023,2023,2023,2023,2023,2023,2023,2023,2023,2023,2023,2023,2023,2023,2023,2023,2023,2023,2023,2023,2023,2023,2023,2023,2023,2023,2023,2023,2023,2023,2023,2023,2023,2023,2023,2023,{"$f":"YEAR(AYW5)","v":2023},2023,2023,2023,2023,2023,2023,2023,2023,2023,2023,2023,2023,2023,2023,2023,2023,2023,2023,2023,2023,2023,2023,2023,2023,2023,2023,2023,2023,2023,2023,2023,2023,2023,2023,2023,2023,2023,2023,2023,2023,2023,2023,2023,2023,2023,2023,2023,2023,2023,2023,2023,2023,2023,2023,2023,2023,2023,2023,2023,2023,2023,2023,2023,{"$f":"YEAR(BBI5)","v":2023},2023,2023,2023,2023,2023,2023,2023,2023,2023,2023,2023,2023,2023,2023,2023,2023,2023,2023,2023,2023,2023,2023,2023,2023,2023,2023,2023,2023,2023,2023,2023,2023,2023,2023,2023,2023,2023,2023,2023,2023,2023,2023,2023,2023,2023,2023,2023,2023,2023,2023,2023,2024,2024,2024,2024,2024,2024,2024,2024,2024,2024,2024,2024,{"$f":"YEAR(BDU5)","v":2024},2024,2024,2024,2024,2024,2024,2024,2024,2024,2024,2024,2024,2024,2024,2024,2024,2024,2024,2024,2024,2024,2024,2024,2024,2024,2024,2024,2024,2024,2024,2024,2024,2024,2024,2024,2024,2024,2024,2024,2024,2024,2024,2024,2024,2024,2024,2024,2024,2024,2024,2024,2024,2024,2024,2024,2024,2024,2024,2024,2024,2024,2024,2024,{"$f":"YEAR(BGG5)","v":2024},2024,2024,2024,2024,2024,2024,2024,2024,2024,2024,2024,2024,2024,2024,2024,2024,2024,2024,2024,2024,2024,2024,2024,2024,2024,2024,2024,2024,2024,2024,2024,2024,2024,2024,2024,2024,2024,2024,2024,2024,2024,2024,2024,2024,2024,2024,2024,2024,2024,2024,2024,2024,2024,2024,2024,2024,2024,2024,2024,2024,2024,2024,2024,{"$f":"YEAR(BIS5)","v":2024},2024,2024,2024,2024,2024,2024,2024,2024,2024,2024,2024,2024,2024,2024,2024,2024,2024,2024,2024,2024,2024,2024,2024,2024,2024,2024,2024,2024,2024,2024,2024,2024,2024,2024,2024,2024,2024,2024,2024,2024,2024,2024,2024,2024,2024,2024,2024,2024,2024,2024,2024,2024,2024,2024,2024,2024,2024,2024,2024,2024,2024,2024,2024,{"$f":"YEAR(BLE5)","v":2024},2024,2024,2024,2024,2024,2024,2024,2024,2024,2024,2024,2024,2024,2024,2024,2024,2024,2024,2024,2024,2024,2024,2024,2024,2024,2024,2024,2024,2024,2024,2024,2024,2024,2024,2024,2024,2024,2024,2024,2024,2024,2024,2024,2024,2024,2024,2024,2024,2024,2024,2024,2024,2024,2024,2024,2024,2024,2024,2024,2024,2024,2024,2024,{"$f":"YEAR(BNQ5)","v":2024},2024,2024,2024,2024,2024,2024,2024,2024,2024,2024,2024,2024,2024,2024,2024,2024,2024,2024,2024,2024,2024,2024,2024,2024,2024,2024,2024,2024,2024,2024,2024,2024,2024,2024,2024,2024,2024,2024,2024,2024,2024,2024,2024,2024,2024,2024,2024,2024,2024,2024,2024,2024,2024,2024,2024,2024,2024,2024,2024,2024,2024,2024,2024,{"$f":"YEAR(BQC5)","v":2024},2024,2024,2024,2024,2024,2024,2024,2024,2024,2024,2024,2024,2024,2024,2024,2024,2024,2024,2024,2024,2024,2024,2024,2024,2024,2024,2024,2024,2024,2024,2024,2024,2024,2025,2025,2025,2025,2025,2025,2025,2025,2025,2025,2025,2025,2025,2025,2025,2025,2025,2025,2025,2025,2025,2025,2025,2025,2025,2025,2025,2025,2025,2025,{"$f":"YEAR(BSO5)","v":2025},2025,2025,2025,2025,2025,2025,2025,2025,2025,2025,2025,2025,2025,2025,2025,2025,2025,2025,2025,2025,2025,2025,2025,2025,2025,2025,2025,2025,2025,2025,2025,2025,2025,2025,2025,2025,2025,2025,2025,2025,2025,2025,2025,2025,2025,2025,2025,2025,2025,2025,2025,2025,2025,2025,2025,2025,2025,2025,2025,2025,2025,2025,2025,{"$f":"YEAR(BVA5)","v":2025},2025,2025,2025,2025,2025,2025,2025,2025,2025,2025,2025,2025,2025,2025,2025,2025,2025,2025,2025,2025,2025,2025,2025,2025,2025,2025,2025,2025,2025,2025,2025,2025,2025,2025,2025,2025,2025,2025,2025,2025,2025,2025,2025,2025,2025,2025,2025,2025,2025,2025,2025,2025,2025,2025,2025,2025,2025,2025,2025,2025,2025,2025,2025,{"$f":"YEAR(BXM5)","v":2025},2025,2025,2025,2025,2025,2025,2025,2025,2025,2025,2025,2025,2025,2025,2025,2025,2025,2025,2025,2025,2025,2025,2025,2025,2025,2025,2025,2025,2025,2025,2025,2025,2025,2025,2025,2025,2025,2025,2025,2025,2025,2025,2025,2025,2025,2025,2025,2025,2025,2025,2025,2025,2025,2025,2025,2025,2025,2025,2025,2025,2025,2025,2025,{"$f":"YEAR(BZY5)","v":2025},2025,2025,2025,2025,2025,2025,2025,2025,2025,2025,2025,2025,2025,2025,2025,2025,2025,2025,2025,2025,2025,2025,2025,2025,2025,2025,2025,2025,2025,2025,2025,2025,2025,2025,2025,2025,2025,2025,2025,2025,2025,2025,2025,2025,2025,2025,2025,2025,2025,2025,2025,2025,2025,2025,2025,2025,2025,2025,2025,2025,2025,2025,2025,{"$f":"YEAR(CCK5)","v":2025},2025,2025,2025,2025,2025,2025,2025,2025,2025,2025,2025,2025,2025,2025,2025,2025,2025,2025,2025,2025,2025,2025,2025,2025,2025,2025,2025,2025,2025,2025,2025,2025,2025,2025,2025,2025,2025,2025,2025,2025,2025,2025,2025,2025,2025,2025,2025,2025,2025,2025,2025,2025,2025,2025,2025,2025,2025,2025,2025,2025,2025,2025,2025,{"$f":"YEAR(CEW5)","v":2025},2025,2025,2025,2025,2025,2025,2025,2025,2025,2025,2025,2025,2025,2025,2026,2026,2026,2026,2026,2026,2026,2026,2026,2026,2026,2026,2026,2026,2026,2026,2026,2026,2026,2026,2026,2026,2026,2026,2026,2026,2026,2026,2026,2026,2026,2026,2026,2026,2026,2026,2026,2026,2026,2026,2026,2026,2026,2026,2026,2026,2026,2026,2026,{"$f":"YEAR(CHI5)","v":2026},2026,2026,2026,2026,2026,2026,2026,2026,2026,2026,2026,2026,2026,2026,2026,2026,2026,2026,2026,2026,2026,2026,2026,2026,2026,2026,2026,2026,2026,2026,2026,2026,2026,2026,2026,2026,2026,2026,2026,2026,2026,2026,2026,2026,2026,2026,2026,2026,2026,2026,2026,2026,2026,2026,2026,2026,2026,2026,2026,2026,2026,2026,2026,{"$f":"YEAR(CJU5)","v":2026},2026,2026,2026,2026,2026,2026,2026,2026,2026,2026,2026,2026,2026,2026,2026,2026,2026,2026,2026,2026,2026,2026,2026,2026,2026,2026,2026,2026,2026,2026,2026,2026,2026,2026,2026,2026,2026,2026,2026,2026,2026,2026,2026,2026,2026,2026,2026,2026,2026,2026,2026,2026,2026,2026,2026,2026,2026,2026,2026,2026,2026,2026,2026,{"$f":"YEAR(CMG5)","v":2026},2026,2026,2026,2026,2026,2026,2026,2026,2026,2026,2026,2026,2026,2026,2026,2026,2026,2026,2026,2026,2026,2026,2026,2026,2026,2026,2026,2026,2026,2026,2026,2026,2026,2026,2026,2026,2026,2026,2026,2026,2026,2026,2026,2026,2026,2026,2026,2026,2026,2026,2026,2026,2026,2026,2026,2026,2026,2026,2026,2026,2026,2026,2026,{"$f":"YEAR(COS5)","v":2026},2026,2026,2026,2026,2026,2026,2026,2026,2026,2026,2026,2026,2026,2026,2026,2026,2026,2026,2026,2026,2026,2026,2026,2026,2026,2026,2026,2026,2026,2026,2026,2026,2026,2026,2026,2026,2026,2026,2026,2026,2026,2026,2026,2026,2026,2026,2026,2026,2026,2026,2026,2026,2026,2026,2026,2026,2026,2026,2026,2026,2026,2026,2026,{"$f":"YEAR(CRE5)","v":2026},2026,2026,2026,2026,2026,2026,2026,2026,2026,2026,2026,2026,2026,2026,2026,2026,2026,2026,2026,2026,2026,2026,2026,2026,2026,2026,2026,2026,2026,2026,2026,2026,2026,2026,2026,2026,2026,2026,2026,2026,2026,2026,2026,2026,2026,2026,2026,2026,2026,2026,2026,2026,2026,2026,2026,2026,2026,2026,2026,2027,2027,2027,2027,{"$f":"YEAR(CTQ5)","v":2027},2027,2027,2027,2027,2027,2027,2027,2027,2027,2027,2027,2027,2027,2027,2027,2027,2027,2027,2027,2027,2027,2027,2027,2027,2027,2027,2027,2027,2027,2027,2027,2027,2027,2027,2027,2027,2027,2027,2027,2027,2027,2027,2027,2027,2027,2027,2027,2027,2027,2027,2027,2027,2027,2027,2027,2027,2027,2027,2027,2027,2027,2027,2027,{"$f":"YEAR(CWC5)","v":2027},2027,2027,2027,2027,2027,2027,2027,2027,2027,2027,2027,2027,2027,2027,2027,2027,2027,2027,2027,2027,2027,2027,2027,2027,2027,2027,2027,2027,2027,2027,2027,2027,2027,2027,2027,2027,2027,2027,2027,2027,2027,2027,2027,2027,2027,2027,2027,2027,2027,2027,2027,2027,2027,2027,2027,2027,2027,2027,2027,2027,2027,2027,2027,{"$f":"YEAR(CYO5)","v":2027},2027,2027,2027,2027,2027,2027,2027,2027,2027,2027,2027,2027,2027,2027,2027,2027,2027,2027,2027,2027,2027,2027,2027,2027,2027,2027,2027,2027,2027,2027,2027,2027,2027,2027,2027,2027,2027,2027,2027,2027,2027,2027,2027,2027,2027,2027,2027,2027,2027,2027,2027,2027,2027,2027,2027,2027,2027,2027,2027,2027,2027,2027,2027,{"$f":"YEAR(DBA5)","v":2027},2027,2027,2027,2027,2027,2027,2027,2027,2027,2027,2027,2027,2027,2027,2027,2027,2027,2027,2027,2027,2027,2027,2027,2027,2027,2027,2027,2027,2027,2027,2027,2027,2027,2027,2027,2027,2027,2027,2027,2027,2027,2027,2027,2027,2027,2027,2027,2027,2027,2027,2027,2027,2027,2027,2027,2027,2027,2027,2027,2027,2027,2027,2027,{"$f":"YEAR(DDM5)","v":2027},2027,2027,2027,2027,2027,2027,2027,2027,2027,2027,2027,2027,2027,2027,2027,2027,2027,2027,2027,2027,2027,2027,2027,2027,2027,2027,2027,2027,2027,2027,2027,2027,2027,2027,2027,2027,2027,2027,2027,2027,2027,2027,2027,2027,2027,2027,2027,2027,2027,2027,2027,2027,2027,2027,2027,2027,2027,2027,2027,2027,2027,2027,2027,{"$f":"YEAR(DFY5)","v":2027},2027,2027,2027,2027,2027,2027,2027,2027,2027,2027,2027,2027,2027,2027,2027,2027,2027,2027,2027,2027,2027,2027,2027,2027,2027,2027,2027,2027,2027,2027,2027,2027,2027,2027,2027,2027,2027,2027,2027,2027,2028,2028,2028,2028,2028,2028,2028,2028,2028,2028,2028,2028,2028,2028,2028,2028,2028,2028,2028,2028,2028,2028,2028,{"$f":"YEAR(DIK5)","v":2028},2028,2028,2028,2028,2028,2028,2028,2028,2028,2028,2028,2028,2028,2028,2028,2028,2028,2028,2028,2028,2028,2028,2028,2028,2028,2028,2028,2028,2028,2028,2028,2028,2028,2028,2028,2028,2028,2028,2028,2028,2028,2028,2028,2028,2028,2028,2028,2028,2028,2028,2028,2028,2028,2028,2028,2028,2028,2028,2028,2028,2028,2028,2028,{"$f":"YEAR(DKW5)","v":2028},2028,2028,2028,2028,2028,2028,2028,2028,2028,2028,2028,2028,2028,2028,2028,2028,2028,2028,2028,2028,2028,2028,2028,2028,2028,2028,2028,2028,2028,2028,2028,2028,2028,2028,2028,2028,2028,2028,2028,2028,2028,2028,2028,2028,2028,2028,2028,2028,2028,2028,2028,2028,2028,2028,2028,2028,2028,2028,2028,2028,2028,2028,2028,{"$f":"YEAR(DNI5)","v":2028},2028,2028,2028,2028,2028,2028,2028,2028,2028,2028,2028,2028,2028,2028,2028,2028,2028,2028,2028,2028,2028,2028,2028,2028,2028,2028,2028,2028,2028,2028,2028,2028,2028,2028,2028,2028,2028,2028,2028,2028,2028,2028,2028,2028,2028,2028,2028,2028,2028,2028,2028,2028,2028,2028,2028,2028,2028,2028,2028,2028,2028,2028,2028,{"$f":"YEAR(DPU5)","v":2028},2028,2028,2028,2028,2028,2028,2028,2028,2028,2028,2028,2028,2028,2028,2028,2028,2028,2028,2028,2028,2028,2028,2028,2028,2028,2028,2028,2028,2028,2028,2028,2028,2028,2028,2028,2028,2028,2028,2028,2028,2028,2028,2028,2028,2028,2028,2028,2028,2028,2028,2028,2028,2028,2028,2028,2028,2028,2028,2028,2028,2028,2028,2028,{"$f":"YEAR(DSG5)","v":2028},2028,2028,2028,2028,2028,2028,2028,2028,2028,2028,2028,2028,2028,2028,2028,2028,2028,2028,2028,2028,2028,2028,2028,2028,2028,2028,2028,2028,2028,2028,2028,2028,2028,2028,2028,2028,2028,2028,2028,2028,2028,2028,2028,2028,2028,2028,2028,2028,2028,2028,2028,2028,2028,2028,2028,2028,2028,2028,2028,2028,2028,2028,2028,{"$f":"YEAR(DUS5)","v":2028},2028,2028,2028,2028,2028,2028,2028,2028,2028,2028,2028,2028,2028,2028,2028,2028,2028,2028,2028,2028,2028,2028,2029,2029,2029,2029,2029,2029,2029,2029,2029,2029,2029,2029,2029,2029,2029,2029,2029,2029,2029,2029,2029,2029,2029,2029,2029,2029,2029,2029,2029,2029,2029,2029,2029,2029,2029,2029,2029,2029,2029,2029,2029,{"$f":"YEAR(DXE5)","v":2029},2029,2029,2029,2029,2029,2029,2029,2029,2029,2029,2029,2029,2029,2029,2029,2029,2029,2029,2029,2029,2029,2029,2029,2029,2029,2029,2029,2029,2029,2029,2029,2029,2029,2029,2029,2029,2029,2029,2029,2029,2029,2029,2029,2029,2029,2029,2029,2029,2029,2029,2029,2029,2029,2029,2029,2029,2029,2029,2029,2029,2029,2029,2029,{"$f":"YEAR(DZQ5)","v":2029},2029,2029,2029,2029,2029,2029,2029,2029,2029,2029,2029,2029,2029,2029,2029,2029,2029,2029,2029,2029,2029,2029,2029,2029,2029,2029,2029,2029,2029,2029,2029,2029,2029,2029,2029,2029,2029,2029,2029,2029,2029,2029,2029,2029,2029,2029,2029,2029,2029,2029,2029,2029,2029,2029,2029,2029,2029,2029,2029,2029,2029,2029,2029,{"$f":"YEAR(ECC5)","v":2029},2029,2029,2029,2029,2029,2029,2029,2029,2029,2029,2029,2029,2029,2029,2029,2029,2029,2029,2029,2029,2029,2029,2029,2029,2029,2029,2029,2029,2029,2029,2029,2029,2029,2029,2029,2029,2029,2029,2029,2029,2029,2029,2029,2029,2029,2029,2029,2029,2029,2029,2029,2029,2029,2029,2029,2029,2029,2029,2029,2029,2029,2029,2029,{"$f":"YEAR(EEO5)","v":2029},2029,2029,2029,2029,2029,2029,2029,2029,2029,2029,2029,2029,2029,2029,2029,2029,2029,2029,2029,2029,2029,2029,2029,2029,2029,2029,2029,2029,2029,2029,2029,2029,2029,2029,2029,2029,2029,2029,2029,2029,2029,2029,2029,2029,2029,2029,2029,2029,2029,2029,2029,2029,2029,2029,2029,2029,2029,2029,2029,2029,2029,2029,2029,{"$f":"YEAR(EHA5)","v":2029},2029,2029,2029,2029,2029,2029,2029,2029,2029,2029,2029,2029,2029,2029,2029,2029,2029,2029,2029,2029,2029,2029,2029,2029,2029,2029,2029,2029,2029,2029,2029,2029,2029,2029,2029,2029,2029,2029,2029,2029,2029,2029,2029,2029,2029,2029,2029,2029,2029,2029,2029,2029,2029,2029,2029,2029,2029,2029,2029,2029,2029,2029,2029,{"$f":"YEAR(EJM5)","v":2029},2029,2029,2029,2030,2030,2030,2030,2030,2030,2030,2030,2030,2030,2030,2030,2030,2030,2030,2030,2030,2030,2030,2030,2030,2030,2030,2030,2030,2030,2030,2030,2030,2030,2030,2030,2030,2030,2030,2030,2030,2030,2030,2030,2030,2030,2030,2030,2030,2030,2030,2030,2030,2030,2030,2030,2030,2030,2030,2030,2030,2030,2030,2030,{"$f":"YEAR(ELY5)","v":2030},2030,2030,2030,2030,2030,2030,2030,2030,2030,2030,2030,2030,2030,2030,2030,2030,2030,2030,2030,2030,2030,2030,2030,2030,2030,2030,2030,2030,2030,2030,2030,2030,2030,2030,{"$f":"YEAR(ENH5)","v":2030},2030,2030,2030,2030,2030,2030,2030,2030,2030,2030,2030,2030,2030,2030,2030,2030,2030,2030,2030,2030,2030,2030,2030,2030,2030,2030,2030,2030,2030,2030,2030,2030,2030,2030,2030,2030,2030,2030,2030,2030,2030,2030,2030,2030,2030,2030,2030,2030,2030,2030,2030,2030,2030,2030,2030,2030,2030,2030,2030,2030,2030,2030,2030,{"$f":"YEAR(EPT5)","v":2030},2030,2030,2030,2030,2030,2030,2030,2030,2030,2030,2030,2030,2030,2030,2030,2030,2030,2030,2030,2030,2030,2030,2030,2030,2030,2030,2030,2030,2030,2030,2030,2030,2030,2030,2030,2030,2030,2030,2030,2030,2030,2030,2030,2030,2030,2030,2030,2030,2030,2030,2030,2030,2030,2030,2030,2030,2030,2030,2030,2030,2030,2030,2030,{"$f":"YEAR(ESF5)","v":2030},2030,2030,2030,2030,2030,2030,2030,2030,2030,2030,2030,2030,2030,2030,2030,2030,2030,2030,2030,2030,2030,2030,2030,2030,2030,2030,2030,2030,2030,2030,2030,2030,2030,2030,2030,2030,2030,2030,2030,2030,2030,2030,2030,2030,2030,2030,2030,2030,2030,2030,2030,2030,2030,2030,2030,2030,2030,2030,2030,2030,2030,2030,2030,{"$f":"YEAR(EUR5)","v":2030},2030,2030,2030,2030,2030,2030,2030,2030,2030,2030,2030,2030,2030,2030,2030,2030,2030,2030,2030,2030,2030,2030,2030,2030,2030,2030,2030,2030,2030,2030,2030,2030,2030,2030,2030,2030,2030,2030,2030,2030,2030,2030,2030,2030,2030,2030,2030,2030,2030,2030,2030,2030,2030,2030,2030,2030,2030,2030,2030,2030,2030,2030,2030,{"$f":"YEAR(EXD5)","v":2030},2030,2030,2030,2030,2030,2030,2030,2030,2030,2030,2030,2030,2030,2031,2031,2031,2031,2031,2031,2031,2031,2031,2031,2031,2031,2031,2031,2031,2031,2031,2031,2031,2031,2031,2031,2031,2031,2031,2031,2031,2031,2031,2031,2031,2031,2031,2031,2031,2031,2031,2031,2031,2031,2031,2031,2031,2031,2031,2031,2031,2031,2031,2031,{"$f":"YEAR(EZP5)","v":2031},2031,2031,2031,2031,2031,2031,2031,2031,2031,2031,2031,2031,2031,2031,2031,2031,2031,2031,2031,2031,2031,2031,2031,2031,2031,2031,2031,2031,2031,2031,2031,2031,2031,2031,2031,2031,2031,2031,2031,2031,2031,2031,2031,2031,2031,2031,2031,2031,2031,2031,2031,2031,2031,2031,2031,2031,2031,2031,2031,2031,2031,2031,2031,{"$f":"YEAR(FCB5)","v":2031},2031,2031,2031,2031,2031,2031,2031,2031,2031,2031,2031,2031,2031,2031,2031,2031,2031,2031,2031,2031,2031,2031,2031,2031,2031,2031,2031,2031,2031,2031,2031,2031,2031,2031,2031,2031,2031,2031,2031,2031,2031,2031,2031,2031,2031,2031,2031,2031,2031,2031,2031,2031,2031,2031,2031,2031,2031,2031,2031,2031,2031,2031,2031,{"$f":"YEAR(FEN5)","v":2031},2031,2031,2031,2031,2031,2031,2031,2031,2031,2031,2031,2031,2031,2031,2031,2031,2031,2031,2031,2031,2031,2031,2031,2031,2031,2031,2031,2031,2031,2031,2031,2031,2031,2031,2031,2031,2031,2031,2031,2031,2031,2031,2031,2031,2031,2031,2031,2031,2031,2031,2031,2031,2031,2031,2031,2031,2031,2031,2031,2031,2031,2031,2031,{"$f":"YEAR(FGZ5)","v":2031},2031,2031,2031,2031,2031,2031,2031,2031,2031,2031,2031,2031,2031,2031,2031,2031,2031,2031,2031,2031,2031,2031,2031,2031,2031,2031,2031,2031,2031,2031,2031,2031,2031,2031,2031,2031,2031,2031,2031,2031,2031,2031,2031,2031,2031,2031,2031,2031,2031,2031,2031,2031,2031,2031,2031,2031,2031,2031,2031,2031,2031,2031,2031,{"$f":"YEAR(FJL5)","v":2031},2031,2031,2031,2031,2031,2031,2031,2031,2031,2031,2031,2031,2031,2031,2031,2031,2031,2031,2031,2031,2031,2031,2031,2031,2031,2031,2031,2031,2031,2031,2031,2031,2031,2031,2031,2031,2031,2031,2031,2031,2031,2031,2031,2031,2031,2031,2031,2031,2031,2031,2031,2031,2031,2031,2031,2031,2031,2031,2032,2032,2032,2032,2032,{"$f":"YEAR(FLX5)","v":2032},2032,2032,2032,2032,2032,2032,2032,2032,2032,2032,2032,2032,2032,2032,2032,2032,2032,2032,2032,2032,2032,2032,2032,2032,2032,2032,2032,2032,2032,2032,2032,2032,2032,2032,2032,2032,2032,2032,2032,2032,2032,2032,2032,2032,2032,2032,2032,2032,2032,2032,2032,2032,2032,2032,2032,2032,2032,2032,2032,2032,2032,2032,2032,{"$f":"YEAR(FOJ5)","v":2032},2032,2032,2032,2032,2032,2032,2032,2032,2032,2032,2032,2032,2032,2032,2032,2032,2032,2032,2032,2032,2032,2032,2032,2032,2032,2032,2032,2032,2032,2032,2032,2032,2032,2032,2032,2032,2032,2032,2032,2032,2032,2032,2032,2032,2032,2032,2032,2032,2032,2032,2032,2032,2032,2032,2032,2032,2032,2032,2032,2032,2032,2032,2032,{"$f":"YEAR(FQV5)","v":2032},2032,2032,2032,2032,2032,2032,2032,2032,2032,2032,2032,2032,2032,2032,2032,2032,2032,2032,2032,2032,2032,2032,2032,2032,2032,2032,2032,2032,2032,2032,2032,2032,2032,2032,2032,2032,2032,2032,2032,2032,2032,2032,2032,2032,2032,2032,2032,2032,2032,2032,2032,2032,2032,2032,2032,2032,2032,2032,2032,2032,2032,2032,2032,{"$f":"YEAR(FTH5)","v":2032},2032,2032,2032,2032,2032,2032,2032,2032,2032,2032,2032,2032,2032,2032,2032,2032,2032,2032,2032,2032,2032,2032,2032,2032,2032,2032,2032,2032,2032,2032,2032,2032,2032,2032,2032,2032,2032,2032,2032,2032,2032,2032,2032,2032,2032,2032,2032,2032,2032,2032,2032,2032,2032,2032,2032,2032,2032,2032,2032,2032,2032,2032,2032,{"$f":"YEAR(FVT5)","v":2032},2032,2032,2032,2032,2032,2032,2032,2032,2032,2032,2032,2032,2032,2032,2032,2032,2032,2032,2032,2032,2032,2032,2032,2032,2032,2032,2032,2032,2032,2032,2032,2032,2032,2032,2032,2032,2032,2032,2032,2032,2032,2032,2032,2032,2032,2032,2032,2032,2032,2032,2032,2032,2032,2032,2032,2032,2032,2032,2032,2032,2032,2032,2032,{"$f":"YEAR(FYF5)","v":2032},2032,2032,2032,2032,2032,2032,2032,2032,2032,2032,2032,2032,2032,2032,2032,2032,2032,2032,2032,2032,2032,2032,2032,2032,2032,2032,2032,2032,2032,2032,2032,2032,2032,2032,2032,2032,2032,2032,2032,2032,2033,2033,2033,2033,2033,2033,2033,2033,2033,2033,2033,2033,2033,2033,2033,2033,2033,2033,2033,2033,2033,2033,2033,{"$f":"YEAR(GAR5)","v":2033},2033,2033,2033,2033,2033,2033,2033,2033,2033,2033,2033,2033,2033,2033,2033,2033,2033,2033,2033,2033,2033,2033,2033,2033,2033,2033,2033,2033,2033,2033,2033,2033,2033,2033,2033,2033,2033,2033,2033,2033,2033,2033,2033,2033,2033,2033,2033,2033,2033,2033,2033,2033,2033,2033,2033,2033,2033,2033,2033,2033,2033,2033,2033,{"$f":"YEAR(GDD5)","v":2033},2033,2033,2033,2033,2033,2033,2033,2033,2033,2033,2033,2033,2033,2033,2033,2033,2033,2033,2033,2033,2033,2033,2033,2033,2033,2033,2033,2033,2033,2033,2033,2033,2033,2033,2033,2033,2033,2033,2033,2033,2033,2033,2033,2033,2033,2033,2033,2033,2033,2033,2033,2033,2033,2033,2033,2033,2033,2033,2033,2033,2033,2033,2033,{"$f":"YEAR(GFP5)","v":2033},2033,2033,2033,2033,2033,2033,2033,2033,2033,2033,2033,2033,2033,2033,2033,2033,2033,2033,2033,2033,2033,2033,2033,2033,2033,2033,2033,2033,2033,2033,2033,2033,2033,2033,2033,2033,2033,2033,2033,2033,2033,2033,2033,2033,2033,2033,2033,2033,2033,2033,2033,2033,2033,2033,2033,2033,2033,2033,2033,2033,2033,2033,2033,{"$f":"YEAR(GIB5)","v":2033},2033,2033,2033,2033,2033,2033,2033,2033,2033,2033,2033,2033,2033,2033,2033,2033,2033,2033,2033,2033,2033,2033,2033,2033,2033,2033,2033,2033,2033,2033,2033,2033,2033,2033,2033,2033,2033,2033,2033,2033,2033,2033,2033,2033,2033,2033,2033,2033,2033,2033,2033,2033,2033,2033,2033,2033,2033,2033,2033,2033,2033,2033,2033,{"$f":"YEAR(GKN5)","v":2033},2033,2033,2033,2033,2033,2033,2033,2033,2033,2033,2033,2033,2033,2033,2033,2033,2033,2033,2033,2033,2033,2033,2033,2033,2033,2033,2033,2033,2033,2033,2033,2033,2033,2033,2033,2033,2033,2033,2033,2033,2033,2033,2033,2033,2033,2033,2033,2033,2033,2033,2033,2033,2033,2033,2033,2033,2033,2033,2033,2033,2033,2033,2033,{"$f":"YEAR(GMZ5)","v":2033},2033,2033,2033,2033,2033,2033,2033,2033,2033,2033,2033,2033,2033,2033,2033,2033,2033,2033,2033,2033,2033,2034,{"$f":"YEAR(GNW5)","v":2034},2034,2034,2034,2034,2034,2034,2034,2034,2034,2034,2034,2034,2034,2034,2034,2034,2034,2034,2034,2034,2034,2034,2034,2034,2034,2034,2034,2034,2034,2034,2034,2034,2034,2034,2034,2034,2034,2034,2034,2034,2034,2034,2034,2034,2034,2034,2034,2034,2034,2034,2034,2034,2034,2034,2034,2034,2034,2034,2034,2034,2034,2034,2034,{"$f":"YEAR(GQI5)","v":2034},2034,2034,2034,2034,2034,2034,2034,2034,2034,2034,2034,2034,2034,2034,2034,2034,2034,2034,2034,2034,2034,2034,2034,2034,2034,2034,2034,2034,2034,2034,2034,2034,2034,2034,2034,2034,2034,2034,2034,{"$f":"YEAR(GRW5)","v":2034},2034,2034,2034,2034,{"$f":"YEAR(GSB5)","v":2034},2034,2034,2034,2034,2034,2034,2034,2034,2034,2034,2034,2034,2034,2034,2034,2034,2034,2034,2034,2034,2034,2034,2034,2034,2034,2034,2034,2034,2034,2034,2034,2034,2034,2034,2034,2034,2034,2034,2034,2034,2034,2034,2034,2034,2034,2034,2034,2034,2034,2034,2034,2034,2034,2034,2034,2034,2034,2034,2034,2034,2034,2034,2034,{"$f":"YEAR(GUN5)","v":2034},2034,2034,2034,2034,2034,2034,2034,2034,2034,2034,2034,2034,2034,2034,2034,2034,2034,2034,2034,2034,2034,2034,2034,2034,2034,2034,2034,2034,2034,2034,2034,2034,2034,2034,2034,2034,2034,2034,2034,2034,2034,2034,2034,2034,2034,2034,2034,2034,2034,2034,2034,2034,2034,2034,2034,2034,2034,2034,2034,2034,2034,2034,2034,{"$f":"YEAR(GWZ5)","v":2034},2034,2034,2034,2034,2034,2034,2034,2034,2034,2034,2034,2034,2034,2034,2034,2034,2034,2034,2034,2034,2034,2034,2034,2034,2034,2034,2034,2034,2034,2034,2034,2034,2034,2034,2034,2034,2034,2034,2034,2034,2034,2034,2034,2034,2034,2034,2034,2034,2034,2034,2034,2034,2034,2034,2034,2034,2034,2034,2034,2034,2034,2034,2034,{"$f":"YEAR(GZL5)","v":2034},2034,2034,2034,2034,2034,2034,2034,2034,2034,2034,2034,2034,2034,2034,2034,2034,2034,2034,2034,2034,2034,2034,2034,2034,2034,2034,2034,2034,2034,2034,2034,2034,2034,2034,2034,2034,2034,2034,2034,2034,2034,2034,2034,2034,2034,2034,2034,2034,2034,2034,2034,2034,2034,2034,2034,2034,2034,2034,2034,2034,2034,2034,2035,{"$f":"YEAR(HBX5)","v":2035},2035,2035,2035,2035,2035,2035,2035,2035,2035,2035,2035,2035,2035,2035,2035,2035,2035,2035,2035,2035,2035,2035,2035,2035,2035,2035,2035,2035,2035,2035,2035,2035,2035,2035,2035,2035,2035,2035,2035,2035,2035,2035,2035,2035,2035,2035,2035,2035,2035,2035,2035,2035,2035,2035,2035,2035,2035,2035,2035,2035,2035,2035,2035,{"$f":"YEAR(HEJ5)","v":2035},2035,2035,2035,2035,2035,2035,2035,2035,2035,2035,2035,2035,2035,2035,2035,2035,2035,2035,2035,2035,2035,2035,2035,2035,2035,2035,2035,2035,2035,2035,2035,2035,2035,2035,2035,2035,2035,2035,2035,2035,2035,2035,2035,2035,2035,2035,2035,2035,2035,2035,2035,2035,2035,2035,2035,2035,2035,2035,2035,2035,2035,2035,2035,{"$f":"YEAR(HGV5)","v":2035},2035,2035,2035,2035,2035,2035,2035,2035,2035,2035,2035,2035,2035,2035,2035,2035,2035,2035,2035,2035,2035,2035,2035,2035,2035,2035,2035,2035,2035,2035,2035,2035,2035,2035,2035,2035,2035,2035,2035,2035,2035,2035,2035,2035,2035,2035,2035,2035,2035,2035,2035,2035,2035,2035,2035,2035,2035,2035,2035,2035,2035,2035,2035,{"$f":"YEAR(HJH5)","v":2035},2035,2035,2035,2035,2035,2035,2035,2035,2035,2035,2035,2035,2035,2035,2035,2035,2035,2035,2035,2035,2035,2035,2035,2035,2035,2035,2035,2035,2035,2035,2035,2035,2035,2035,2035,2035,2035,2035,2035,2035,2035,2035,2035,2035,2035,2035,2035,2035,2035,2035,2035,2035,2035,2035,2035,2035,2035,2035,2035,2035,2035,2035,2035,{"$f":"YEAR(HLT5)","v":2035},2035,2035,2035,2035,2035,2035,2035,2035,2035,2035,2035,2035,2035,2035,2035,2035,2035,2035,2035,2035,2035,2035,2035,2035,2035,2035,2035,2035,2035,2035,2035,2035,2035,2035,2035,2035,2035,2035,2035,2035,2035,2035,2035,2035,2035,2035,2035,2035,2035,2035,2035,2035,2035,2035,2035,2035,2035,2035,2035,2035,2035,2035,2035,{"$f":"YEAR(HOF5)","v":2035},2035,2035,2035,2035,2035,2035,2035,2035,2035,2035,2035,2035,2035,2035,2035,2035,2035,2035,2035,2035,2035,2035,2035,2035,2035,2035,2035,2035,2035,2035,2035,2035,2035,2035,2035,2035,2035,2035,2035,2035,2035,2035,2035,2036,2036,2036,2036,2036,2036,2036,2036,2036,2036,2036,2036,2036,2036,2036,2036,2036,2036,2036,2036,{"$f":"YEAR(HQR5)","v":2036},2036,2036,2036,2036,2036,2036,2036,2036,2036,2036,2036,2036,2036,2036,2036,2036,2036,2036,2036,2036,2036,2036,2036,2036,2036,2036,2036,2036,2036,2036,2036,2036,2036,2036,2036,2036,2036,2036,2036,2036,2036,2036,2036,2036,2036,2036,2036,2036,2036,2036,2036,2036,2036,2036,2036,2036,2036,2036,2036,2036,2036,2036,2036,{"$f":"YEAR(HTD5)","v":2036},2036,2036,2036,2036,2036,2036,2036,2036,2036,2036,2036,2036,2036,2036,2036,2036,2036,2036,2036,2036,2036,2036,2036,2036,2036,2036,2036,2036,2036,2036,2036,2036,2036,2036,2036,2036,2036,2036,2036,2036,2036,2036,2036,2036,2036,2036,2036,2036,2036,2036,2036,2036,2036,2036,2036,2036,2036,2036,2036,2036,2036,2036,2036,{"$f":"YEAR(HVP5)","v":2036},2036,2036,2036,2036,2036,2036,2036,2036,2036,2036,2036,2036,2036,2036,2036,2036,2036,2036,2036,2036,2036,2036,2036,2036,2036,2036,2036,2036,2036,2036,2036,2036,2036,2036,2036,2036,2036,2036,2036,2036,2036,2036,2036,2036,2036,2036,2036,2036,2036,2036,2036,2036,2036,2036,2036,2036,2036,2036,2036,2036,2036,2036,2036,{"$f":"YEAR(HYB5)","v":2036},2036,2036,2036,2036,2036,2036,2036,2036,2036,2036,2036,2036,2036,2036,2036,2036,2036,2036,2036,2036,2036,2036,2036,2036,2036,2036,2036,2036,2036,2036,2036,2036,2036,2036,2036,2036,2036,2036,2036,2036,2036,2036,2036,2036,2036,2036,2036,2036,2036,2036,2036,2036,2036,2036,2036,2036,2036,2036,2036,2036,2036,2036,2036,{"$f":"YEAR(IAN5)","v":2036},2036,2036,2036,2036,2036,2036,2036,2036,2036,2036,2036,2036,2036,2036,2036,2036,2036,2036,2036,2036,2036,2036,2036,2036,2036,2036,2036,2036,2036,2036,2036,2036,2036,2036,2036,2036,2036,2036,2036,2036,2036,2036,2036,2036,2036,2036,2036,2036,2036,2036,2036,2036,2036,2036,2036,2036,2036,2036,2036,2036,2036,2036,2036,{"$f":"YEAR(ICZ5)","v":2036},2036,2036,2036,2036,2036,2036,2036,2036,2036,2036,2036,2036,2036,2036,2036,2036,2036,2036,2036,2036,2036,2036,2036,2036,2036,2037,2037,2037,2037,2037,2037,2037,2037,2037,2037,2037,2037,2037,2037,2037,2037,2037,2037,2037,2037,2037,2037,2037,2037,2037,2037,2037,2037,2037,2037,2037,2037,2037,2037,2037,2037,2037,2037,{"$f":"YEAR(IFL5)","v":2037},2037,2037,2037,2037,2037,2037,2037,2037,2037,2037,2037,2037,2037,2037,2037,2037,2037,2037,2037,2037,2037,2037,2037,2037,2037,2037,2037,2037,2037,2037,2037,2037,2037,2037,2037,2037,2037,2037,2037,2037,2037,2037,2037,2037,2037,2037,2037,2037,2037,2037,2037,2037,2037,2037,2037,2037,2037,2037,2037,2037,2037,2037,2037,{"$f":"YEAR(IHX5)","v":2037},2037,2037,2037,2037,2037,2037,2037,2037,2037,2037,2037,2037,2037,2037,2037,2037,2037,2037,2037,2037,2037,2037,2037,2037,2037,2037,2037,2037,2037,2037,2037,2037,2037,2037,2037,2037,2037,2037,2037,2037,2037,2037,2037,2037,2037,2037,2037,2037,2037,2037,2037,2037,2037,2037,2037,2037,2037,2037,2037,2037,2037,2037,2037,{"$f":"YEAR(IKJ5)","v":2037},2037,2037,2037,2037,2037,2037,2037,2037,2037,2037,2037,2037,2037,2037,2037,2037,2037,2037,2037,2037,2037,2037,2037,2037,2037,2037,2037,2037,2037,2037,2037,2037,2037,2037,2037,2037,2037,2037,2037,2037,2037,2037,2037,2037,2037,2037,2037,2037,2037,2037,2037,2037,2037,2037,2037,2037,2037,2037,2037,2037,2037,2037,2037,{"$f":"YEAR(IMV5)","v":2037},2037,2037,2037,2037,2037,2037,2037,2037,2037,2037,2037,2037,2037,2037,2037,2037,2037,2037,2037,2037,2037,2037,2037,2037,2037,2037,2037,2037,2037,2037,2037,2037,2037,2037,2037,2037,2037,2037,2037,2037,2037,2037,2037,2037,2037,2037,2037,2037,2037,2037,2037,2037,2037,2037,2037,2037,2037,2037,2037,2037,2037,2037,2037,{"$f":"YEAR(IPH5)","v":2037},2037,2037,2037,2037,2037,2037,2037,2037,2037,2037,2037,2037,2037,2037,2037,2037,2037,2037,2037,2037,2037,2037,2037,2037,2037,2037,2037,2037,2037,2037,2037,2037,2037,2037,2037,2037,2037,2037,2037,2037,2037,2037,2037,2037,2037,2037,2037,2037,2037,2037,2037,2037,2037,2037,2037,2037,2037,2037,2037,2037,2037,2037,2037,{"$f":"YEAR(IRT5)","v":2037},2037,2037,2037,2037,2037,2037,2038,2038,2038,2038,2038,2038,2038,2038,2038,2038,2038,2038,2038,2038,2038,2038,2038,2038,2038,2038,2038,2038,2038,2038,2038,2038,2038,2038,2038,2038,2038,2038,2038,2038,2038,2038,2038,2038,2038,2038,2038,2038,2038,2038,2038,2038,2038,2038,2038,2038,2038,2038,2038,2038,2038,2038,2038,{"$f":"YEAR(IUF5)","v":2038},2038,2038,2038,2038,2038,2038,2038,2038,2038,2038,2038,2038,2038,2038,2038,2038,2038,2038,2038,2038,2038,2038,2038,2038,2038,2038,2038,2038,2038,2038,2038,2038,2038,2038,2038,2038,2038,2038,2038,2038,2038,2038,2038,2038,2038,2038,2038,2038,2038,2038,2038,2038,2038,2038,2038,2038,2038,2038,2038,2038,2038,2038,2038,{"$f":"YEAR(IWR5)","v":2038},2038,2038,2038,2038,2038,2038,2038,2038,2038,2038,2038,2038,2038,2038,2038,2038,2038,2038,2038,2038,2038,2038,2038,2038,2038,2038,2038,2038,2038,2038,2038,2038,2038,2038,2038,2038,2038,2038,2038,2038,2038,2038,2038,2038,2038,2038,2038,2038,2038,2038,2038,2038,2038,2038,2038,2038,2038,2038,2038,2038,2038,2038,2038,{"$f":"YEAR(IZD5)","v":2038},2038,2038,2038,2038,2038,2038,2038,2038,2038,2038,2038,2038,2038,2038,2038,2038,2038,2038,2038,2038,2038,2038,2038,2038,2038,2038,2038,2038,2038,2038,2038,2038,2038,2038,2038,2038,2038,2038,2038,2038,2038,2038,2038,2038,2038,2038,2038,2038,2038,2038,2038,2038,2038,2038,2038,2038,2038,2038,2038,2038,2038,2038,2038,{"$f":"YEAR(JBP5)","v":2038},2038,2038,2038,2038,2038,2038,2038,2038,2038,2038,2038,2038,2038,2038,2038,2038,2038,2038,2038,2038,2038,2038,2038,2038,2038,2038,2038,2038,2038,2038,2038,2038,2038,2038,2038,2038,2038,2038,2038,2038,2038,2038,2038,2038,2038,2038,2038,2038,2038,2038,2038,2038,2038,2038,2038,2038,2038,2038,2038,2038,2038,2038,2038,{"$f":"YEAR(JEB5)","v":2038},2038,2038,2038,2038,2038,2038,2038,2038,2038,2038,2038,2038,2038,2038,2038,2038,2038,2038,2038,2038,2038,2038,2038,2038,2038,2038,2038,2038,2038,2038,2038,2038,2038,2038,2038,2038,2038,2038,2038,2038,2038,2038,2038,2038,2038,2038,2038,2038,2038,2038,2038,2039,2039,2039,2039,2039,2039,2039,2039,2039,2039,2039,2039,{"$f":"YEAR(JGN5)","v":2039},2039,2039,2039,2039,2039,2039,2039,2039,2039,2039,2039,2039,2039,2039,2039,2039,2039,2039,2039,2039,2039,2039,2039,2039,2039,2039,2039,2039,2039,2039,2039,2039,2039,2039,2039,2039,2039,2039,2039,2039,2039,2039,2039,2039,2039,2039,2039,2039,2039,2039,2039,2039,2039,2039,2039,2039,2039,2039,2039,2039,2039,2039,2039,{"$f":"YEAR(JIZ5)","v":2039},2039,2039,2039,2039,2039,2039,2039,2039,2039,2039,2039,2039,2039,2039,2039,2039,2039,2039,2039,2039,2039,2039,2039,2039,2039,2039,2039,2039,2039,2039,2039,2039,2039,2039,2039,2039,2039,2039,2039,2039,2039,2039,2039,2039,2039,2039,2039,2039,2039,2039,2039,2039,2039,2039,2039,2039,2039,2039,2039,2039,2039,2039,2039,{"$f":"YEAR(JLL5)","v":2039},2039,2039,2039,2039,2039,2039,2039,2039,2039,2039,2039,2039,2039,2039,2039,2039,2039,2039,2039,2039,2039,2039,2039,2039,2039,2039,2039,2039,2039,2039,2039,2039,2039,2039,2039,2039,2039,2039,2039,2039,2039,2039,2039,2039,2039,2039,2039,2039,2039,2039,2039,2039,2039,2039,2039,2039,2039,2039,2039,2039,2039,2039,2039,{"$f":"YEAR(JNX5)","v":2039},2039,2039,2039,2039,2039,2039,2039,2039,2039,2039,2039,2039,2039,2039,2039,2039,2039,2039,2039,2039,2039,2039,2039,2039,2039,2039,2039,2039,2039,2039,2039,2039,2039,2039,2039,2039,2039,2039,2039,2039,2039,2039,2039,2039,2039,2039,2039,2039,2039,2039,2039,2039,2039,2039,2039,2039,2039,2039,2039,2039,2039,2039,2039,{"$f":"YEAR(JQJ5)","v":2039},2039,2039,2039,2039,2039,2039,2039,2039,2039,2039,2039,2039,2039,2039,2039,2039,2039,2039,2039,2039,2039,2039,2039,2039,2039,2039,2039,2039,2039,2039,2039,2039,2039,2039,2039,2039,2039,2039,2039,2039,2039,2039,2039,2039,2039,2039,2039,2039,2039,2039,2039,2039,2039,2039,2039,2039,2039,2039,2039,2039,2039,2039,2039,{"$f":"YEAR(JSV5)","v":2039},2039,2039,2039,2039,2039,2039,2039,2039,2039,2039,2039,2039,2039,2039,2039,2039,2039,2039,2039,2039,2039,2039,2039,2039,2039,2039,2039,2039,2039,2039,2039,2039,2040]
[{"$nulls":3},{"$f":"CHOOSE(MONTH(D5),\"janvier\",\"février\",\"mars\",\"avril\",\"mai\",\"juin\",\"juillet\",\"aout\",\"septembre\",\"octobre\",\"novembre\",\"décembre\")","v":"janvier"},{"$f":"CHOOSE(MONTH(E5),\"janvier\",\"février\",\"mars\",\"avril\",\"mai\",\"juin\",\"juillet\",\"aout\",\"septembre\",\"octobre\",\"novembre\",\"décembre\")","v":"janvier"},"janvier","janvier","janvier","janvier","janvier","janvier","janvier","janvier","janvier","janvier","janvier","janvier","janvier","janvier","janvier","janvier","janvier","janvier","janvier","janvier","janvier","janvier","janvier","janvier","janvier","janvier","janvier","janvier","janvier","février","février","février","février","février","février","février","février","février","février","février","février","février","février","février","février","février","février","février","février","février","février","février","février","février","février","février","février","février","mars","mars","mars","mars","mars",{"$f":"CHOOSE(MONTH(BQ5),\"janvier\",\"février\",\"mars\",\"avril\",\"mai\",\"juin\",\"juillet\",\"aout\",\"septembre\",\"octobre\",\"novembre\",\"décembre\")","v":"mars"},"mars","mars","mars","mars","mars","mars","mars","mars","mars","mars","mars","mars","mars","mars","mars","mars","mars","mars","mars","mars","mars","mars","mars","mars","mars","avril","avril","avril","avril","avril","avril","avril","avril","avril","avril","avril","avril","avril","avril","avril","avril","avril","avril","avril","avril","avril","avril","avril","avril","avril","avril","avril","avril","avril","avril","mai","mai","mai","mai","mai","mai","mai","mai",{"$f":"CHOOSE(MONTH(EC5),\"janvier\",\"février\",\"mars\",\"avril\",\"mai\",\"juin\",\"juillet\",\"aout\",\"septembre\",\"octobre\",\"novembre\",\"décembre\")","v":"mai"},"mai","mai","mai","mai","mai","mai","mai","mai","mai","mai","mai","mai","mai","mai","mai","mai","mai","mai","mai","mai","mai","mai","juin","juin","juin","juin","juin","juin","juin","juin","juin","juin","juin","juin","juin","juin","juin","juin","juin","juin","juin","juin","juin","juin","juin","juin","juin","juin","juin","juin","juin","juin","juillet","juillet","juillet","juillet","juillet","juillet","juillet","juillet","juillet","juillet","juillet",{"$f":"CHOOSE(MONTH(GO5),\"janvier\",\"février\",\"mars\",\"avril\",\"mai\",\"juin\",\"juillet\",\"aout\",\"septembre\",\"octobre\",\"novembre\",\"décembre\")","v":"juillet"},"juillet","juillet","juillet","juillet","juillet","juillet","juillet","juillet","juillet","juillet","juillet","juillet","juillet","juillet","juillet","juillet","juillet","juillet","juillet","aout","aout","aout","aout","aout","aout","aout","aout","aout","aout","aout","aout","aout","aout","aout","aout","aout","aout","aout","aout","aout","aout","aout","aout","aout","aout","aout","aout","aout","aout","aout","septembre","septembre","septembre","septembre","septembre","septembre","septembre","septembre","septembre","septembre","septembre","septembre","septembre",{"$f":"CHOOSE(MONTH(JA5),\"janvier\",\"février\",\"mars\",\"avril\",\"mai\",\"juin\",\"juillet\",\"aout\",\"septembre\",\"octobre\",\"novembre\",\"décembre\")","v":"septembre"},"septembre","septembre","septembre","septembre","septembre","septembre","septembre","septembre","septembre","septembre","septembre","septembre","septembre","septembre","septembre","septembre","octobre","octobre","octobre","octobre","octobre","octobre","octobre","octobre","octobre","octobre","octobre","octobre","octobre","octobre","octobre","octobre","octobre","octobre","octobre","octobre","octobre","octobre","octobre","octobre","octobre","octobre","octobre","octobre","octobre","octobre","octobre","novembre","novembre","novembre","novembre","novembre","novembre","novembre","novembre","novembre","novembre","novembre","novembre","novembre","novembre","novembre","novembre",{"$f":"CHOOSE(MONTH(LM5),\"janvier\",\"février\",\"mars\",\"avril\",\"mai\",\"juin\",\"juillet\",\"aout\",\"septembre\",\"octobre\",\"novembre\",\"décembre\")","v":"novembre"},"novembre","novembre","novembre","novembre","novembre","novembre","novembre","novembre","novembre","novembre","novembre","novembre","novembre","décembre","décembre","décembre","décembre","décembre","décembre","décembre","décembre","décembre","décembre","décembre","décembre","décembre","décembre","décembre","décembre","décembre","décembre","décembre","décembre","décembre","décembre","décembre","décembre","décembre","décembre","décembre","décembre","décembre","décembre","décembre","janvier","janvier","janvier","janvier","janvier","janvier","janvier","janvier","janvier","janvier","janvier","janvier","janvier","janvier","janvier","janvier","janvier","janvier","janvier",{"$f":"CHOOSE(MONTH(NY5),\"janvier\",\"février\",\"mars\",\"avril\",\"mai\",\"juin\",\"juillet\",\"aout\",\"septembre\",\"octobre\",\"novembre\",\"décembre\")","v":"janvier"},"janvier","janvier","janvier","janvier","janvier","janvier","janvier","janvier","janvier","janvier","janvier","février","février","février","février","février","février","février","février","février","février","février","février","février","février","février","février","février","février","février","février","février","février","février","février","février","février","février","février","mars","mars","mars","mars","mars","mars","mars","mars","mars","mars","mars","mars","mars","mars","mars","mars","mars","mars","mars","mars","mars","mars","mars","mars",{"$f":"CHOOSE(MONTH(QK5),\"janvier\",\"février\",\"mars\",\"avril\",\"mai\",\"juin\",\"juillet\",\"aout\",\"septembre\",\"octobre\",\"novembre\",\"décembre\")","v":"mars"},"mars","mars","mars","mars","mars","mars","avril","avril","avril","avril","avril","avril","avril","avril","avril","avril","avril","avril","avril","avril","avril","avril","avril","avril","avril","avril","avril","avril","avril","avril","avril","avril","avril","avril","avril","avril","mai","mai","mai","mai","mai","mai","mai","mai","mai","mai","mai","mai","mai","mai","mai","mai","mai","mai","mai","mai","mai","mai","mai","mai","mai","mai","mai",{"$f":"CHOOSE(MONTH(SW5),\"janvier\",\"février\",\"mars\",\"avril\",\"mai\",\"juin\",\"juillet\",\"aout\",\"septembre\",\"octobre\",\"novembre\",\"décembre\")","v":"mai"},"mai","mai","mai","juin","juin","juin","juin","juin","juin","juin","juin","juin","juin","juin","juin","juin","juin","juin","juin","juin","juin","juin","juin","juin","juin","juin","juin","juin","juin","juin","juin","juin","juin","juillet","juillet","juillet","juillet","juillet","juillet","juillet","juillet","juillet","juillet","juillet","juillet","juillet","juillet","juillet","juillet","juillet","juillet","juillet","juillet","juillet","juillet","juillet","juillet","juillet","juillet","juillet","juillet","juillet","juillet",{"$f":"CHOOSE(MONTH(VI5),\"janvier\",\"février\",\"mars\",\"avril\",\"mai\",\"juin\",\"juillet\",\"aout\",\"septembre\",\"octobre\",\"novembre\",\"décembre\")","v":"juillet"},"aout","aout","aout","aout","aout","aout","aout","aout","aout","aout","aout","aout","aout","aout","aout","aout","aout","aout","aout","aout","aout","aout","aout","aout","aout","aout","aout","aout","aout","aout","aout","septembre","septembre","septembre","septembre","septembre","septembre","septembre","septembre","septembre","septembre","septembre","septembre","septembre","septembre","septembre","septembre","septembre","septembre","septembre","septembre","septembre","septembre","septembre","septembre","septembre","septembre","septembre","septembre","septembre","septembre","octobre","octobre",{"$f":"CHOOSE(MONTH(XU5),\"janvier\",\"février\",\"mars\",\"avril\",\"mai\",\"juin\",\"juillet\",\"aout\",\"septembre\",\"octobre\",\"novembre\",\"décembre\")","v":"octobre"},"octobre","octobre","octobre","octobre","octobre","octobre","octobre","octobre","octobre","octobre","octobre","octobre","octobre","octobre","octobre","octobre","octobre","octobre","octobre","octobre","octobre","octobre","octobre","octobre","octobre","octobre","octobre","octobre","novembre","novembre","novembre","novembre","novembre","novembre","novembre","novembre","novembre","novembre","novembre","novembre","novembre","novembre","novembre","novembre","novembre","novembre","novembre","novembre","novembre","novembre","novembre","novembre","novembre","novembre","novembre","novembre","novembre","novembre","décembre","décembre","décembre","décembre","décembre",{"$f":"CHOOSE(MONTH(AAG5),\"janvier\",\"février\",\"mars\",\"avril\",\"mai\",\"juin\",\"juillet\",\"aout\",\"septembre\",\"octobre\",\"novembre\",\"décembre\")","v":"décembre"},"décembre","décembre","décembre","décembre","décembre","décembre","décembre","décembre","décembre","décembre","décembre","décembre","décembre","décembre","décembre","décembre","décembre","décembre","décembre","décembre","décembre","décembre","décembre","décembre","décembre","janvier","janvier","janvier","janvier","janvier","janvier","janvier","janvier","janvier","janvier","janvier","janvier","janvier","janvier","janvier","janvier","janvier","janvier","janvier","janvier","janvier","janvier","janvier","janvier","janvier","janvier","janvier","janvier","janvier","janvier","janvier","février","février","février","février","février","février","février",{"$f":"CHOOSE(MONTH(ACS5),\"janvier\",\"février\",\"mars\",\"avril\",\"mai\",\"juin\",\"juillet\",\"aout\",\"septembre\",\"octobre\",\"novembre\",\"décembre\")","v":"février"},"février","février","février","février","février","février","février","février","février","février","février","février","février","février","février","février","février","février","février","février","mars","mars","mars","mars","mars","mars","mars","mars","mars","mars","mars","mars","mars","mars","mars","mars","mars","mars","mars","mars","mars","mars","mars","mars","mars","mars","mars","mars","mars","mars","mars","avril","avril","avril","avril","avril","avril","avril","avril","avril","avril","avril","avril",{"$f":"CHOOSE(MONTH(AFE5),\"janvier\",\"février\",\"mars\",\"avril\",\"mai\",\"juin\",\"juillet\",\"aout\",\"septembre\",\"octobre\",\"novembre\",\"décembre\")","v":"avril"},"avril","avril","avril","avril","avril","avril","avril","avril","avril","avril","avril","avril","avril","avril","avril","avril","avril","mai","mai","mai","mai","mai","mai","mai","mai","mai","mai","mai","mai","mai","mai","mai","mai","mai","mai","mai","mai","mai","mai","mai","mai","mai","mai","mai","mai","mai","mai","mai","juin","juin","juin","juin","juin","juin","juin","juin","juin","juin","juin","juin","juin","juin","juin",{"$f":"CHOOSE(MONTH(AHQ5),\"janvier\",\"février\",\"mars\",\"avril\",\"mai\",\"juin\",\"juillet\",\"aout\",\"septembre\",\"octobre\",\"novembre\",\"décembre\")","v":"juin"},"juin","juin","juin","juin","juin","juin","juin","juin","juin","juin","juin","juin","juin","juin","juillet","juillet","juillet","juillet","juillet","juillet","juillet","juillet","juillet","juillet","juillet","juillet","juillet","juillet","juillet","juillet","juillet","juillet","juillet","juillet","juillet","juillet","juillet","juillet","juillet","juillet","juillet","juillet","juillet","juillet","juillet","aout","aout","aout","aout","aout","aout","aout","aout","aout","aout","aout","aout","aout","aout","aout","aout","aout","aout",{"$f":"CHOOSE(MONTH(AKC5),\"janvier\",\"février\",\"mars\",\"avril\",\"mai\",\"juin\",\"juillet\",\"aout\",\"septembre\",\"octobre\",\"novembre\",\"décembre\")","v":"aout"},"aout","aout","aout","aout","aout","aout","aout","aout","aout","aout","aout","aout","septembre","septembre","septembre","septembre","septembre","septembre","septembre","septembre","septembre","septembre","septembre","septembre","septembre","septembre","septembre","septembre","septembre","septembre","septembre","septembre","septembre","septembre","septembre","septembre","septembre","septembre","septembre","septembre","septembre","septembre","octobre","octobre","octobre","octobre","octobre","octobre","octobre","octobre","octobre","octobre","octobre","octobre","octobre","octobre","octobre","octobre","octobre","octobre","octobre","octobre","octobre",{"$f":"CHOOSE(MONTH(AMO5),\"janvier\",\"février\",\"mars\",\"avril\",\"mai\",\"juin\",\"juillet\",\"aout\",\"septembre\",\"octobre\",\"novembre\",\"décembre\")","v":"octobre"},"octobre","octobre","octobre","octobre","octobre","octobre","octobre","octobre","octobre","novembre","novembre","novembre","novembre","novembre","novembre","novembre","novembre","novembre","novembre","novembre","novembre","novembre","novembre","novembre","novembre","novembre","novembre","novembre","novembre","novembre","novembre","novembre","novembre","novembre","novembre","novembre","novembre","novembre","novembre","décembre","décembre","décembre","décembre","décembre","décembre","décembre","décembre","décembre","décembre","décembre","décembre","décembre","décembre","décembre","décembre","décembre","décembre","décembre","décembre","décembre","décembre","décembre","décembre",{"$f":"CHOOSE(MONTH(APA5),\"janvier\",\"février\",\"mars\",\"avril\",\"mai\",\"juin\",\"juillet\",\"aout\",\"septembre\",\"octobre\",\"novembre\",\"décembre\")","v":"décembre"},"décembre","décembre","décembre","décembre","décembre","décembre","janvier","janvier","janvier","janvier","janvier","janvier","janvier","janvier","janvier","janvier","janvier","janvier","janvier","janvier","janvier","janvier","janvier","janvier","janvier","janvier","janvier","janvier","janvier","janvier","janvier","janvier","janvier","janvier","janvier","janvier","janvier","février","février","février","février","février","février","février","février","février","février","février","février","février","février","février","février","février","février","février","février","février","février","février","février","février","février",{"$f":"CHOOSE(MONTH(ARM5),\"janvier\",\"février\",\"mars\",\"avril\",\"mai\",\"juin\",\"juillet\",\"aout\",\"septembre\",\"octobre\",\"novembre\",\"décembre\")","v":"février"},"février","mars","mars","mars","mars","mars","mars","mars","mars","mars","mars","mars","mars","mars","mars","mars","mars","mars","mars","mars","mars","mars","mars","mars","mars","mars","mars","mars","mars","mars","mars","mars","avril","avril","avril","avril","avril","avril","avril","avril","avril","avril","avril","avril","avril","avril","avril","avril","avril","avril","avril","avril","avril","avril","avril","avril","avril","avril","avril","avril","avril","avril","mai",{"$f":"CHOOSE(MONTH(ATY5),\"janvier\",\"février\",\"mars\",\"avril\",\"mai\",\"juin\",\"juillet\",\"aout\",\"septembre\",\"octobre\",\"novembre\",\"décembre\")","v":"mai"},"mai","mai","mai","mai","mai","mai","mai","mai","mai","mai","mai","mai","mai","mai","mai","mai","mai","mai","mai","mai","mai","mai","mai","mai","mai","mai","mai","mai","mai","juin","juin","juin","juin","juin","juin","juin","juin","juin","juin","juin","juin","juin","juin","juin","juin","juin","juin","juin","juin","juin","juin","juin","juin","juin","juin","juin","juin","juin","juin","juillet","juillet","juillet","juillet",{"$f":"CHOOSE(MONTH(AWK5),\"janvier\",\"février\",\"mars\",\"avril\",\"mai\",\"juin\",\"juillet\",\"aout\",\"septembre\",\"octobre\",\"novembre\",\"décembre\")","v":"juillet"},"juillet","juillet","juillet","juillet","juillet","juillet","juillet","juillet","juillet","juillet","juillet","juillet","juillet","juillet","juillet","juillet","juillet","juillet","juillet","juillet","juillet","juillet","juillet","juillet","juillet","juillet","aout","aout","aout","aout","aout","aout","aout","aout","aout","aout","aout","aout","aout","aout","aout","aout","aout","aout","aout","aout","aout","aout","aout","aout","aout","aout","aout","aout","aout","aout","aout","septembre","septembre","septembre","septembre","septembre","septembre",{"$f":"CHOOSE(MONTH(AYW5),\"janvier\",\"février\",\"mars\",\"avril\",\"mai\",\"juin\",\"juillet\",\"aout\",\"septembre\",\"octobre\",\"novembre\",\"décembre\")","v":"septembre"},"septembre","septembre","septembre","septembre","septembre","septembre","septembre","septembre","septembre","septembre","septembre","septembre","septembre","septembre","septembre","septembre","septembre","septembre","septembre","septembre","septembre","septembre","septembre","octobre","octobre","octobre","octobre","octobre","octobre","octobre","octobre","octobre","octobre","octobre","octobre","octobre","octobre","octobre","octobre","octobre","octobre","octobre","octobre","octobre","octobre","octobre","octobre","octobre","octobre","octobre","octobre","octobre","octobre","octobre","novembre","novembre","novembre","novembre","novembre","novembre","novembre","novembre","novembre",{"$f":"CHOOSE(MONTH(BBI5),\"janvier\",\"février\",\"mars\",\"avril\",\"mai\",\"juin\",\"juillet\",\"aout\",\"septembre\",\"octobre\",\"novembre\",\"décembre\")","v":"novembre"},"novembre","novembre","novembre","novembre","novembre","novembre","novembre","novembre","novembre","novembre","novembre","novembre","novembre","novembre","novembre","novembre","novembre","novembre","novembre","novembre","décembre","décembre","décembre","décembre","décembre","décembre","décembre","décembre","décembre","décembre","décembre","décembre","décembre","décembre","décembre","décembre","décembre","décembre","décembre","décembre","décembre","décembre","décembre","décembre","décembre","décembre","décembre","décembre","décembre","décembre","décembre","janvier","janvier","janvier","janvier","janvier","janvier","janvier","janvier","janvier","janvier","janvier","janvier",{"$f":"CHOOSE(MONTH(BDU5),\"janvier\",\"février\",\"mars\",\"avril\",\"mai\",\"juin\",\"juillet\",\"aout\",\"septembre\",\"octobre\",\"novembre\",\"décembre\")","v":"janvier"},"janvier","janvier","janvier","janvier","janvier","janvier","janvier","janvier","janvier","janvier","janvier","janvier","janvier","janvier","janvier","janvier","janvier","janvier","février","février","février","février","février","février","février","février","février","février","février","février","février","février","février","février","février","février","février","février","février","février","février","février","février","février","février","février","février","mars","mars","mars","mars","mars","mars","mars","mars","mars","mars","mars","mars","mars","mars","mars","mars",{"$f":"CHOOSE(MONTH(BGG5),\"janvier\",\"février\",\"mars\",\"avril\",\"mai\",\"juin\",\"juillet\",\"aout\",\"septembre\",\"octobre\",\"novembre\",\"décembre\")","v":"mars"},"mars","mars","mars","mars","mars","mars","mars","mars","mars","mars","mars","mars","mars","mars","avril","avril","avril","avril","avril","avril","avril","avril","avril","avril","avril","avril","avril","avril","avril","avril","avril","avril","avril","avril","avril","avril","avril","avril","avril","avril","avril","avril","avril","avril","mai","mai","mai","mai","mai","mai","mai","mai","mai","mai","mai","mai","mai","mai","mai","mai","mai","mai","mai",{"$f":"CHOOSE(MONTH(BIS5),\"janvier\",\"février\",\"mars\",\"avril\",\"mai\",\"juin\",\"juillet\",\"aout\",\"septembre\",\"octobre\",\"novembre\",\"décembre\")","v":"mai"},"mai","mai","mai","mai","mai","mai","mai","mai","mai","mai","mai","juin","juin","juin","juin","juin","juin","juin","juin","juin","juin","juin","juin","juin","juin","juin","juin","juin","juin","juin","juin","juin","juin","juin","juin","juin","juin","juin","juin","juin","juin","juillet","juillet","juillet","juillet","juillet","juillet","juillet","juillet","juillet","juillet","juillet","juillet","juillet","juillet","juillet","juillet","juillet","juillet","juillet","juillet","juillet","juillet",{"$f":"CHOOSE(MONTH(BLE5),\"janvier\",\"février\",\"mars\",\"avril\",\"mai\",\"juin\",\"juillet\",\"aout\",\"septembre\",\"octobre\",\"novembre\",\"décembre\")","v":"juillet"},"juillet","juillet","juillet","juillet","juillet","juillet","juillet","juillet","aout","aout","aout","aout","aout","aout","aout","aout","aout","aout","aout","aout","aout","aout","aout","aout","aout","aout","aout","aout","aout","aout","aout","aout","aout","aout","aout","aout","aout","aout","aout","septembre","septembre","septembre","septembre","septembre","septembre","septembre","septembre","septembre","septembre","septembre","septembre","septembre","septembre","septembre","septembre","septembre","septembre","septembre","septembre","septembre","septembre","septembre","septembre",{"$f":"CHOOSE(MONTH(BNQ5),\"janvier\",\"février\",\"mars\",\"avril\",\"mai\",\"juin\",\"juillet\",\"aout\",\"septembre\",\"octobre\",\"novembre\",\"décembre\")","v":"septembre"},"septembre","septembre","septembre","septembre","septembre","octobre","octobre","octobre","octobre","octobre","octobre","octobre","octobre","octobre","octobre","octobre","octobre","octobre","octobre","octobre","octobre","octobre","octobre","octobre","octobre","octobre","octobre","octobre","octobre","octobre","octobre","octobre","octobre","octobre","octobre","octobre","novembre","novembre","novembre","novembre","novembre","novembre","novembre","novembre","novembre","novembre","novembre","novembre","novembre","novembre","novembre","novembre","novembre","novembre","novembre","novembre","novembre","novembre","novembre","novembre","novembre","novembre","novembre",{"$f":"CHOOSE(MONTH(BQC5),\"janvier\",\"février\",\"mars\",\"avril\",\"mai\",\"juin\",\"juillet\",\"aout\",\"septembre\",\"octobre\",\"novembre\",\"décembre\")","v":"novembre"},"novembre","novembre","décembre","décembre","décembre","décembre","décembre","décembre","décembre","décembre","décembre","décembre","décembre","décembre","décembre","décembre","décembre","décembre","décembre","décembre","décembre","décembre","décembre","décembre","décembre","décembre","décembre","décembre","décembre","décembre","décembre","décembre","décembre","janvier","janvier","janvier","janvier","janvier","janvier","janvier","janvier","janvier","janvier","janvier","janvier","janvier","janvier","janvier","janvier","janvier","janvier","janvier","janvier","janvier","janvier","janvier","janvier","janvier","janvier","janvier","janvier","janvier","janvier",{"$f":"CHOOSE(MONTH(BSO5),\"janvier\",\"février\",\"mars\",\"avril\",\"mai\",\"juin\",\"juillet\",\"aout\",\"septembre\",\"octobre\",\"novembre\",\"décembre\")","v":"janvier"},"février","février","février","février","février","février","février","février","février","février","février","février","février","février","février","février","février","février","février","février","février","février","février","février","février","février","février","février","mars","mars","mars","mars","mars","mars","mars","mars","mars","mars","mars","mars","mars","mars","mars","mars","mars","mars","mars","mars","mars","mars","mars","mars","mars","mars","mars","mars","mars","mars","mars","avril","avril","avril","avril",{"$f":"CHOOSE(MONTH(BVA5),\"janvier\",\"février\",\"mars\",\"avril\",\"mai\",\"juin\",\"juillet\",\"aout\",\"septembre\",\"octobre\",\"novembre\",\"décembre\")","v":"avril"},"avril","avril","avril","avril","avril","avril","avril","avril","avril","avril","avril","avril","avril","avril","avril","avril","avril","avril","avril","avril","avril","avril","avril","avril","avril","mai","mai","mai","mai","mai","mai","mai","mai","mai","mai","mai","mai","mai","mai","mai","mai","mai","mai","mai","mai","mai","mai","mai","mai","mai","mai","mai","mai","mai","mai","mai","juin","juin","juin","juin","juin","juin","juin",{"$f":"CHOOSE(MONTH(BXM5),\"janvier\",\"février\",\"mars\",\"avril\",\"mai\",\"juin\",\"juillet\",\"aout\",\"septembre\",\"octobre\",\"novembre\",\"décembre\")","v":"juin"},"juin","juin","juin","juin","juin","juin","juin","juin","juin","juin","juin","juin","juin","juin","juin","juin","juin","juin","juin","juin","juin","juin","juillet","juillet","juillet","juillet","juillet","juillet","juillet","juillet","juillet","juillet","juillet","juillet","juillet","juillet","juillet","juillet","juillet","juillet","juillet","juillet","juillet","juillet","juillet","juillet","juillet","juillet","juillet","juillet","juillet","juillet","juillet","aout","aout","aout","aout","aout","aout","aout","aout","aout","aout",{"$f":"CHOOSE(MONTH(BZY5),\"janvier\",\"février\",\"mars\",\"avril\",\"mai\",\"juin\",\"juillet\",\"aout\",\"septembre\",\"octobre\",\"novembre\",\"décembre\")","v":"aout"},"aout","aout","aout","aout","aout","aout","aout","aout","aout","aout","aout","aout","aout","aout","aout","aout","aout","aout","aout","aout","septembre","septembre","septembre","septembre","septembre","septembre","septembre","septembre","septembre","septembre","septembre","septembre","septembre","septembre","septembre","septembre","septembre","septembre","septembre","septembre","septembre","septembre","septembre","septembre","septembre","septembre","septembre","septembre","septembre","septembre","octobre","octobre","octobre","octobre","octobre","octobre","octobre","octobre","octobre","octobre","octobre","octobre","octobre",{"$f":"CHOOSE(MONTH(CCK5),\"janvier\",\"février\",\"mars\",\"avril\",\"mai\",\"juin\",\"juillet\",\"aout\",\"septembre\",\"octobre\",\"novembre\",\"décembre\")","v":"octobre"},"octobre","octobre","octobre","octobre","octobre","octobre","octobre","octobre","octobre","octobre","octobre","octobre","octobre","octobre","octobre","octobre","octobre","novembre","novembre","novembre","novembre","novembre","novembre","novembre","novembre","novembre","novembre","novembre","novembre","novembre","novembre","novembre","novembre","novembre","novembre","novembre","novembre","novembre","novembre","novembre","novembre","novembre","novembre","novembre","novembre","novembre","novembre","décembre","décembre","décembre","décembre","décembre","décembre","décembre","décembre","décembre","décembre","décembre","décembre","décembre","décembre","décembre","décembre",{"$f":"CHOOSE(MONTH(CEW5),\"janvier\",\"février\",\"mars\",\"avril\",\"mai\",\"juin\",\"juillet\",\"aout\",\"septembre\",\"octobre\",\"novembre\",\"décembre\")","v":"décembre"},"décembre","décembre","décembre","décembre","décembre","décembre","décembre","décembre","décembre","décembre","décembre","décembre","décembre","décembre","janvier","janvier","janvier","janvier","janvier","janvier","janvier","janvier","janvier","janvier","janvier","janvier","janvier","janvier","janvier","janvier","janvier","janvier","janvier","janvier","janvier","janvier","janvier","janvier","janvier","janvier","janvier","janvier","janvier","janvier","janvier","février","février","février","février","février","février","février","février","février","février","février","février","février","février","février","février","février","février",{"$f":"CHOOSE(MONTH(CHI5),\"janvier\",\"février\",\"mars\",\"avril\",\"mai\",\"juin\",\"juillet\",\"aout\",\"septembre\",\"octobre\",\"novembre\",\"décembre\")","v":"février"},"février","février","février","février","février","février","février","février","février","mars","mars","mars","mars","mars","mars","mars","mars","mars","mars","mars","mars","mars","mars","mars","mars","mars","mars","mars","mars","mars","mars","mars","mars","mars","mars","mars","mars","mars","mars","mars","avril","avril","avril","avril","avril","avril","avril","avril","avril","avril","avril","avril","avril","avril","avril","avril","avril","avril","avril","avril","avril","avril","avril",{"$f":"CHOOSE(MONTH(CJU5),\"janvier\",\"février\",\"mars\",\"avril\",\"mai\",\"juin\",\"juillet\",\"aout\",\"septembre\",\"octobre\",\"novembre\",\"décembre\")","v":"avril"},"avril","avril","avril","avril","avril","avril","mai","mai","mai","mai","mai","mai","mai","mai","mai","mai","mai","mai","mai","mai","mai","mai","mai","mai","mai","mai","mai","mai","mai","mai","mai","mai","mai","mai","mai","mai","mai","juin","juin","juin","juin","juin","juin","juin","juin","juin","juin","juin","juin","juin","juin","juin","juin","juin","juin","juin","juin","juin","juin","juin","juin","juin","juin",{"$f":"CHOOSE(MONTH(CMG5),\"janvier\",\"février\",\"mars\",\"avril\",\"mai\",\"juin\",\"juillet\",\"aout\",\"septembre\",\"octobre\",\"novembre\",\"décembre\")","v":"juin"},"juin","juin","juin","juillet","juillet","juillet","juillet","juillet","juillet","juillet","juillet","juillet","juillet","juillet","juillet","juillet","juillet","juillet","juillet","juillet","juillet","juillet","juillet","juillet","juillet","juillet","juillet","juillet","juillet","juillet","juillet","juillet","juillet","juillet","aout","aout","aout","aout","aout","aout","aout","aout","aout","aout","aout","aout","aout","aout","aout","aout","aout","aout","aout","aout","aout","aout","aout","aout","aout","aout","aout","aout","aout",{"$f":"CHOOSE(MONTH(COS5),\"janvier\",\"février\",\"mars\",\"avril\",\"mai\",\"juin\",\"juillet\",\"aout\",\"septembre\",\"octobre\",\"novembre\",\"décembre\")","v":"aout"},"aout","septembre","septembre","septembre","septembre","septembre","septembre","septembre","septembre","septembre","septembre","septembre","septembre","septembre","septembre","septembre","septembre","septembre","septembre","septembre","septembre","septembre","septembre","septembre","septembre","septembre","septembre","septembre","septembre","septembre","septembre","octobre","octobre","octobre","octobre","octobre","octobre","octobre","octobre","octobre","octobre","octobre","octobre","octobre","octobre","octobre","octobre","octobre","octobre","octobre","octobre","octobre","octobre","octobre","octobre","octobre","octobre","octobre","octobre","octobre","octobre","octobre","novembre",{"$f":"CHOOSE(MONTH(CRE5),\"janvier\",\"février\",\"mars\",\"avril\",\"mai\",\"juin\",\"juillet\",\"aout\",\"septembre\",\"octobre\",\"novembre\",\"décembre\")","v":"novembre"},"novembre","novembre","novembre","novembre","novembre","novembre","novembre","novembre","novembre","novembre","novembre","novembre","novembre","novembre","novembre","novembre","novembre","novembre","novembre","novembre","novembre","novembre","novembre","novembre","novembre","novembre","novembre","novembre","décembre","décembre","décembre","décembre","décembre","décembre","décembre","décembre","décembre","décembre","décembre","décembre","décembre","décembre","décembre","décembre","décembre","décembre","décembre","décembre","décembre","décembre","décembre","décembre","décembre","décembre","décembre","décembre","décembre","décembre","décembre","janvier","janvier","janvier","janvier",{"$f":"CHOOSE(MONTH(CTQ5),\"janvier\",\"février\",\"mars\",\"avril\",\"mai\",\"juin\",\"juillet\",\"aout\",\"septembre\",\"octobre\",\"novembre\",\"décembre\")","v":"janvier"},"janvier","janvier","janvier","janvier","janvier","janvier","janvier","janvier","janvier","janvier","janvier","janvier","janvier","janvier","janvier","janvier","janvier","janvier","janvier","janvier","janvier","janvier","janvier","janvier","janvier","janvier","février","février","février","février","février","février","février","février","février","février","février","février","février","février","février","février","février","février","février","février","février","février","février","février","février","février","février","février","mars","mars","mars","mars","mars","mars","mars","mars","mars",{"$f":"CHOOSE(MONTH(CWC5),\"janvier\",\"février\",\"mars\",\"avril\",\"mai\",\"juin\",\"juillet\",\"aout\",\"septembre\",\"octobre\",\"novembre\",\"décembre\")","v":"mars"},"mars","mars","mars","mars","mars","mars","mars","mars","mars","mars","mars","mars","mars","mars","mars","mars","mars","mars","mars","mars","mars","avril","avril","avril","avril","avril","avril","avril","avril","avril","avril","avril","avril","avril","avril","avril","avril","avril","avril","avril","avril","avril","avril","avril","avril","avril","avril","avril","avril","avril","avril","mai","mai","mai","mai","mai","mai","mai","mai","mai","mai","mai","mai",{"$f":"CHOOSE(MONTH(CYO5),\"janvier\",\"février\",\"mars\",\"avril\",\"mai\",\"juin\",\"juillet\",\"aout\",\"septembre\",\"octobre\",\"novembre\",\"décembre\")","v":"mai"},"mai","mai","mai","mai","mai","mai","mai","mai","mai","mai","mai","mai","mai","mai","mai","mai","mai","mai","juin","juin","juin","juin","juin","juin","juin","juin","juin","juin","juin","juin","juin","juin","juin","juin","juin","juin","juin","juin","juin","juin","juin","juin","juin","juin","juin","juin","juin","juin","juillet","juillet","juillet","juillet","juillet","juillet","juillet","juillet","juillet","juillet","juillet","juillet","juillet","juillet","juillet",{"$f":"CHOOSE(MONTH(DBA5),\"janvier\",\"février\",\"mars\",\"avril\",\"mai\",\"juin\",\"juillet\",\"aout\",\"septembre\",\"octobre\",\"novembre\",\"décembre\")","v":"juillet"},"juillet","juillet","juillet","juillet","juillet","juillet","juillet","juillet","juillet","juillet","juillet","juillet","juillet","juillet","juillet","aout","aout","aout","aout","aout","aout","aout","aout","aout","aout","aout","aout","aout","aout","aout","aout","aout","aout","aout","aout","aout","aout","aout","aout","aout","aout","aout","aout","aout","aout","aout","septembre","septembre","septembre","septembre","septembre","septembre","septembre","septembre","septembre","septembre","septembre","septembre","septembre","septembre","septembre","septembre","septembre",{"$f":"CHOOSE(MONTH(DDM5),\"janvier\",\"février\",\"mars\",\"avril\",\"mai\",\"juin\",\"juillet\",\"aout\",\"septembre\",\"octobre\",\"novembre\",\"décembre\")","v":"septembre"},"septembre","septembre","septembre","septembre","septembre","septembre","septembre","septembre","septembre","septembre","septembre","septembre","octobre","octobre","octobre","octobre","octobre","octobre","octobre","octobre","octobre","octobre","octobre","octobre","octobre","octobre","octobre","octobre","octobre","octobre","octobre","octobre","octobre","octobre","octobre","octobre","octobre","octobre","octobre","octobre","octobre","octobre","octobre","novembre","novembre","novembre","novembre","novembre","novembre","novembre","novembre","novembre","novembre","novembre","novembre","novembre","novembre","novembre","novembre","novembre","novembre","novembre","novembre",{"$f":"CHOOSE(MONTH(DFY5),\"janvier\",\"février\",\"mars\",\"avril\",\"mai\",\"juin\",\"juillet\",\"aout\",\"septembre\",\"octobre\",\"novembre\",\"décembre\")","v":"novembre"},"novembre","novembre","novembre","novembre","novembre","novembre","novembre","novembre","novembre","décembre","décembre","décembre","décembre","décembre","décembre","décembre","décembre","décembre","décembre","décembre","décembre","décembre","décembre","décembre","décembre","décembre","décembre","décembre","décembre","décembre","décembre","décembre","décembre","décembre","décembre","décembre","décembre","décembre","décembre","décembre","janvier","janvier","janvier","janvier","janvier","janvier","janvier","janvier","janvier","janvier","janvier","janvier","janvier","janvier","janvier","janvier","janvier","janvier","janvier","janvier","janvier","janvier","janvier",{"$f":"CHOOSE(MONTH(DIK5),\"janvier\",\"février\",\"mars\",\"avril\",\"mai\",\"juin\",\"juillet\",\"aout\",\"septembre\",\"octobre\",\"novembre\",\"décembre\")","v":"janvier"},"janvier","janvier","janvier","janvier","janvier","janvier","janvier","février","février","février","février","février","février","février","février","février","février","février","février","février","février","février","février","février","février","février","février","février","février","février","février","février","février","février","février","février","mars","mars","mars","mars","mars","mars","mars","mars","mars","mars","mars","mars","mars","mars","mars","mars","mars","mars","mars","mars","mars","mars","mars","mars","mars","mars","mars",{"$f":"CHOOSE(MONTH(DKW5),\"janvier\",\"février\",\"mars\",\"avril\",\"mai\",\"juin\",\"juillet\",\"aout\",\"septembre\",\"octobre\",\"novembre\",\"décembre\")","v":"mars"},"mars","mars","mars","avril","avril","avril","avril","avril","avril","avril","avril","avril","avril","avril","avril","avril","avril","avril","avril","avril","avril","avril","avril","avril","avril","avril","avril","avril","avril","avril","avril","avril","avril","mai","mai","mai","mai","mai","mai","mai","mai","mai","mai","mai","mai","mai","mai","mai","mai","mai","mai","mai","mai","mai","mai","mai","mai","mai","mai","mai","mai","mai","mai",{"$f":"CHOOSE(MONTH(DNI5),\"janvier\",\"février\",\"mars\",\"avril\",\"mai\",\"juin\",\"juillet\",\"aout\",\"septembre\",\"octobre\",\"novembre\",\"décembre\")","v":"mai"},"juin","juin","juin","juin","juin","juin","juin","juin","juin","juin","juin","juin","juin","juin","juin","juin","juin","juin","juin","juin","juin","juin","juin","juin","juin","juin","juin","juin","juin","juin","juillet","juillet","juillet","juillet","juillet","juillet","juillet","juillet","juillet","juillet","juillet","juillet","juillet","juillet","juillet","juillet","juillet","juillet","juillet","juillet","juillet","juillet","juillet","juillet","juillet","juillet","juillet","juillet","juillet","juillet","juillet","aout","aout",{"$f":"CHOOSE(MONTH(DPU5),\"janvier\",\"février\",\"mars\",\"avril\",\"mai\",\"juin\",\"juillet\",\"aout\",\"septembre\",\"octobre\",\"novembre\",\"décembre\")","v":"aout"},"aout","aout","aout","aout","aout","aout","aout","aout","aout","aout","aout","aout","aout","aout","aout","aout","aout","aout","aout","aout","aout","aout","aout","aout","aout","aout","aout","aout","septembre","septembre","septembre","septembre","septembre","septembre","septembre","septembre","septembre","septembre","septembre","septembre","septembre","septembre","septembre","septembre","septembre","septembre","septembre","septembre","septembre","septembre","septembre","septembre","septembre","septembre","septembre","septembre","septembre","septembre","octobre","octobre","octobre","octobre","octobre",{"$f":"CHOOSE(MONTH(DSG5),\"janvier\",\"février\",\"mars\",\"avril\",\"mai\",\"juin\",\"juillet\",\"aout\",\"septembre\",\"octobre\",\"novembre\",\"décembre\")","v":"octobre"},"octobre","octobre","octobre","octobre","octobre","octobre","octobre","octobre","octobre","octobre","octobre","octobre","octobre","octobre","octobre","octobre","octobre","octobre","octobre","octobre","octobre","octobre","octobre","octobre","octobre","novembre","novembre","novembre","novembre","novembre","novembre","novembre","novembre","novembre","novembre","novembre","novembre","novembre","novembre","novembre","novembre","novembre","novembre","novembre","novembre","novembre","novembre","novembre","novembre","novembre","novembre","novembre","novembre","novembre","novembre","décembre","décembre","décembre","décembre","décembre","décembre","décembre","décembre",{"$f":"CHOOSE(MONTH(DUS5),\"janvier\",\"février\",\"mars\",\"avril\",\"mai\",\"juin\",\"juillet\",\"aout\",\"septembre\",\"octobre\",\"novembre\",\"décembre\")","v":"décembre"},"décembre","décembre","décembre","décembre","décembre","décembre","décembre","décembre","décembre","décembre","décembre","décembre","décembre","décembre","décembre","décembre","décembre","décembre","décembre","décembre","décembre","décembre","janvier","janvier","janvier","janvier","janvier","janvier","janvier","janvier","janvier","janvier","janvier","janvier","janvier","janvier","janvier","janvier","janvier","janvier","janvier","janvier","janvier","janvier","janvier","janvier","janvier","janvier","janvier","janvier","janvier","janvier","janvier","février","février","février","février","février","février","février","février","février","février",{"$f":"CHOOSE(MONTH(DXE5),\"janvier\",\"février\",\"mars\",\"avril\",\"mai\",\"juin\",\"juillet\",\"aout\",\"septembre\",\"octobre\",\"novembre\",\"décembre\")","v":"février"},"février","février","février","février","février","février","février","février","février","février","février","février","février","février","février","février","février","mars","mars","mars","mars","mars","mars","mars","mars","mars","mars","mars","mars","mars","mars","mars","mars","mars","mars","mars","mars","mars","mars","mars","mars","mars","mars","mars","mars","mars","mars","mars","avril","avril","avril","avril","avril","avril","avril","avril","avril","avril","avril","avril","avril","avril","avril",{"$f":"CHOOSE(MONTH(DZQ5),\"janvier\",\"février\",\"mars\",\"avril\",\"mai\",\"juin\",\"juillet\",\"aout\",\"septembre\",\"octobre\",\"novembre\",\"décembre\")","v":"avril"},"avril","avril","avril","avril","avril","avril","avril","avril","avril","avril","avril","avril","avril","avril","mai","mai","mai","mai","mai","mai","mai","mai","mai","mai","mai","mai","mai","mai","mai","mai","mai","mai","mai","mai","mai","mai","mai","mai","mai","mai","mai","mai","mai","mai","mai","juin","juin","juin","juin","juin","juin","juin","juin","juin","juin","juin","juin","juin","juin","juin","juin","juin","juin",{"$f":"CHOOSE(MONTH(ECC5),\"janvier\",\"février\",\"mars\",\"avril\",\"mai\",\"juin\",\"juillet\",\"aout\",\"septembre\",\"octobre\",\"novembre\",\"décembre\")","v":"juin"},"juin","juin","juin","juin","juin","juin","juin","juin","juin","juin","juin","juillet","juillet","juillet","juillet","juillet","juillet","juillet","juillet","juillet","juillet","juillet","juillet","juillet","juillet","juillet","juillet","juillet","juillet","juillet","juillet","juillet","juillet","juillet","juillet","juillet","juillet","juillet","juillet","juillet","juillet","juillet","aout","aout","aout","aout","aout","aout","aout","aout","aout","aout","aout","aout","aout","aout","aout","aout","aout","aout","aout","aout","aout",{"$f":"CHOOSE(MONTH(EEO5),\"janvier\",\"février\",\"mars\",\"avril\",\"mai\",\"juin\",\"juillet\",\"aout\",\"septembre\",\"octobre\",\"novembre\",\"décembre\")","v":"aout"},"aout","aout","aout","aout","aout","aout","aout","aout","aout","septembre","septembre","septembre","septembre","septembre","septembre","septembre","septembre","septembre","septembre","septembre","septembre","septembre","septembre","septembre","septembre","septembre","septembre","septembre","septembre","septembre","septembre","septembre","septembre","septembre","septembre","septembre","septembre","septembre","septembre","octobre","octobre","octobre","octobre","octobre","octobre","octobre","octobre","octobre","octobre","octobre","octobre","octobre","octobre","octobre","octobre","octobre","octobre","octobre","octobre","octobre","octobre","octobre","octobre",{"$f":"CHOOSE(MONTH(EHA5),\"janvier\",\"février\",\"mars\",\"avril\",\"mai\",\"juin\",\"juillet\",\"aout\",\"septembre\",\"octobre\",\"novembre\",\"décembre\")","v":"octobre"},"octobre","octobre","octobre","octobre","octobre","octobre","novembre","novembre","novembre","novembre","novembre","novembre","novembre","novembre","novembre","novembre","novembre","novembre","novembre","novembre","novembre","novembre","novembre","novembre","novembre","novembre","novembre","novembre","novembre","novembre","novembre","novembre","novembre","novembre","novembre","novembre","décembre","décembre","décembre","décembre","décembre","décembre","décembre","décembre","décembre","décembre","décembre","décembre","décembre","décembre","décembre","décembre","décembre","décembre","décembre","décembre","décembre","décembre","décembre","décembre","décembre","décembre","décembre",{"$f":"CHOOSE(MONTH(EJM5),\"janvier\",\"février\",\"mars\",\"avril\",\"mai\",\"juin\",\"juillet\",\"aout\",\"septembre\",\"octobre\",\"novembre\",\"décembre\")","v":"décembre"},"décembre","décembre","décembre","janvier","janvier","janvier","janvier","janvier","janvier","janvier","janvier","janvier","janvier","janvier","janvier","janvier","janvier","janvier","janvier","janvier","janvier","janvier","janvier","janvier","janvier","janvier","janvier","janvier","janvier","janvier","janvier","janvier","janvier","janvier","février","février","février","février","février","février","février","février","février","février","février","février","février","février","février","février","février","février","février","février","février","février","février","février","février","février","février","février","mars",{"$f":"CHOOSE(MONTH(ELY5),\"janvier\",\"février\",\"mars\",\"avril\",\"mai\",\"juin\",\"juillet\",\"aout\",\"septembre\",\"octobre\",\"novembre\",\"décembre\")","v":"mars"},"mars","mars","mars","mars","mars","mars","mars","mars","mars","mars","mars","mars","mars","mars","mars","mars","mars","mars","mars","mars","mars","mars","mars","mars","mars","mars","mars","mars","mars","avril","avril","avril","avril","avril",{"$f":"CHOOSE(MONTH(ENH5),\"janvier\",\"février\",\"mars\",\"avril\",\"mai\",\"juin\",\"juillet\",\"aout\",\"septembre\",\"octobre\",\"novembre\",\"décembre\")","v":"avril"},"avril","avril","avril","avril","avril","avril","avril","avril","avril","avril","avril","avril","avril","avril","avril","avril","avril","avril","avril","avril","avril","avril","avril","avril","mai","mai","mai","mai","mai","mai","mai","mai","mai","mai","mai","mai","mai","mai","mai","mai","mai","mai","mai","mai","mai","mai","mai","mai","mai","mai","mai","mai","mai","mai","mai","juin","juin","juin","juin","juin","juin","juin","juin",{"$f":"CHOOSE(MONTH(EPT5),\"janvier\",\"février\",\"mars\",\"avril\",\"mai\",\"juin\",\"juillet\",\"aout\",\"septembre\",\"octobre\",\"novembre\",\"décembre\")","v":"juin"},"juin","juin","juin","juin","juin","juin","juin","juin","juin","juin","juin","juin","juin","juin","juin","juin","juin","juin","juin","juin","juin","juillet","juillet","juillet","juillet","juillet","juillet","juillet","juillet","juillet","juillet","juillet","juillet","juillet","juillet","juillet","juillet","juillet","juillet","juillet","juillet","juillet","juillet","juillet","juillet","juillet","juillet","juillet","juillet","juillet","juillet","juillet","aout","aout","aout","aout","aout","aout","aout","aout","aout","aout","aout",{"$f":"CHOOSE(MONTH(ESF5),\"janvier\",\"février\",\"mars\",\"avril\",\"mai\",\"juin\",\"juillet\",\"aout\",\"septembre\",\"octobre\",\"novembre\",\"décembre\")","v":"aout"},"aout","aout","aout","aout","aout","aout","aout","aout","aout","aout","aout","aout","aout","aout","aout","aout","aout","aout","aout","septembre","septembre","septembre","septembre","septembre","septembre","septembre","septembre","septembre","septembre","septembre","septembre","septembre","septembre","septembre","septembre","septembre","septembre","septembre","septembre","septembre","septembre","septembre","septembre","septembre","septembre","septembre","septembre","septembre","septembre","octobre","octobre","octobre","octobre","octobre","octobre","octobre","octobre","octobre","octobre","octobre","octobre","octobre","octobre",{"$f":"CHOOSE(MONTH(EUR5),\"janvier\",\"février\",\"mars\",\"avril\",\"mai\",\"juin\",\"juillet\",\"aout\",\"septembre\",\"octobre\",\"novembre\",\"décembre\")","v":"octobre"},"octobre","octobre","octobre","octobre","octobre","octobre","octobre","octobre","octobre","octobre","octobre","octobre","octobre","octobre","octobre","octobre","novembre","novembre","novembre","novembre","novembre","novembre","novembre","novembre","novembre","novembre","novembre","novembre","novembre","novembre","novembre","novembre","novembre","novembre","novembre","novembre","novembre","novembre","novembre","novembre","novembre","novembre","novembre","novembre","novembre","novembre","décembre","décembre","décembre","décembre","décembre","décembre","décembre","décembre","décembre","décembre","décembre","décembre","décembre","décembre","décembre","décembre","décembre",{"$f":"CHOOSE(MONTH(EXD5),\"janvier\",\"février\",\"mars\",\"avril\",\"mai\",\"juin\",\"juillet\",\"aout\",\"septembre\",\"octobre\",\"novembre\",\"décembre\")","v":"décembre"},"décembre","décembre","décembre","décembre","décembre","décembre","décembre","décembre","décembre","décembre","décembre","décembre","décembre","janvier","janvier","janvier","janvier","janvier","janvier","janvier","janvier","janvier","janvier","janvier","janvier","janvier","janvier","janvier","janvier","janvier","janvier","janvier","janvier","janvier","janvier","janvier","janvier","janvier","janvier","janvier","janvier","janvier","janvier","janvier","février","février","février","février","février","février","février","février","février","février","février","février","février","février","février","février","février","février","février",{"$f":"CHOOSE(MONTH(EZP5),\"janvier\",\"février\",\"mars\",\"avril\",\"mai\",\"juin\",\"juillet\",\"aout\",\"septembre\",\"octobre\",\"novembre\",\"décembre\")","v":"février"},"février","février","février","février","février","février","février","février","mars","mars","mars","mars","mars","mars","mars","mars","mars","mars","mars","mars","mars","mars","mars","mars","mars","mars","mars","mars","mars","mars","mars","mars","mars","mars","mars","mars","mars","mars","mars","avril","avril","avril","avril","avril","avril","avril","avril","avril","avril","avril","avril","avril","avril","avril","avril","avril","avril","avril","avril","avril","avril","avril","avril",{"$f":"CHOOSE(MONTH(FCB5),\"janvier\",\"février\",\"mars\",\"avril\",\"mai\",\"juin\",\"juillet\",\"aout\",\"septembre\",\"octobre\",\"novembre\",\"décembre\")","v":"avril"},"avril","avril","avril","avril","avril","mai","mai","mai","mai","mai","mai","mai","mai","mai","mai","mai","mai","mai","mai","mai","mai","mai","mai","mai","mai","mai","mai","mai","mai","mai","mai","mai","mai","mai","mai","mai","juin","juin","juin","juin","juin","juin","juin","juin","juin","juin","juin","juin","juin","juin","juin","juin","juin","juin","juin","juin","juin","juin","juin","juin","juin","juin","juin",{"$f":"CHOOSE(MONTH(FEN5),\"janvier\",\"février\",\"mars\",\"avril\",\"mai\",\"juin\",\"juillet\",\"aout\",\"septembre\",\"octobre\",\"novembre\",\"décembre\")","v":"juin"},"juin","juin","juillet","juillet","juillet","juillet","juillet","juillet","juillet","juillet","juillet","juillet","juillet","juillet","juillet","juillet","juillet","juillet","juillet","juillet","juillet","juillet","juillet","juillet","juillet","juillet","juillet","juillet","juillet","juillet","juillet","juillet","juillet","aout","aout","aout","aout","aout","aout","aout","aout","aout","aout","aout","aout","aout","aout","aout","aout","aout","aout","aout","aout","aout","aout","aout","aout","aout","aout","aout","aout","aout","aout",{"$f":"CHOOSE(MONTH(FGZ5),\"janvier\",\"février\",\"mars\",\"avril\",\"mai\",\"juin\",\"juillet\",\"aout\",\"septembre\",\"octobre\",\"novembre\",\"décembre\")","v":"aout"},"septembre","septembre","septembre","septembre","septembre","septembre","septembre","septembre","septembre","septembre","septembre","septembre","septembre","septembre","septembre","septembre","septembre","septembre","septembre","septembre","septembre","septembre","septembre","septembre","septembre","septembre","septembre","septembre","septembre","septembre","octobre","octobre","octobre","octobre","octobre","octobre","octobre","octobre","octobre","octobre","octobre","octobre","octobre","octobre","octobre","octobre","octobre","octobre","octobre","octobre","octobre","octobre","octobre","octobre","octobre","octobre","octobre","octobre","octobre","octobre","octobre","novembre","novembre",{"$f":"CHOOSE(MONTH(FJL5),\"janvier\",\"février\",\"mars\",\"avril\",\"mai\",\"juin\",\"juillet\",\"aout\",\"septembre\",\"octobre\",\"novembre\",\"décembre\")","v":"novembre"},"novembre","novembre","novembre","novembre","novembre","novembre","novembre","novembre","novembre","novembre","novembre","novembre","novembre","novembre","novembre","novembre","novembre","novembre","novembre","novembre","novembre","novembre","novembre","novembre","novembre","novembre","novembre","décembre","décembre","décembre","décembre","décembre","décembre","décembre","décembre","décembre","décembre","décembre","décembre","décembre","décembre","décembre","décembre","décembre","décembre","décembre","décembre","décembre","décembre","décembre","décembre","décembre","décembre","décembre","décembre","décembre","décembre","décembre","janvier","janvier","janvier","janvier","janvier",{"$f":"CHOOSE(MONTH(FLX5),\"janvier\",\"février\",\"mars\",\"avril\",\"mai\",\"juin\",\"juillet\",\"aout\",\"septembre\",\"octobre\",\"novembre\",\"décembre\")","v":"janvier"},"janvier","janvier","janvier","janvier","janvier","janvier","janvier","janvier","janvier","janvier","janvier","janvier","janvier","janvier","janvier","janvier","janvier","janvier","janvier","janvier","janvier","janvier","janvier","janvier","janvier","février","février","février","février","février","février","février","février","février","février","février","février","février","février","février","février","février","février","février","février","février","février","février","février","février","février","février","février","février","mars","mars","mars","mars","mars","mars","mars","mars","mars",{"$f":"CHOOSE(MONTH(FOJ5),\"janvier\",\"février\",\"mars\",\"avril\",\"mai\",\"juin\",\"juillet\",\"aout\",\"septembre\",\"octobre\",\"novembre\",\"décembre\")","v":"mars"},"mars","mars","mars","mars","mars","mars","mars","mars","mars","mars","mars","mars","mars","mars","mars","mars","mars","mars","mars","mars","mars","avril","avril","avril","avril","avril","avril","avril","avril","avril","avril","avril","avril","avril","avril","avril","avril","avril","avril","avril","avril","avril","avril","avril","avril","avril","avril","avril","avril","avril","avril","mai","mai","mai","mai","mai","mai","mai","mai","mai","mai","mai","mai",{"$f":"CHOOSE(MONTH(FQV5),\"janvier\",\"février\",\"mars\",\"avril\",\"mai\",\"juin\",\"juillet\",\"aout\",\"septembre\",\"octobre\",\"novembre\",\"décembre\")","v":"mai"},"mai","mai","mai","mai","mai","mai","mai","mai","mai","mai","mai","mai","mai","mai","mai","mai","mai","mai","juin","juin","juin","juin","juin","juin","juin","juin","juin","juin","juin","juin","juin","juin","juin","juin","juin","juin","juin","juin","juin","juin","juin","juin","juin","juin","juin","juin","juin","juin","juillet","juillet","juillet","juillet","juillet","juillet","juillet","juillet","juillet","juillet","juillet","juillet","juillet","juillet","juillet",{"$f":"CHOOSE(MONTH(FTH5),\"janvier\",\"février\",\"mars\",\"avril\",\"mai\",\"juin\",\"juillet\",\"aout\",\"septembre\",\"octobre\",\"novembre\",\"décembre\")","v":"juillet"},"juillet","juillet","juillet","juillet","juillet","juillet","juillet","juillet","juillet","juillet","juillet","juillet","juillet","juillet","juillet","aout","aout","aout","aout","aout","aout","aout","aout","aout","aout","aout","aout","aout","aout","aout","aout","aout","aout","aout","aout","aout","aout","aout","aout","aout","aout","aout","aout","aout","aout","aout","septembre","septembre","septembre","septembre","septembre","septembre","septembre","septembre","septembre","septembre","septembre","septembre","septembre","septembre","septembre","septembre","septembre",{"$f":"CHOOSE(MONTH(FVT5),\"janvier\",\"février\",\"mars\",\"avril\",\"mai\",\"juin\",\"juillet\",\"aout\",\"septembre\",\"octobre\",\"novembre\",\"décembre\")","v":"septembre"},"septembre","septembre","septembre","septembre","septembre","septembre","septembre","septembre","septembre","septembre","septembre","septembre","octobre","octobre","octobre","octobre","octobre","octobre","octobre","octobre","octobre","octobre","octobre","octobre","octobre","octobre","octobre","octobre","octobre","octobre","octobre","octobre","octobre","octobre","octobre","octobre","octobre","octobre","octobre","octobre","octobre","octobre","octobre","novembre","novembre","novembre","novembre","novembre","novembre","novembre","novembre","novembre","novembre","novembre","novembre","novembre","novembre","novembre","novembre","novembre","novembre","novembre","novembre",{"$f":"CHOOSE(MONTH(FYF5),\"janvier\",\"février\",\"mars\",\"avril\",\"mai\",\"juin\",\"juillet\",\"aout\",\"septembre\",\"octobre\",\"novembre\",\"décembre\")","v":"novembre"},"novembre","novembre","novembre","novembre","novembre","novembre","novembre","novembre","novembre","décembre","décembre","décembre","décembre","décembre","décembre","décembre","décembre","décembre","décembre","décembre","décembre","décembre","décembre","décembre","décembre","décembre","décembre","décembre","décembre","décembre","décembre","décembre","décembre","décembre","décembre","décembre","décembre","décembre","décembre","décembre","janvier","janvier","janvier","janvier","janvier","janvier","janvier","janvier","janvier","janvier","janvier","janvier","janvier","janvier","janvier","janvier","janvier","janvier","janvier","janvier","janvier","janvier","janvier",{"$f":"CHOOSE(MONTH(GAR5),\"janvier\",\"février\",\"mars\",\"avril\",\"mai\",\"juin\",\"juillet\",\"aout\",\"septembre\",\"octobre\",\"novembre\",\"décembre\")","v":"janvier"},"janvier","janvier","janvier","janvier","janvier","janvier","janvier","février","février","février","février","février","février","février","février","février","février","février","février","février","février","février","février","février","février","février","février","février","février","février","février","février","février","février","février","mars","mars","mars","mars","mars","mars","mars","mars","mars","mars","mars","mars","mars","mars","mars","mars","mars","mars","mars","mars","mars","mars","mars","mars","mars","mars","mars","mars",{"$f":"CHOOSE(MONTH(GDD5),\"janvier\",\"février\",\"mars\",\"avril\",\"mai\",\"juin\",\"juillet\",\"aout\",\"septembre\",\"octobre\",\"novembre\",\"décembre\")","v":"mars"},"mars","mars","avril","avril","avril","avril","avril","avril","avril","avril","avril","avril","avril","avril","avril","avril","avril","avril","avril","avril","avril","avril","avril","avril","avril","avril","avril","avril","avril","avril","avril","avril","mai","mai","mai","mai","mai","mai","mai","mai","mai","mai","mai","mai","mai","mai","mai","mai","mai","mai","mai","mai","mai","mai","mai","mai","mai","mai","mai","mai","mai","mai","mai",{"$f":"CHOOSE(MONTH(GFP5),\"janvier\",\"février\",\"mars\",\"avril\",\"mai\",\"juin\",\"juillet\",\"aout\",\"septembre\",\"octobre\",\"novembre\",\"décembre\")","v":"juin"},"juin","juin","juin","juin","juin","juin","juin","juin","juin","juin","juin","juin","juin","juin","juin","juin","juin","juin","juin","juin","juin","juin","juin","juin","juin","juin","juin","juin","juin","juillet","juillet","juillet","juillet","juillet","juillet","juillet","juillet","juillet","juillet","juillet","juillet","juillet","juillet","juillet","juillet","juillet","juillet","juillet","juillet","juillet","juillet","juillet","juillet","juillet","juillet","juillet","juillet","juillet","juillet","juillet","aout","aout","aout",{"$f":"CHOOSE(MONTH(GIB5),\"janvier\",\"février\",\"mars\",\"avril\",\"mai\",\"juin\",\"juillet\",\"aout\",\"septembre\",\"octobre\",\"novembre\",\"décembre\")","v":"aout"},"aout","aout","aout","aout","aout","aout","aout","aout","aout","aout","aout","aout","aout","aout","aout","aout","aout","aout","aout","aout","aout","aout","aout","aout","aout","aout","aout","septembre","septembre","septembre","septembre","septembre","septembre","septembre","septembre","septembre","septembre","septembre","septembre","septembre","septembre","septembre","septembre","septembre","septembre","septembre","septembre","septembre","septembre","septembre","septembre","septembre","septembre","septembre","septembre","septembre","septembre","octobre","octobre","octobre","octobre","octobre","octobre",{"$f":"CHOOSE(MONTH(GKN5),\"janvier\",\"février\",\"mars\",\"avril\",\"mai\",\"juin\",\"juillet\",\"aout\",\"septembre\",\"octobre\",\"novembre\",\"décembre\")","v":"octobre"},"octobre","octobre","octobre","octobre","octobre","octobre","octobre","octobre","octobre","octobre","octobre","octobre","octobre","octobre","octobre","octobre","octobre","octobre","octobre","octobre","octobre","octobre","octobre","octobre","novembre","novembre","novembre","novembre","novembre","novembre","novembre","novembre","novembre","novembre","novembre","novembre","novembre","novembre","novembre","novembre","novembre","novembre","novembre","novembre","novembre","novembre","novembre","novembre","novembre","novembre","novembre","novembre","novembre","novembre","décembre","décembre","décembre","décembre","décembre","décembre","décembre","décembre","décembre",{"$f":"CHOOSE(MONTH(GMZ5),\"janvier\",\"février\",\"mars\",\"avril\",\"mai\",\"juin\",\"juillet\",\"aout\",\"septembre\",\"octobre\",\"novembre\",\"décembre\")","v":"décembre"},"décembre","décembre","décembre","décembre","décembre","décembre","décembre","décembre","décembre","décembre","décembre","décembre","décembre","décembre","décembre","décembre","décembre","décembre","décembre","décembre","décembre","janvier",{"$f":"CHOOSE(MONTH(GNW5),\"janvier\",\"février\",\"mars\",\"avril\",\"mai\",\"juin\",\"juillet\",\"aout\",\"septembre\",\"octobre\",\"novembre\",\"décembre\")","v":"janvier"},"janvier","janvier","janvier","janvier","janvier","janvier","janvier","janvier","janvier","janvier","janvier","janvier","janvier","janvier","janvier","janvier","janvier","janvier","janvier","janvier","janvier","janvier","janvier","janvier","janvier","janvier","janvier","janvier","janvier","février","février","février","février","février","février","février","février","février","février","février","février","février","février","février","février","février","février","février","février","février","février","février","février","février","février","février","février","mars","mars","mars","mars","mars","mars",{"$f":"CHOOSE(MONTH(GQI5),\"janvier\",\"février\",\"mars\",\"avril\",\"mai\",\"juin\",\"juillet\",\"aout\",\"septembre\",\"octobre\",\"novembre\",\"décembre\")","v":"mars"},"mars","mars","mars","mars","mars","mars","mars","mars","mars","mars","mars","mars","mars","mars","mars","mars","mars","mars","mars","mars","mars","mars","mars","mars","avril","avril","avril","avril","avril","avril","avril","avril","avril","avril","avril","avril","avril","avril","avril",{"$f":"CHOOSE(MONTH(GRW5),\"janvier\",\"février\",\"mars\",\"avril\",\"mai\",\"juin\",\"juillet\",\"aout\",\"septembre\",\"octobre\",\"novembre\",\"décembre\")","v":"avril"},"avril","avril","avril","avril",{"$f":"CHOOSE(MONTH(GSB5),\"janvier\",\"février\",\"mars\",\"avril\",\"mai\",\"juin\",\"juillet\",\"aout\",\"septembre\",\"octobre\",\"novembre\",\"décembre\")","v":"avril"},"avril","avril","avril","avril","avril","avril","avril","avril","avril","mai","mai","mai","mai","mai","mai","mai","mai","mai","mai","mai","mai","mai","mai","mai","mai","mai","mai","mai","mai","mai","mai","mai","mai","mai","mai","mai","mai","mai","mai","mai","juin","juin","juin","juin","juin","juin","juin","juin","juin","juin","juin","juin","juin","juin","juin","juin","juin","juin","juin","juin","juin","juin","juin",{"$f":"CHOOSE(MONTH(GUN5),\"janvier\",\"février\",\"mars\",\"avril\",\"mai\",\"juin\",\"juillet\",\"aout\",\"septembre\",\"octobre\",\"novembre\",\"décembre\")","v":"juin"},"juin","juin","juin","juin","juin","juin","juillet","juillet","juillet","juillet","juillet","juillet","juillet","juillet","juillet","juillet","juillet","juillet","juillet","juillet","juillet","juillet","juillet","juillet","juillet","juillet","juillet","juillet","juillet","juillet","juillet","juillet","juillet","juillet","juillet","juillet","juillet","aout","aout","aout","aout","aout","aout","aout","aout","aout","aout","aout","aout","aout","aout","aout","aout","aout","aout","aout","aout","aout","aout","aout","aout","aout","aout",{"$f":"CHOOSE(MONTH(GWZ5),\"janvier\",\"février\",\"mars\",\"avril\",\"mai\",\"juin\",\"juillet\",\"aout\",\"septembre\",\"octobre\",\"novembre\",\"décembre\")","v":"aout"},"aout","aout","aout","aout","septembre","septembre","septembre","septembre","septembre","septembre","septembre","septembre","septembre","septembre","septembre","septembre","septembre","septembre","septembre","septembre","septembre","septembre","septembre","septembre","septembre","septembre","septembre","septembre","septembre","septembre","septembre","septembre","septembre","septembre","octobre","octobre","octobre","octobre","octobre","octobre","octobre","octobre","octobre","octobre","octobre","octobre","octobre","octobre","octobre","octobre","octobre","octobre","octobre","octobre","octobre","octobre","octobre","octobre","octobre","octobre","octobre","octobre","octobre",{"$f":"CHOOSE(MONTH(GZL5),\"janvier\",\"février\",\"mars\",\"avril\",\"mai\",\"juin\",\"juillet\",\"aout\",\"septembre\",\"octobre\",\"novembre\",\"décembre\")","v":"octobre"},"octobre","novembre","novembre","novembre","novembre","novembre","novembre","novembre","novembre","novembre","novembre","novembre","novembre","novembre","novembre","novembre","novembre","novembre","novembre","novembre","novembre","novembre","novembre","novembre","novembre","novembre","novembre","novembre","novembre","novembre","novembre","décembre","décembre","décembre","décembre","décembre","décembre","décembre","décembre","décembre","décembre","décembre","décembre","décembre","décembre","décembre","décembre","décembre","décembre","décembre","décembre","décembre","décembre","décembre","décembre","décembre","décembre","décembre","décembre","décembre","décembre","décembre","janvier",{"$f":"CHOOSE(MONTH(HBX5),\"janvier\",\"février\",\"mars\",\"avril\",\"mai\",\"juin\",\"juillet\",\"aout\",\"septembre\",\"octobre\",\"novembre\",\"décembre\")","v":"janvier"},"janvier","janvier","janvier","janvier","janvier","janvier","janvier","janvier","janvier","janvier","janvier","janvier","janvier","janvier","janvier","janvier","janvier","janvier","janvier","janvier","janvier","janvier","janvier","janvier","janvier","janvier","janvier","janvier","janvier","février","février","février","février","février","février","février","février","février","février","février","février","février","février","février","février","février","février","février","février","février","février","février","février","février","février","février","février","mars","mars","mars","mars","mars","mars",{"$f":"CHOOSE(MONTH(HEJ5),\"janvier\",\"février\",\"mars\",\"avril\",\"mai\",\"juin\",\"juillet\",\"aout\",\"septembre\",\"octobre\",\"novembre\",\"décembre\")","v":"mars"},"mars","mars","mars","mars","mars","mars","mars","mars","mars","mars","mars","mars","mars","mars","mars","mars","mars","mars","mars","mars","mars","mars","mars","mars","avril","avril","avril","avril","avril","avril","avril","avril","avril","avril","avril","avril","avril","avril","avril","avril","avril","avril","avril","avril","avril","avril","avril","avril","avril","avril","avril","avril","avril","avril","mai","mai","mai","mai","mai","mai","mai","mai","mai",{"$f":"CHOOSE(MONTH(HGV5),\"janvier\",\"février\",\"mars\",\"avril\",\"mai\",\"juin\",\"juillet\",\"aout\",\"septembre\",\"octobre\",\"novembre\",\"décembre\")","v":"mai"},"mai","mai","mai","mai","mai","mai","mai","mai","mai","mai","mai","mai","mai","mai","mai","mai","mai","mai","mai","mai","mai","juin","juin","juin","juin","juin","juin","juin","juin","juin","juin","juin","juin","juin","juin","juin","juin","juin","juin","juin","juin","juin","juin","juin","juin","juin","juin","juin","juin","juin","juin","juillet","juillet","juillet","juillet","juillet","juillet","juillet","juillet","juillet","juillet","juillet","juillet",{"$f":"CHOOSE(MONTH(HJH5),\"janvier\",\"février\",\"mars\",\"avril\",\"mai\",\"juin\",\"juillet\",\"aout\",\"septembre\",\"octobre\",\"novembre\",\"décembre\")","v":"juillet"},"juillet","juillet","juillet","juillet","juillet","juillet","juillet","juillet","juillet","juillet","juillet","juillet","juillet","juillet","juillet","juillet","juillet","juillet","aout","aout","aout","aout","aout","aout","aout","aout","aout","aout","aout","aout","aout","aout","aout","aout","aout","aout","aout","aout","aout","aout","aout","aout","aout","aout","aout","aout","aout","aout","aout","septembre","septembre","septembre","septembre","septembre","septembre","septembre","septembre","septembre","septembre","septembre","septembre","septembre","septembre",{"$f":"CHOOSE(MONTH(HLT5),\"janvier\",\"février\",\"mars\",\"avril\",\"mai\",\"juin\",\"juillet\",\"aout\",\"septembre\",\"octobre\",\"novembre\",\"décembre\")","v":"septembre"},"septembre","septembre","septembre","septembre","septembre","septembre","septembre","septembre","septembre","septembre","septembre","septembre","septembre","septembre","septembre","octobre","octobre","octobre","octobre","octobre","octobre","octobre","octobre","octobre","octobre","octobre","octobre","octobre","octobre","octobre","octobre","octobre","octobre","octobre","octobre","octobre","octobre","octobre","octobre","octobre","octobre","octobre","octobre","octobre","octobre","octobre","novembre","novembre","novembre","novembre","novembre","novembre","novembre","novembre","novembre","novembre","novembre","novembre","novembre","novembre","novembre","novembre","novembre",{"$f":"CHOOSE(MONTH(HOF5),\"janvier\",\"février\",\"mars\",\"avril\",\"mai\",\"juin\",\"juillet\",\"aout\",\"septembre\",\"octobre\",\"novembre\",\"décembre\")","v":"novembre"},"novembre","novembre","novembre","novembre","novembre","novembre","novembre","novembre","novembre","novembre","novembre","novembre","décembre","décembre","décembre","décembre","décembre","décembre","décembre","décembre","décembre","décembre","décembre","décembre","décembre","décembre","décembre","décembre","décembre","décembre","décembre","décembre","décembre","décembre","décembre","décembre","décembre","décembre","décembre","décembre","décembre","décembre","décembre","janvier","janvier","janvier","janvier","janvier","janvier","janvier","janvier","janvier","janvier","janvier","janvier","janvier","janvier","janvier","janvier","janvier","janvier","janvier","janvier",{"$f":"CHOOSE(MONTH(HQR5),\"janvier\",\"février\",\"mars\",\"avril\",\"mai\",\"juin\",\"juillet\",\"aout\",\"septembre\",\"octobre\",\"novembre\",\"décembre\")","v":"janvier"},"janvier","janvier","janvier","janvier","janvier","janvier","janvier","janvier","janvier","janvier","février","février","février","février","février","février","février","février","février","février","février","février","février","février","février","février","février","février","février","février","février","février","février","février","février","février","février","février","février","mars","mars","mars","mars","mars","mars","mars","mars","mars","mars","mars","mars","mars","mars","mars","mars","mars","mars","mars","mars","mars","mars","mars","mars",{"$f":"CHOOSE(MONTH(HTD5),\"janvier\",\"février\",\"mars\",\"avril\",\"mai\",\"juin\",\"juillet\",\"aout\",\"septembre\",\"octobre\",\"novembre\",\"décembre\")","v":"mars"},"mars","mars","mars","mars","mars","mars","avril","avril","avril","avril","avril","avril","avril","avril","avril","avril","avril","avril","avril","avril","avril","avril","avril","avril","avril","avril","avril","avril","avril","avril","avril","avril","avril","avril","avril","avril","mai","mai","mai","mai","mai","mai","mai","mai","mai","mai","mai","mai","mai","mai","mai","mai","mai","mai","mai","mai","mai","mai","mai","mai","mai","mai","mai",{"$f":"CHOOSE(MONTH(HVP5),\"janvier\",\"février\",\"mars\",\"avril\",\"mai\",\"juin\",\"juillet\",\"aout\",\"septembre\",\"octobre\",\"novembre\",\"décembre\")","v":"mai"},"mai","mai","mai","juin","juin","juin","juin","juin","juin","juin","juin","juin","juin","juin","juin","juin","juin","juin","juin","juin","juin","juin","juin","juin","juin","juin","juin","juin","juin","juin","juin","juin","juin","juillet","juillet","juillet","juillet","juillet","juillet","juillet","juillet","juillet","juillet","juillet","juillet","juillet","juillet","juillet","juillet","juillet","juillet","juillet","juillet","juillet","juillet","juillet","juillet","juillet","juillet","juillet","juillet","juillet","juillet",{"$f":"CHOOSE(MONTH(HYB5),\"janvier\",\"février\",\"mars\",\"avril\",\"mai\",\"juin\",\"juillet\",\"aout\",\"septembre\",\"octobre\",\"novembre\",\"décembre\")","v":"juillet"},"aout","aout","aout","aout","aout","aout","aout","aout","aout","aout","aout","aout","aout","aout","aout","aout","aout","aout","aout","aout","aout","aout","aout","aout","aout","aout","aout","aout","aout","aout","aout","septembre","septembre","septembre","septembre","septembre","septembre","septembre","septembre","septembre","septembre","septembre","septembre","septembre","septembre","septembre","septembre","septembre","septembre","septembre","septembre","septembre","septembre","septembre","septembre","septembre","septembre","septembre","septembre","septembre","septembre","octobre","octobre",{"$f":"CHOOSE(MONTH(IAN5),\"janvier\",\"février\",\"mars\",\"avril\",\"mai\",\"juin\",\"juillet\",\"aout\",\"septembre\",\"octobre\",\"novembre\",\"décembre\")","v":"octobre"},"octobre","octobre","octobre","octobre","octobre","octobre","octobre","octobre","octobre","octobre","octobre","octobre","octobre","octobre","octobre","octobre","octobre","octobre","octobre","octobre","octobre","octobre","octobre","octobre","octobre","octobre","octobre","octobre","novembre","novembre","novembre","novembre","novembre","novembre","novembre","novembre","novembre","novembre","novembre","novembre","novembre","novembre","novembre","novembre","novembre","novembre","novembre","novembre","novembre","novembre","novembre","novembre","novembre","novembre","novembre","novembre","novembre","novembre","décembre","décembre","décembre","décembre","décembre",{"$f":"CHOOSE(MONTH(ICZ5),\"janvier\",\"février\",\"mars\",\"avril\",\"mai\",\"juin\",\"juillet\",\"aout\",\"septembre\",\"octobre\",\"novembre\",\"décembre\")","v":"décembre"},"décembre","décembre","décembre","décembre","décembre","décembre","décembre","décembre","décembre","décembre","décembre","décembre","décembre","décembre","décembre","décembre","décembre","décembre","décembre","décembre","décembre","décembre","décembre","décembre","décembre","janvier","janvier","janvier","janvier","janvier","janvier","janvier","janvier","janvier","janvier","janvier","janvier","janvier","janvier","janvier","janvier","janvier","janvier","janvier","janvier","janvier","janvier","janvier","janvier","janvier","janvier","janvier","janvier","janvier","janvier","janvier","février","février","février","février","février","février","février",{"$f":"CHOOSE(MONTH(IFL5),\"janvier\",\"février\",\"mars\",\"avril\",\"mai\",\"juin\",\"juillet\",\"aout\",\"septembre\",\"octobre\",\"novembre\",\"décembre\")","v":"février"},"février","février","février","février","février","février","février","février","février","février","février","février","février","février","février","février","février","février","février","février","mars","mars","mars","mars","mars","mars","mars","mars","mars","mars","mars","mars","mars","mars","mars","mars","mars","mars","mars","mars","mars","mars","mars","mars","mars","mars","mars","mars","mars","mars","mars","avril","avril","avril","avril","avril","avril","avril","avril","avril","avril","avril","avril",{"$f":"CHOOSE(MONTH(IHX5),\"janvier\",\"février\",\"mars\",\"avril\",\"mai\",\"juin\",\"juillet\",\"aout\",\"septembre\",\"octobre\",\"novembre\",\"décembre\")","v":"avril"},"avril","avril","avril","avril","avril","avril","avril","avril","avril","avril","avril","avril","avril","avril","avril","avril","avril","mai","mai","mai","mai","mai","mai","mai","mai","mai","mai","mai","mai","mai","mai","mai","mai","mai","mai","mai","mai","mai","mai","mai","mai","mai","mai","mai","mai","mai","mai","mai","juin","juin","juin","juin","juin","juin","juin","juin","juin","juin","juin","juin","juin","juin","juin",{"$f":"CHOOSE(MONTH(IKJ5),\"janvier\",\"février\",\"mars\",\"avril\",\"mai\",\"juin\",\"juillet\",\"aout\",\"septembre\",\"octobre\",\"novembre\",\"décembre\")","v":"juin"},"juin","juin","juin","juin","juin","juin","juin","juin","juin","juin","juin","juin","juin","juin","juillet","juillet","juillet","juillet","juillet","juillet","juillet","juillet","juillet","juillet","juillet","juillet","juillet","juillet","juillet","juillet","juillet","juillet","juillet","juillet","juillet","juillet","juillet","juillet","juillet","juillet","juillet","juillet","juillet","juillet","juillet","aout","aout","aout","aout","aout","aout","aout","aout","aout","aout","aout","aout","aout","aout","aout","aout","aout","aout",{"$f":"CHOOSE(MONTH(IMV5),\"janvier\",\"février\",\"mars\",\"avril\",\"mai\",\"juin\",\"juillet\",\"aout\",\"septembre\",\"octobre\",\"novembre\",\"décembre\")","v":"aout"},"aout","aout","aout","aout","aout","aout","aout","aout","aout","aout","aout","aout","septembre","septembre","septembre","septembre","septembre","septembre","septembre","septembre","septembre","septembre","septembre","septembre","septembre","septembre","septembre","septembre","septembre","septembre","septembre","septembre","septembre","septembre","septembre","septembre","septembre","septembre","septembre","septembre","septembre","septembre","octobre","octobre","octobre","octobre","octobre","octobre","octobre","octobre","octobre","octobre","octobre","octobre","octobre","octobre","octobre","octobre","octobre","octobre","octobre","octobre","octobre",{"$f":"CHOOSE(MONTH(IPH5),\"janvier\",\"février\",\"mars\",\"avril\",\"mai\",\"juin\",\"juillet\",\"aout\",\"septembre\",\"octobre\",\"novembre\",\"décembre\")","v":"octobre"},"octobre","octobre","octobre","octobre","octobre","octobre","octobre","octobre","octobre","novembre","novembre","novembre","novembre","novembre","novembre","novembre","novembre","novembre","novembre","novembre","novembre","novembre","novembre","novembre","novembre","novembre","novembre","novembre","novembre","novembre","novembre","novembre","novembre","novembre","novembre","novembre","novembre","novembre","novembre","décembre","décembre","décembre","décembre","décembre","décembre","décembre","décembre","décembre","décembre","décembre","décembre","décembre","décembre","décembre","décembre","décembre","décembre","décembre","décembre","décembre","décembre","décembre","décembre",{"$f":"CHOOSE(MONTH(IRT5),\"janvier\",\"février\",\"mars\",\"avril\",\"mai\",\"juin\",\"juillet\",\"aout\",\"septembre\",\"octobre\",\"novembre\",\"décembre\")","v":"décembre"},"décembre","décembre","décembre","décembre","décembre","décembre","janvier","janvier","janvier","janvier","janvier","janvier","janvier","janvier","janvier","janvier","janvier","janvier","janvier","janvier","janvier","janvier","janvier","janvier","janvier","janvier","janvier","janvier","janvier","janvier","janvier","janvier","janvier","janvier","janvier","janvier","janvier","février","février","février","février","février","février","février","février","février","février","février","février","février","février","février","février","février","février","février","février","février","février","février","février","février","février",{"$f":"CHOOSE(MONTH(IUF5),\"janvier\",\"février\",\"mars\",\"avril\",\"mai\",\"juin\",\"juillet\",\"aout\",\"septembre\",\"octobre\",\"novembre\",\"décembre\")","v":"février"},"février","mars","mars","mars","mars","mars","mars","mars","mars","mars","mars","mars","mars","mars","mars","mars","mars","mars","mars","mars","mars","mars","mars","mars","mars","mars","mars","mars","mars","mars","mars","mars","avril","avril","avril","avril","avril","avril","avril","avril","avril","avril","avril","avril","avril","avril","avril","avril","avril","avril","avril","avril","avril","avril","avril","avril","avril","avril","avril","avril","avril","avril","mai",{"$f":"CHOOSE(MONTH(IWR5),\"janvier\",\"février\",\"mars\",\"avril\",\"mai\",\"juin\",\"juillet\",\"aout\",\"septembre\",\"octobre\",\"novembre\",\"décembre\")","v":"mai"},"mai","mai","mai","mai","mai","mai","mai","mai","mai","mai","mai","mai","mai","mai","mai","mai","mai","mai","mai","mai","mai","mai","mai","mai","mai","mai","mai","mai","mai","juin","juin","juin","juin","juin","juin","juin","juin","juin","juin","juin","juin","juin","juin","juin","juin","juin","juin","juin","juin","juin","juin","juin","juin","juin","juin","juin","juin","juin","juin","juillet","juillet","juillet","juillet",{"$f":"CHOOSE(MONTH(IZD5),\"janvier\",\"février\",\"mars\",\"avril\",\"mai\",\"juin\",\"juillet\",\"aout\",\"septembre\",\"octobre\",\"novembre\",\"décembre\")","v":"juillet"},"juillet","juillet","juillet","juillet","juillet","juillet","juillet","juillet","juillet","juillet","juillet","juillet","juillet","juillet","juillet","juillet","juillet","juillet","juillet","juillet","juillet","juillet","juillet","juillet","juillet","juillet","aout","aout","aout","aout","aout","aout","aout","aout","aout","aout","aout","aout","aout","aout","aout","aout","aout","aout","aout","aout","aout","aout","aout","aout","aout","aout","aout","aout","aout","aout","aout","septembre","septembre","septembre","septembre","septembre","septembre",{"$f":"CHOOSE(MONTH(JBP5),\"janvier\",\"février\",\"mars\",\"avril\",\"mai\",\"juin\",\"juillet\",\"aout\",\"septembre\",\"octobre\",\"novembre\",\"décembre\")","v":"septembre"},"septembre","septembre","septembre","septembre","septembre","septembre","septembre","septembre","septembre","septembre","septembre","septembre","septembre","septembre","septembre","septembre","septembre","septembre","septembre","septembre","septembre","septembre","septembre","octobre","octobre","octobre","octobre","octobre","octobre","octobre","octobre","octobre","octobre","octobre","octobre","octobre","octobre","octobre","octobre","octobre","octobre","octobre","octobre","octobre","octobre","octobre","octobre","octobre","octobre","octobre","octobre","octobre","octobre","octobre","novembre","novembre","novembre","novembre","novembre","novembre","novembre","novembre","novembre",{"$f":"CHOOSE(MONTH(JEB5),\"janvier\",\"février\",\"mars\",\"avril\",\"mai\",\"juin\",\"juillet\",\"aout\",\"septembre\",\"octobre\",\"novembre\",\"décembre\")","v":"novembre"},"novembre","novembre","novembre","novembre","novembre","novembre","novembre","novembre","novembre","novembre","novembre","novembre","novembre","novembre","novembre","novembre","novembre","novembre","novembre","novembre","décembre","décembre","décembre","décembre","décembre","décembre","décembre","décembre","décembre","décembre","décembre","décembre","décembre","décembre","décembre","décembre","décembre","décembre","décembre","décembre","décembre","décembre","décembre","décembre","décembre","décembre","décembre","décembre","décembre","décembre","décembre","janvier","janvier","janvier","janvier","janvier","janvier","janvier","janvier","janvier","janvier","janvier","janvier",{"$f":"CHOOSE(MONTH(JGN5),\"janvier\",\"février\",\"mars\",\"avril\",\"mai\",\"juin\",\"juillet\",\"aout\",\"septembre\",\"octobre\",\"novembre\",\"décembre\")","v":"janvier"},"janvier","janvier","janvier","janvier","janvier","janvier","janvier","janvier","janvier","janvier","janvier","janvier","janvier","janvier","janvier","janvier","janvier","janvier","février","février","février","février","février","février","février","février","février","février","février","février","février","février","février","février","février","février","février","février","février","février","février","février","février","février","février","février","mars","mars","mars","mars","mars","mars","mars","mars","mars","mars","mars","mars","mars","mars","mars","mars","mars",{"$f":"CHOOSE(MONTH(JIZ5),\"janvier\",\"février\",\"mars\",\"avril\",\"mai\",\"juin\",\"juillet\",\"aout\",\"septembre\",\"octobre\",\"novembre\",\"décembre\")","v":"mars"},"mars","mars","mars","mars","mars","mars","mars","mars","mars","mars","mars","mars","mars","avril","avril","avril","avril","avril","avril","avril","avril","avril","avril","avril","avril","avril","avril","avril","avril","avril","avril","avril","avril","avril","avril","avril","avril","avril","avril","avril","avril","avril","avril","mai","mai","mai","mai","mai","mai","mai","mai","mai","mai","mai","mai","mai","mai","mai","mai","mai","mai","mai","mai",{"$f":"CHOOSE(MONTH(JLL5),\"janvier\",\"février\",\"mars\",\"avril\",\"mai\",\"juin\",\"juillet\",\"aout\",\"septembre\",\"octobre\",\"novembre\",\"décembre\")","v":"mai"},"mai","mai","mai","mai","mai","mai","mai","mai","mai","mai","juin","juin","juin","juin","juin","juin","juin","juin","juin","juin","juin","juin","juin","juin","juin","juin","juin","juin","juin","juin","juin","juin","juin","juin","juin","juin","juin","juin","juin","juin","juillet","juillet","juillet","juillet","juillet","juillet","juillet","juillet","juillet","juillet","juillet","juillet","juillet","juillet","juillet","juillet","juillet","juillet","juillet","juillet","juillet","juillet","juillet",{"$f":"CHOOSE(MONTH(JNX5),\"janvier\",\"février\",\"mars\",\"avril\",\"mai\",\"juin\",\"juillet\",\"aout\",\"septembre\",\"octobre\",\"novembre\",\"décembre\")","v":"juillet"},"juillet","juillet","juillet","juillet","juillet","juillet","juillet","aout","aout","aout","aout","aout","aout","aout","aout","aout","aout","aout","aout","aout","aout","aout","aout","aout","aout","aout","aout","aout","aout","aout","aout","aout","aout","aout","aout","aout","aout","aout","septembre","septembre","septembre","septembre","septembre","septembre","septembre","septembre","septembre","septembre","septembre","septembre","septembre","septembre","septembre","septembre","septembre","septembre","septembre","septembre","septembre","septembre","septembre","septembre","septembre",{"$f":"CHOOSE(MONTH(JQJ5),\"janvier\",\"février\",\"mars\",\"avril\",\"mai\",\"juin\",\"juillet\",\"aout\",\"septembre\",\"octobre\",\"novembre\",\"décembre\")","v":"septembre"},"septembre","septembre","septembre","septembre","octobre","octobre","octobre","octobre","octobre","octobre","octobre","octobre","octobre","octobre","octobre","octobre","octobre","octobre","octobre","octobre","octobre","octobre","octobre","octobre","octobre","octobre","octobre","octobre","octobre","octobre","octobre","octobre","octobre","octobre","octobre","novembre","novembre","novembre","novembre","novembre","novembre","novembre","novembre","novembre","novembre","novembre","novembre","novembre","novembre","novembre","novembre","novembre","novembre","novembre","novembre","novembre","novembre","novembre","novembre","novembre","novembre","novembre","novembre",{"$f":"CHOOSE(MONTH(JSV5),\"janvier\",\"février\",\"mars\",\"avril\",\"mai\",\"juin\",\"juillet\",\"aout\",\"septembre\",\"octobre\",\"novembre\",\"décembre\")","v":"novembre"},"novembre","décembre","décembre","décembre","décembre","décembre","décembre","décembre","décembre","décembre","décembre","décembre","décembre","décembre","décembre","décembre","décembre","décembre","décembre","décembre","décembre","décembre","décembre","décembre","décembre","décembre","décembre","décembre","décembre","décembre","décembre","décembre","janvier"]
[{"$nulls":3},{"$f":"CONCATENATE(\"S\",WEEKNUM(D5,2))","v":"S1"},{"$f":"CONCATENATE(\"S\",WEEKNUM(E5,2))","v":"S1"},"S1","S1","S1","S2","S2","S2","S2","S2","S2","S2","S3","S3","S3","S3","S3","S3","S3","S4","S4","S4","S4","S4","S4","S4","S5","S5","S5","S5","S5","S5","S5","S6","S6","S6","S6","S6","S6","S6","S7","S7","S7","S7","S7","S7","S7","S8","S8","S8","S8","S8","S8","S8","S9","S9","S9","S9","S9","S9","S9","S10","S10","S10","S10",{"$f":"CONCATENATE(\"S\",WEEKNUM(BQ5,2))","v":"S10"},"S10","S10","S11","S11","S11","S11","S11","S11","S11","S12","S12","S12","S12","S12","S12","S12","S13","S13","S13","S13","S13","S13","S13","S14","S14","S14","S14","S14","S14","S14","S15","S15","S15","S15","S15","S15","S15","S16","S16","S16","S16","S16","S16","S16","S17","S17","S17","S17","S17","S17","S17","S18","S18","S18","S18","S18","S18","S18","S19","S19","S19","S19","S19",{"$f":"CONCATENATE(\"S\",WEEKNUM(EC5,2))","v":"S19"},"S19","S20","S20","S20","S20","S20","S20","S20","S21","S21","S21","S21","S21","S21","S21","S22","S22","S22","S22","S22","S22","S22","S23","S23","S23","S23","S23","S23","S23","S24","S24","S24","S24","S24","S24","S24","S25","S25","S25","S25","S25","S25","S25","S26","S26","S26","S26","S26","S26","S26","S27","S27","S27","S27","S27","S27","S27","S28","S28","S28","S28","S28","S28",{"$f":"CONCATENATE(\"S\",WEEKNUM(GO5,2))","v":"S28"},"S29","S29","S29","S29","S29","S29","S29","S30","S30","S30","S30","S30","S30","S30","S31","S31","S31","S31","S31","S31","S31","S32","S32","S32","S32","S32","S32","S32","S33","S33","S33","S33","S33","S33","S33","S34","S34","S34","S34","S34","S34","S34","S35","S35","S35","S35","S35","S35","S35","S36","S36","S36","S36","S36","S36","S36","S37","S37","S37","S37","S37","S37","S37",{"$f":"CONCATENATE(\"S\",WEEKNUM(JA5,2))","v":"S38"},"S38","S38","S38","S38","S38","S38","S39","S39","S39","S39","S39","S39","S39","S40","S40","S40","S40","S40","S40","S40","S41","S41","S41","S41","S41","S41","S41","S42","S42","S42","S42","S42","S42","S42","S43","S43","S43","S43","S43","S43","S43","S44","S44","S44","S44","S44","S44","S44","S45","S45","S45","S45","S45","S45","S45","S46","S46","S46","S46","S46","S46","S46","S47",{"$f":"CONCATENATE(\"S\",WEEKNUM(LM5,2))","v":"S47"},"S47","S47","S47","S47","S47","S48","S48","S48","S48","S48","S48","S48","S49","S49","S49","S49","S49","S49","S49","S50","S50","S50","S50","S50","S50","S50","S51","S51","S51","S51","S51","S51","S51","S52","S52","S52","S52","S52","S52","S52","S53","S53","S53","S53","S1","S1","S1","S2","S2","S2","S2","S2","S2","S2","S3","S3","S3","S3","S3","S3","S3","S4","S4",{"$f":"CONCATENATE(\"S\",WEEKNUM(NY5,2))","v":"S4"},"S4","S4","S4","S4","S5","S5","S5","S5","S5","S5","S5","S6","S6","S6","S6","S6","S6","S6","S7","S7","S7","S7","S7","S7","S7","S8","S8","S8","S8","S8","S8","S8","S9","S9","S9","S9","S9","S9","S9","S10","S10","S10","S10","S10","S10","S10","S11","S11","S11","S11","S11","S11","S11","S12","S12","S12","S12","S12","S12","S12","S13","S13","S13",{"$f":"CONCATENATE(\"S\",WEEKNUM(QK5,2))","v":"S13"},"S13","S13","S13","S14","S14","S14","S14","S14","S14","S14","S15","S15","S15","S15","S15","S15","S15","S16","S16","S16","S16","S16","S16","S16","S17","S17","S17","S17","S17","S17","S17","S18","S18","S18","S18","S18","S18","S18","S19","S19","S19","S19","S19","S19","S19","S20","S20","S20","S20","S20","S20","S20","S21","S21","S21","S21","S21","S21","S21","S22","S22","S22","S22",{"$f":"CONCATENATE(\"S\",WEEKNUM(SW5,2))","v":"S22"},"S22","S22","S23","S23","S23","S23","S23","S23","S23","S24","S24","S24","S24","S24","S24","S24","S25","S25","S25","S25","S25","S25","S25","S26","S26","S26","S26","S26","S26","S26","S27","S27","S27","S27","S27","S27","S27","S28","S28","S28","S28","S28","S28","S28","S29","S29","S29","S29","S29","S29","S29","S30","S30","S30","S30","S30","S30","S30","S31","S31","S31","S31","S31",{"$f":"CONCATENATE(\"S\",WEEKNUM(VI5,2))","v":"S31"},"S31","S32","S32","S32","S32","S32","S32","S32","S33","S33","S33","S33","S33","S33","S33","S34","S34","S34","S34","S34","S34","S34","S35","S35","S35","S35","S35","S35","S35","S36","S36","S36","S36","S36","S36","S36","S37","S37","S37","S37","S37","S37","S37","S38","S38","S38","S38","S38","S38","S38","S39","S39","S39","S39","S39","S39","S39","S40","S40","S40","S40","S40","S40",{"$f":"CONCATENATE(\"S\",WEEKNUM(XU5,2))","v":"S40"},"S41","S41","S41","S41","S41","S41","S41","S42","S42","S42","S42","S42","S42","S42","S43","S43","S43","S43","S43","S43","S43","S44","S44","S44","S44","S44","S44","S44","S45","S45","S45","S45","S45","S45","S45","S46","S46","S46","S46","S46","S46","S46","S47","S47","S47","S47","S47","S47","S47","S48","S48","S48","S48","S48","S48","S48","S49","S49","S49","S49","S49","S49","S49",{"$f":"CONCATENATE(\"S\",WEEKNUM(AAG5,2))","v":"S50"},"S50","S50","S50","S50","S50","S50","S51","S51","S51","S51","S51","S51","S51","S52","S52","S52","S52","S52","S52","S52","S53","S53","S53","S53","S53","S1","S1","S2","S2","S2","S2","S2","S2","S2","S3","S3","S3","S3","S3","S3","S3","S4","S4","S4","S4","S4","S4","S4","S5","S5","S5","S5","S5","S5","S5","S6","S6","S6","S6","S6","S6","S6","S7",{"$f":"CONCATENATE(\"S\",WEEKNUM(ACS5,2))","v":"S7"},"S7","S7","S7","S7","S7","S8","S8","S8","S8","S8","S8","S8","S9","S9","S9","S9","S9","S9","S9","S10","S10","S10","S10","S10","S10","S10","S11","S11","S11","S11","S11","S11","S11","S12","S12","S12","S12","S12","S12","S12","S13","S13","S13","S13","S13","S13","S13","S14","S14","S14","S14","S14","S14","S14","S15","S15","S15","S15","S15","S15","S15","S16","S16",{"$f":"CONCATENATE(\"S\",WEEKNUM(AFE5,2))","v":"S16"},"S16","S16","S16","S16","S17","S17","S17","S17","S17","S17","S17","S18","S18","S18","S18","S18","S18","S18","S19","S19","S19","S19","S19","S19","S19","S20","S20","S20","S20","S20","S20","S20","S21","S21","S21","S21","S21","S21","S21","S22","S22","S22","S22","S22","S22","S22","S23","S23","S23","S23","S23","S23","S23","S24","S24","S24","S24","S24","S24","S24","S25","S25","S25",{"$f":"CONCATENATE(\"S\",WEEKNUM(AHQ5,2))","v":"S25"},"S25","S25","S25","S26","S26","S26","S26","S26","S26","S26","S27","S27","S27","S27","S27","S27","S27","S28","S28","S28","S28","S28","S28","S28","S29","S29","S29","S29","S29","S29","S29","S30","S30","S30","S30","S30","S30","S30","S31","S31","S31","S31","S31","S31","S31","S32","S32","S32","S32","S32","S32","S32","S33","S33","S33","S33","S33","S33","S33","S34","S34","S34","S34",{"$f":"CONCATENATE(\"S\",WEEKNUM(AKC5,2))","v":"S34"},"S34","S34","S35","S35","S35","S35","S35","S35","S35","S36","S36","S36","S36","S36","S36","S36","S37","S37","S37","S37","S37","S37","S37","S38","S38","S38","S38","S38","S38","S38","S39","S39","S39","S39","S39","S39","S39","S40","S40","S40","S40","S40","S40","S40","S41","S41","S41","S41","S41","S41","S41","S42","S42","S42","S42","S42","S42","S42","S43","S43","S43","S43","S43",{"$f":"CONCATENATE(\"S\",WEEKNUM(AMO5,2))","v":"S43"},"S43","S44","S44","S44","S44","S44","S44","S44","S45","S45","S45","S45","S45","S45","S45","S46","S46","S46","S46","S46","S46","S46","S47","S47","S47","S47","S47","S47","S47","S48","S48","S48","S48","S48","S48","S48","S49","S49","S49","S49","S49","S49","S49","S50","S50","S50","S50","S50","S50","S50","S51","S51","S51","S51","S51","S51","S51","S52","S52","S52","S52","S52","S52",{"$f":"CONCATENATE(\"S\",WEEKNUM(APA5,2))","v":"S52"},"S53","S53","S53","S53","S53","S53","S1","S2","S2","S2","S2","S2","S2","S2","S3","S3","S3","S3","S3","S3","S3","S4","S4","S4","S4","S4","S4","S4","S5","S5","S5","S5","S5","S5","S5","S6","S6","S6","S6","S6","S6","S6","S7","S7","S7","S7","S7","S7","S7","S8","S8","S8","S8","S8","S8","S8","S9","S9","S9","S9","S9","S9","S9",{"$f":"CONCATENATE(\"S\",WEEKNUM(ARM5,2))","v":"S10"},"S10","S10","S10","S10","S10","S10","S11","S11","S11","S11","S11","S11","S11","S12","S12","S12","S12","S12","S12","S12","S13","S13","S13","S13","S13","S13","S13","S14","S14","S14","S14","S14","S14","S14","S15","S15","S15","S15","S15","S15","S15","S16","S16","S16","S16","S16","S16","S16","S17","S17","S17","S17","S17","S17","S17","S18","S18","S18","S18","S18","S18","S18","S19",{"$f":"CONCATENATE(\"S\",WEEKNUM(ATY5,2))","v":"S19"},"S19","S19","S19","S19","S19","S20","S20","S20","S20","S20","S20","S20","S21","S21","S21","S21","S21","S21","S21","S22","S22","S22","S22","S22","S22","S22","S23","S23","S23","S23","S23","S23","S23","S24","S24","S24","S24","S24","S24","S24","S25","S25","S25","S25","S25","S25","S25","S26","S26","S26","S26","S26","S26","S26","S27","S27","S27","S27","S27","S27","S27","S28","S28",{"$f":"CONCATENATE(\"S\",WEEKNUM(AWK5,2))","v":"S28"},"S28","S28","S28","S28","S29","S29","S29","S29","S29","S29","S29","S30","S30","S30","S30","S30","S30","S30","S31","S31","S31","S31","S31","S31","S31","S32","S32","S32","S32","S32","S32","S32","S33","S33","S33","S33","S33","S33","S33","S34","S34","S34","S34","S34","S34","S34","S35","S35","S35","S35","S35","S35","S35","S36","S36","S36","S36","S36","S36","S36","S37","S37","S37",{"$f":"CONCATENATE(\"S\",WEEKNUM(AYW5,2))","v":"S37"},"S37","S37","S37","S38","S38","S38","S38","S38","S38","S38","S39","S39","S39","S39","S39","S39","S39","S40","S40","S40","S40","S40","S40","S40","S41","S41","S41","S41","S41","S41","S41","S42","S42","S42","S42","S42","S42","S42","S43","S43","S43","S43","S43","S43","S43","S44","S44","S44","S44","S44","S44","S44","S45","S45","S45","S45","S45","S45","S45","S46","S46","S46","S46",{"$f":"CONCATENATE(\"S\",WEEKNUM(BBI5,2))","v":"S46"},"S46","S46","S47","S47","S47","S47","S47","S47","S47","S48","S48","S48","S48","S48","S48","S48","S49","S49","S49","S49","S49","S49","S49","S50","S50","S50","S50","S50","S50","S50","S51","S51","S51","S51","S51","S51","S51","S52","S52","S52","S52","S52","S52","S52","S53","S53","S53","S53","S53","S53","S53","S1","S1","S1","S1","S1","S1","S1","S2","S2","S2","S2","S2",{"$f":"CONCATENATE(\"S\",WEEKNUM(BDU5,2))","v":"S2"},"S2","S3","S3","S3","S3","S3","S3","S3","S4","S4","S4","S4","S4","S4","S4","S5","S5","S5","S5","S5","S5","S5","S6","S6","S6","S6","S6","S6","S6","S7","S7","S7","S7","S7","S7","S7","S8","S8","S8","S8","S8","S8","S8","S9","S9","S9","S9","S9","S9","S9","S10","S10","S10","S10","S10","S10","S10","S11","S11","S11","S11","S11","S11",{"$f":"CONCATENATE(\"S\",WEEKNUM(BGG5,2))","v":"S11"},"S12","S12","S12","S12","S12","S12","S12","S13","S13","S13","S13","S13","S13","S13","S14","S14","S14","S14","S14","S14","S14","S15","S15","S15","S15","S15","S15","S15","S16","S16","S16","S16","S16","S16","S16","S17","S17","S17","S17","S17","S17","S17","S18","S18","S18","S18","S18","S18","S18","S19","S19","S19","S19","S19","S19","S19","S20","S20","S20","S20","S20","S20","S20",{"$f":"CONCATENATE(\"S\",WEEKNUM(BIS5,2))","v":"S21"},"S21","S21","S21","S21","S21","S21","S22","S22","S22","S22","S22","S22","S22","S23","S23","S23","S23","S23","S23","S23","S24","S24","S24","S24","S24","S24","S24","S25","S25","S25","S25","S25","S25","S25","S26","S26","S26","S26","S26","S26","S26","S27","S27","S27","S27","S27","S27","S27","S28","S28","S28","S28","S28","S28","S28","S29","S29","S29","S29","S29","S29","S29","S30",{"$f":"CONCATENATE(\"S\",WEEKNUM(BLE5,2))","v":"S30"},"S30","S30","S30","S30","S30","S31","S31","S31","S31","S31","S31","S31","S32","S32","S32","S32","S32","S32","S32","S33","S33","S33","S33","S33","S33","S33","S34","S34","S34","S34","S34","S34","S34","S35","S35","S35","S35","S35","S35","S35","S36","S36","S36","S36","S36","S36","S36","S37","S37","S37","S37","S37","S37","S37","S38","S38","S38","S38","S38","S38","S38","S39","S39",{"$f":"CONCATENATE(\"S\",WEEKNUM(BNQ5,2))","v":"S39"},"S39","S39","S39","S39","S40","S40","S40","S40","S40","S40","S40","S41","S41","S41","S41","S41","S41","S41","S42","S42","S42","S42","S42","S42","S42","S43","S43","S43","S43","S43","S43","S43","S44","S44","S44","S44","S44","S44","S44","S45","S45","S45","S45","S45","S45","S45","S46","S46","S46","S46","S46","S46","S46","S47","S47","S47","S47","S47","S47","S47","S48","S48","S48",{"$f":"CONCATENATE(\"S\",WEEKNUM(BQC5,2))","v":"S48"},"S48","S48","S48","S49","S49","S49","S49","S49","S49","S49","S50","S50","S50","S50","S50","S50","S50","S51","S51","S51","S51","S51","S51","S51","S52","S52","S52","S52","S52","S52","S52","S53","S53","S1","S1","S1","S1","S1","S2","S2","S2","S2","S2","S2","S2","S3","S3","S3","S3","S3","S3","S3","S4","S4","S4","S4","S4","S4","S4","S5","S5","S5","S5",{"$f":"CONCATENATE(\"S\",WEEKNUM(BSO5,2))","v":"S5"},"S5","S5","S6","S6","S6","S6","S6","S6","S6","S7","S7","S7","S7","S7","S7","S7","S8","S8","S8","S8","S8","S8","S8","S9","S9","S9","S9","S9","S9","S9","S10","S10","S10","S10","S10","S10","S10","S11","S11","S11","S11","S11","S11","S11","S12","S12","S12","S12","S12","S12","S12","S13","S13","S13","S13","S13","S13","S13","S14","S14","S14","S14","S14",{"$f":"CONCATENATE(\"S\",WEEKNUM(BVA5,2))","v":"S14"},"S14","S15","S15","S15","S15","S15","S15","S15","S16","S16","S16","S16","S16","S16","S16","S17","S17","S17","S17","S17","S17","S17","S18","S18","S18","S18","S18","S18","S18","S19","S19","S19","S19","S19","S19","S19","S20","S20","S20","S20","S20","S20","S20","S21","S21","S21","S21","S21","S21","S21","S22","S22","S22","S22","S22","S22","S22","S23","S23","S23","S23","S23","S23",{"$f":"CONCATENATE(\"S\",WEEKNUM(BXM5,2))","v":"S23"},"S24","S24","S24","S24","S24","S24","S24","S25","S25","S25","S25","S25","S25","S25","S26","S26","S26","S26","S26","S26","S26","S27","S27","S27","S27","S27","S27","S27","S28","S28","S28","S28","S28","S28","S28","S29","S29","S29","S29","S29","S29","S29","S30","S30","S30","S30","S30","S30","S30","S31","S31","S31","S31","S31","S31","S31","S32","S32","S32","S32","S32","S32","S32",{"$f":"CONCATENATE(\"S\",WEEKNUM(BZY5,2))","v":"S33"},"S33","S33","S33","S33","S33","S33","S34","S34","S34","S34","S34","S34","S34","S35","S35","S35","S35","S35","S35","S35","S36","S36","S36","S36","S36","S36","S36","S37","S37","S37","S37","S37","S37","S37","S38","S38","S38","S38","S38","S38","S38","S39","S39","S39","S39","S39","S39","S39","S40","S40","S40","S40","S40","S40","S40","S41","S41","S41","S41","S41","S41","S41","S42",{"$f":"CONCATENATE(\"S\",WEEKNUM(CCK5,2))","v":"S42"},"S42","S42","S42","S42","S42","S43","S43","S43","S43","S43","S43","S43","S44","S44","S44","S44","S44","S44","S44","S45","S45","S45","S45","S45","S45","S45","S46","S46","S46","S46","S46","S46","S46","S47","S47","S47","S47","S47","S47","S47","S48","S48","S48","S48","S48","S48","S48","S49","S49","S49","S49","S49","S49","S49","S50","S50","S50","S50","S50","S50","S50","S51","S51",{"$f":"CONCATENATE(\"S\",WEEKNUM(CEW5,2))","v":"S51"},"S51","S51","S51","S51","S52","S52","S52","S52","S52","S52","S52","S53","S53","S53","S1","S1","S1","S1","S2","S2","S2","S2","S2","S2","S2","S3","S3","S3","S3","S3","S3","S3","S4","S4","S4","S4","S4","S4","S4","S5","S5","S5","S5","S5","S5","S5","S6","S6","S6","S6","S6","S6","S6","S7","S7","S7","S7","S7","S7","S7","S8","S8","S8",{"$f":"CONCATENATE(\"S\",WEEKNUM(CHI5,2))","v":"S8"},"S8","S8","S8","S9","S9","S9","S9","S9","S9","S9","S10","S10","S10","S10","S10","S10","S10","S11","S11","S11","S11","S11","S11","S11","S12","S12","S12","S12","S12","S12","S12","S13","S13","S13","S13","S13","S13","S13","S14","S14","S14","S14","S14","S14","S14","S15","S15","S15","S15","S15","S15","S15","S16","S16","S16","S16","S16","S16","S16","S17","S17","S17","S17",{"$f":"CONCATENATE(\"S\",WEEKNUM(CJU5,2))","v":"S17"},"S17","S17","S18","S18","S18","S18","S18","S18","S18","S19","S19","S19","S19","S19","S19","S19","S20","S20","S20","S20","S20","S20","S20","S21","S21","S21","S21","S21","S21","S21","S22","S22","S22","S22","S22","S22","S22","S23","S23","S23","S23","S23","S23","S23","S24","S24","S24","S24","S24","S24","S24","S25","S25","S25","S25","S25","S25","S25","S26","S26","S26","S26","S26",{"$f":"CONCATENATE(\"S\",WEEKNUM(CMG5,2))","v":"S26"},"S26","S27","S27","S27","S27","S27","S27","S27","S28","S28","S28","S28","S28","S28","S28","S29","S29","S29","S29","S29","S29","S29","S30","S30","S30","S30","S30","S30","S30","S31","S31","S31","S31","S31","S31","S31","S32","S32","S32","S32","S32","S32","S32","S33","S33","S33","S33","S33","S33","S33","S34","S34","S34","S34","S34","S34","S34","S35","S35","S35","S35","S35","S35",{"$f":"CONCATENATE(\"S\",WEEKNUM(COS5,2))","v":"S35"},"S36","S36","S36","S36","S36","S36","S36","S37","S37","S37","S37","S37","S37","S37","S38","S38","S38","S38","S38","S38","S38","S39","S39","S39","S39","S39","S39","S39","S40","S40","S40","S40","S40","S40","S40","S41","S41","S41","S41","S41","S41","S41","S42","S42","S42","S42","S42","S42","S42","S43","S43","S43","S43","S43","S43","S43","S44","S44","S44","S44","S44","S44","S44",{"$f":"CONCATENATE(\"S\",WEEKNUM(CRE5,2))","v":"S45"},"S45","S45","S45","S45","S45","S45","S46","S46","S46","S46","S46","S46","S46","S47","S47","S47","S47","S47","S47","S47","S48","S48","S48","S48","S48","S48","S48","S49","S49","S49","S49","S49","S49","S49","S50","S50","S50","S50","S50","S50","S50","S51","S51","S51","S51","S51","S51","S51","S52","S52","S52","S52","S52","S52","S52","S53","S53","S53","S53","S1","S1","S1","S2",{"$f":"CONCATENATE(\"S\",WEEKNUM(CTQ5,2))","v":"S2"},"S2","S2","S2","S2","S2","S3","S3","S3","S3","S3","S3","S3","S4","S4","S4","S4","S4","S4","S4","S5","S5","S5","S5","S5","S5","S5","S6","S6","S6","S6","S6","S6","S6","S7","S7","S7","S7","S7","S7","S7","S8","S8","S8","S8","S8","S8","S8","S9","S9","S9","S9","S9","S9","S9","S10","S10","S10","S10","S10","S10","S10","S11","S11",{"$f":"CONCATENATE(\"S\",WEEKNUM(CWC5,2))","v":"S11"},"S11","S11","S11","S11","S12","S12","S12","S12","S12","S12","S12","S13","S13","S13","S13","S13","S13","S13","S14","S14","S14","S14","S14","S14","S14","S15","S15","S15","S15","S15","S15","S15","S16","S16","S16","S16","S16","S16","S16","S17","S17","S17","S17","S17","S17","S17","S18","S18","S18","S18","S18","S18","S18","S19","S19","S19","S19","S19","S19","S19","S20","S20","S20",{"$f":"CONCATENATE(\"S\",WEEKNUM(CYO5,2))","v":"S20"},"S20","S20","S20","S21","S21","S21","S21","S21","S21","S21","S22","S22","S22","S22","S22","S22","S22","S23","S23","S23","S23","S23","S23","S23","S24","S24","S24","S24","S24","S24","S24","S25","S25","S25","S25","S25","S25","S25","S26","S26","S26","S26","S26","S26","S26","S27","S27","S27","S27","S27","S27","S27","S28","S28","S28","S28","S28","S28","S28","S29","S29","S29","S29",{"$f":"CONCATENATE(\"S\",WEEKNUM(DBA5,2))","v":"S29"},"S29","S29","S30","S30","S30","S30","S30","S30","S30","S31","S31","S31","S31","S31","S31","S31","S32","S32","S32","S32","S32","S32","S32","S33","S33","S33","S33","S33","S33","S33","S34","S34","S34","S34","S34","S34","S34","S35","S35","S35","S35","S35","S35","S35","S36","S36","S36","S36","S36","S36","S36","S37","S37","S37","S37","S37","S37","S37","S38","S38","S38","S38","S38",{"$f":"CONCATENATE(\"S\",WEEKNUM(DDM5,2))","v":"S38"},"S38","S39","S39","S39","S39","S39","S39","S39","S40","S40","S40","S40","S40","S40","S40","S41","S41","S41","S41","S41","S41","S41","S42","S42","S42","S42","S42","S42","S42","S43","S43","S43","S43","S43","S43","S43","S44","S44","S44","S44","S44","S44","S44","S45","S45","S45","S45","S45","S45","S45","S46","S46","S46","S46","S46","S46","S46","S47","S47","S47","S47","S47","S47",{"$f":"CONCATENATE(\"S\",WEEKNUM(DFY5,2))","v":"S47"},"S48","S48","S48","S48","S48","S48","S48","S49","S49","S49","S49","S49","S49","S49","S50","S50","S50","S50","S50","S50","S50","S51","S51","S51","S51","S51","S51","S51","S52","S52","S52","S52","S52","S52","S52","S53","S53","S53","S53","S53","S1","S1","S2","S2","S2","S2","S2","S2","S2","S3","S3","S3","S3","S3","S3","S3","S4","S4","S4","S4","S4","S4","S4",{"$f":"CONCATENATE(\"S\",WEEKNUM(DIK5,2))","v":"S5"},"S5","S5","S5","S5","S5","S5","S6","S6","S6","S6","S6","S6","S6","S7","S7","S7","S7","S7","S7","S7","S8","S8","S8","S8","S8","S8","S8","S9","S9","S9","S9","S9","S9","S9","S10","S10","S10","S10","S10","S10","S10","S11","S11","S11","S11","S11","S11","S11","S12","S12","S12","S12","S12","S12","S12","S13","S13","S13","S13","S13","S13","S13","S14",{"$f":"CONCATENATE(\"S\",WEEKNUM(DKW5,2))","v":"S14"},"S14","S14","S14","S14","S14","S15","S15","S15","S15","S15","S15","S15","S16","S16","S16","S16","S16","S16","S16","S17","S17","S17","S17","S17","S17","S17","S18","S18","S18","S18","S18","S18","S18","S19","S19","S19","S19","S19","S19","S19","S20","S20","S20","S20","S20","S20","S20","S21","S21","S21","S21","S21","S21","S21","S22","S22","S22","S22","S22","S22","S22","S23","S23",{"$f":"CONCATENATE(\"S\",WEEKNUM(DNI5,2))","v":"S23"},"S23","S23","S23","S23","S24","S24","S24","S24","S24","S24","S24","S25","S25","S25","S25","S25","S25","S25","S26","S26","S26","S26","S26","S26","S26","S27","S27","S27","S27","S27","S27","S27","S28","S28","S28","S28","S28","S28","S28","S29","S29","S29","S29","S29","S29","S29","S30","S30","S30","S30","S30","S30","S30","S31","S31","S31","S31","S31","S31","S31","S32","S32","S32",{"$f":"CONCATENATE(\"S\",WEEKNUM(DPU5,2))","v":"S32"},"S32","S32","S32","S33","S33","S33","S33","S33","S33","S33","S34","S34","S34","S34","S34","S34","S34","S35","S35","S35","S35","S35","S35","S35","S36","S36","S36","S36","S36","S36","S36","S37","S37","S37","S37","S37","S37","S37","S38","S38","S38","S38","S38","S38","S38","S39","S39","S39","S39","S39","S39","S39","S40","S40","S40","S40","S40","S40","S40","S41","S41","S41","S41",{"$f":"CONCATENATE(\"S\",WEEKNUM(DSG5,2))","v":"S41"},"S41","S41","S42","S42","S42","S42","S42","S42","S42","S43","S43","S43","S43","S43","S43","S43","S44","S44","S44","S44","S44","S44","S44","S45","S45","S45","S45","S45","S45","S45","S46","S46","S46","S46","S46","S46","S46","S47","S47","S47","S47","S47","S47","S47","S48","S48","S48","S48","S48","S48","S48","S49","S49","S49","S49","S49","S49","S49","S50","S50","S50","S50","S50",{"$f":"CONCATENATE(\"S\",WEEKNUM(DUS5,2))","v":"S50"},"S50","S51","S51","S51","S51","S51","S51","S51","S52","S52","S52","S52","S52","S52","S52","S53","S53","S53","S53","S53","S53","S53","S1","S1","S1","S1","S1","S1","S1","S2","S2","S2","S2","S2","S2","S2","S3","S3","S3","S3","S3","S3","S3","S4","S4","S4","S4","S4","S4","S4","S5","S5","S5","S5","S5","S5","S5","S6","S6","S6","S6","S6","S6",{"$f":"CONCATENATE(\"S\",WEEKNUM(DXE5,2))","v":"S6"},"S7","S7","S7","S7","S7","S7","S7","S8","S8","S8","S8","S8","S8","S8","S9","S9","S9","S9","S9","S9","S9","S10","S10","S10","S10","S10","S10","S10","S11","S11","S11","S11","S11","S11","S11","S12","S12","S12","S12","S12","S12","S12","S13","S13","S13","S13","S13","S13","S13","S14","S14","S14","S14","S14","S14","S14","S15","S15","S15","S15","S15","S15","S15",{"$f":"CONCATENATE(\"S\",WEEKNUM(DZQ5,2))","v":"S16"},"S16","S16","S16","S16","S16","S16","S17","S17","S17","S17","S17","S17","S17","S18","S18","S18","S18","S18","S18","S18","S19","S19","S19","S19","S19","S19","S19","S20","S20","S20","S20","S20","S20","S20","S21","S21","S21","S21","S21","S21","S21","S22","S22","S22","S22","S22","S22","S22","S23","S23","S23","S23","S23","S23","S23","S24","S24","S24","S24","S24","S24","S24","S25",{"$f":"CONCATENATE(\"S\",WEEKNUM(ECC5,2))","v":"S25"},"S25","S25","S25","S25","S25","S26","S26","S26","S26","S26","S26","S26","S27","S27","S27","S27","S27","S27","S27","S28","S28","S28","S28","S28","S28","S28","S29","S29","S29","S29","S29","S29","S29","S30","S30","S30","S30","S30","S30","S30","S31","S31","S31","S31","S31","S31","S31","S32","S32","S32","S32","S32","S32","S32","S33","S33","S33","S33","S33","S33","S33","S34","S34",{"$f":"CONCATENATE(\"S\",WEEKNUM(EEO5,2))","v":"S34"},"S34","S34","S34","S34","S35","S35","S35","S35","S35","S35","S35","S36","S36","S36","S36","S36","S36","S36","S37","S37","S37","S37","S37","S37","S37","S38","S38","S38","S38","S38","S38","S38","S39","S39","S39","S39","S39","S39","S39","S40","S40","S40","S40","S40","S40","S40","S41","S41","S41","S41","S41","S41","S41","S42","S42","S42","S42","S42","S42","S42","S43","S43","S43",{"$f":"CONCATENATE(\"S\",WEEKNUM(EHA5,2))","v":"S43"},"S43","S43","S43","S44","S44","S44","S44","S44","S44","S44","S45","S45","S45","S45","S45","S45","S45","S46","S46","S46","S46","S46","S46","S46","S47","S47","S47","S47","S47","S47","S47","S48","S48","S48","S48","S48","S48","S48","S49","S49","S49","S49","S49","S49","S49","S50","S50","S50","S50","S50","S50","S50","S51","S51","S51","S51","S51","S51","S51","S52","S52","S52","S52",{"$f":"CONCATENATE(\"S\",WEEKNUM(EJM5,2))","v":"S52"},"S52","S52","S53","S1","S1","S1","S1","S1","S1","S2","S2","S2","S2","S2","S2","S2","S3","S3","S3","S3","S3","S3","S3","S4","S4","S4","S4","S4","S4","S4","S5","S5","S5","S5","S5","S5","S5","S6","S6","S6","S6","S6","S6","S6","S7","S7","S7","S7","S7","S7","S7","S8","S8","S8","S8","S8","S8","S8","S9","S9","S9","S9","S9",{"$f":"CONCATENATE(\"S\",WEEKNUM(ELY5,2))","v":"S9"},"S9","S10","S10","S10","S10","S10","S10","S10","S11","S11","S11","S11","S11","S11","S11","S12","S12","S12","S12","S12","S12","S12","S13","S13","S13","S13","S13","S13","S13","S14","S14","S14","S14","S14",{"$f":"CONCATENATE(\"S\",WEEKNUM(ENH5,2))","v":"S14"},"S14","S15","S15","S15","S15","S15","S15","S15","S16","S16","S16","S16","S16","S16","S16","S17","S17","S17","S17","S17","S17","S17","S18","S18","S18","S18","S18","S18","S18","S19","S19","S19","S19","S19","S19","S19","S20","S20","S20","S20","S20","S20","S20","S21","S21","S21","S21","S21","S21","S21","S22","S22","S22","S22","S22","S22","S22","S23","S23","S23","S23","S23","S23",{"$f":"CONCATENATE(\"S\",WEEKNUM(EPT5,2))","v":"S23"},"S24","S24","S24","S24","S24","S24","S24","S25","S25","S25","S25","S25","S25","S25","S26","S26","S26","S26","S26","S26","S26","S27","S27","S27","S27","S27","S27","S27","S28","S28","S28","S28","S28","S28","S28","S29","S29","S29","S29","S29","S29","S29","S30","S30","S30","S30","S30","S30","S30","S31","S31","S31","S31","S31","S31","S31","S32","S32","S32","S32","S32","S32","S32",{"$f":"CONCATENATE(\"S\",WEEKNUM(ESF5,2))","v":"S33"},"S33","S33","S33","S33","S33","S33","S34","S34","S34","S34","S34","S34","S34","S35","S35","S35","S35","S35","S35","S35","S36","S36","S36","S36","S36","S36","S36","S37","S37","S37","S37","S37","S37","S37","S38","S38","S38","S38","S38","S38","S38","S39","S39","S39","S39","S39","S39","S39","S40","S40","S40","S40","S40","S40","S40","S41","S41","S41","S41","S41","S41","S41","S42",{"$f":"CONCATENATE(\"S\",WEEKNUM(EUR5,2))","v":"S42"},"S42","S42","S42","S42","S42","S43","S43","S43","S43","S43","S43","S43","S44","S44","S44","S44","S44","S44","S44","S45","S45","S45","S45","S45","S45","S45","S46","S46","S46","S46","S46","S46","S46","S47","S47","S47","S47","S47","S47","S47","S48","S48","S48","S48","S48","S48","S48","S49","S49","S49","S49","S49","S49","S49","S50","S50","S50","S50","S50","S50","S50","S51","S51",{"$f":"CONCATENATE(\"S\",WEEKNUM(EXD5,2))","v":"S51"},"S51","S51","S51","S51","S52","S52","S52","S52","S52","S52","S52","S53","S53","S1","S1","S1","S1","S1","S2","S2","S2","S2","S2","S2","S2","S3","S3","S3","S3","S3","S3","S3","S4","S4","S4","S4","S4","S4","S4","S5","S5","S5","S5","S5","S5","S5","S6","S6","S6","S6","S6","S6","S6","S7","S7","S7","S7","S7","S7","S7","S8","S8","S8",{"$f":"CONCATENATE(\"S\",WEEKNUM(EZP5,2))","v":"S8"},"S8","S8","S8","S9","S9","S9","S9","S9","S9","S9","S10","S10","S10","S10","S10","S10","S10","S11","S11","S11","S11","S11","S11","S11","S12","S12","S12","S12","S12","S12","S12","S13","S13","S13","S13","S13","S13","S13","S14","S14","S14","S14","S14","S14","S14","S15","S15","S15","S15","S15","S15","S15","S16","S16","S16","S16","S16","S16","S16","S17","S17","S17","S17",{"$f":"CONCATENATE(\"S\",WEEKNUM(FCB5,2))","v":"S17"},"S17","S17","S18","S18","S18","S18","S18","S18","S18","S19","S19","S19","S19","S19","S19","S19","S20","S20","S20","S20","S20","S20","S20","S21","S21","S21","S21","S21","S21","S21","S22","S22","S22","S22","S22","S22","S22","S23","S23","S23","S23","S23","S23","S23","S24","S24","S24","S24","S24","S24","S24","S25","S25","S25","S25","S25","S25","S25","S26","S26","S26","S26","S26",{"$f":"CONCATENATE(\"S\",WEEKNUM(FEN5,2))","v":"S26"},"S26","S27","S27","S27","S27","S27","S27","S27","S28","S28","S28","S28","S28","S28","S28","S29","S29","S29","S29","S29","S29","S29","S30","S30","S30","S30","S30","S30","S30","S31","S31","S31","S31","S31","S31","S31","S32","S32","S32","S32","S32","S32","S32","S33","S33","S33","S33","S33","S33","S33","S34","S34","S34","S34","S34","S34","S34","S35","S35","S35","S35","S35","S35",{"$f":"CONCATENATE(\"S\",WEEKNUM(FGZ5,2))","v":"S35"},"S36","S36","S36","S36","S36","S36","S36","S37","S37","S37","S37","S37","S37","S37","S38","S38","S38","S38","S38","S38","S38","S39","S39","S39","S39","S39","S39","S39","S40","S40","S40","S40","S40","S40","S40","S41","S41","S41","S41","S41","S41","S41","S42","S42","S42","S42","S42","S42","S42","S43","S43","S43","S43","S43","S43","S43","S44","S44","S44","S44","S44","S44","S44",{"$f":"CONCATENATE(\"S\",WEEKNUM(FJL5,2))","v":"S45"},"S45","S45","S45","S45","S45","S45","S46","S46","S46","S46","S46","S46","S46","S47","S47","S47","S47","S47","S47","S47","S48","S48","S48","S48","S48","S48","S48","S49","S49","S49","S49","S49","S49","S49","S50","S50","S50","S50","S50","S50","S50","S51","S51","S51","S51","S51","S51","S51","S52","S52","S52","S52","S52","S52","S52","S53","S53","S53","S1","S1","S1","S1","S2",{"$f":"CONCATENATE(\"S\",WEEKNUM(FLX5,2))","v":"S2"},"S2","S2","S2","S2","S2","S3","S3","S3","S3","S3","S3","S3","S4","S4","S4","S4","S4","S4","S4","S5","S5","S5","S5","S5","S5","S5","S6","S6","S6","S6","S6","S6","S6","S7","S7","S7","S7","S7","S7","S7","S8","S8","S8","S8","S8","S8","S8","S9","S9","S9","S9","S9","S9","S9","S10","S10","S10","S10","S10","S10","S10","S11","S11",{"$f":"CONCATENATE(\"S\",WEEKNUM(FOJ5,2))","v":"S11"},"S11","S11","S11","S11","S12","S12","S12","S12","S12","S12","S12","S13","S13","S13","S13","S13","S13","S13","S14","S14","S14","S14","S14","S14","S14","S15","S15","S15","S15","S15","S15","S15","S16","S16","S16","S16","S16","S16","S16","S17","S17","S17","S17","S17","S17","S17","S18","S18","S18","S18","S18","S18","S18","S19","S19","S19","S19","S19","S19","S19","S20","S20","S20",{"$f":"CONCATENATE(\"S\",WEEKNUM(FQV5,2))","v":"S20"},"S20","S20","S20","S21","S21","S21","S21","S21","S21","S21","S22","S22","S22","S22","S22","S22","S22","S23","S23","S23","S23","S23","S23","S23","S24","S24","S24","S24","S24","S24","S24","S25","S25","S25","S25","S25","S25","S25","S26","S26","S26","S26","S26","S26","S26","S27","S27","S27","S27","S27","S27","S27","S28","S28","S28","S28","S28","S28","S28","S29","S29","S29","S29",{"$f":"CONCATENATE(\"S\",WEEKNUM(FTH5,2))","v":"S29"},"S29","S29","S30","S30","S30","S30","S30","S30","S30","S31","S31","S31","S31","S31","S31","S31","S32","S32","S32","S32","S32","S32","S32","S33","S33","S33","S33","S33","S33","S33","S34","S34","S34","S34","S34","S34","S34","S35","S35","S35","S35","S35","S35","S35","S36","S36","S36","S36","S36","S36","S36","S37","S37","S37","S37","S37","S37","S37","S38","S38","S38","S38","S38",{"$f":"CONCATENATE(\"S\",WEEKNUM(FVT5,2))","v":"S38"},"S38","S39","S39","S39","S39","S39","S39","S39","S40","S40","S40","S40","S40","S40","S40","S41","S41","S41","S41","S41","S41","S41","S42","S42","S42","S42","S42","S42","S42","S43","S43","S43","S43","S43","S43","S43","S44","S44","S44","S44","S44","S44","S44","S45","S45","S45","S45","S45","S45","S45","S46","S46","S46","S46","S46","S46","S46","S47","S47","S47","S47","S47","S47",{"$f":"CONCATENATE(\"S\",WEEKNUM(FYF5,2))","v":"S47"},"S48","S48","S48","S48","S48","S48","S48","S49","S49","S49","S49","S49","S49","S49","S50","S50","S50","S50","S50","S50","S50","S51","S51","S51","S51","S51","S51","S51","S52","S52","S52","S52","S52","S52","S52","S53","S53","S53","S53","S53","S1","S1","S2","S2","S2","S2","S2","S2","S2","S3","S3","S3","S3","S3","S3","S3","S4","S4","S4","S4","S4","S4","S4",{"$f":"CONCATENATE(\"S\",WEEKNUM(GAR5,2))","v":"S5"},"S5","S5","S5","S5","S5","S5","S6","S6","S6","S6","S6","S6","S6","S7","S7","S7","S7","S7","S7","S7","S8","S8","S8","S8","S8","S8","S8","S9","S9","S9","S9","S9","S9","S9","S10","S10","S10","S10","S10","S10","S10","S11","S11","S11","S11","S11","S11","S11","S12","S12","S12","S12","S12","S12","S12","S13","S13","S13","S13","S13","S13","S13","S14",{"$f":"CONCATENATE(\"S\",WEEKNUM(GDD5,2))","v":"S14"},"S14","S14","S14","S14","S14","S15","S15","S15","S15","S15","S15","S15","S16","S16","S16","S16","S16","S16","S16","S17","S17","S17","S17","S17","S17","S17","S18","S18","S18","S18","S18","S18","S18","S19","S19","S19","S19","S19","S19","S19","S20","S20","S20","S20","S20","S20","S20","S21","S21","S21","S21","S21","S21","S21","S22","S22","S22","S22","S22","S22","S22","S23","S23",{"$f":"CONCATENATE(\"S\",WEEKNUM(GFP5,2))","v":"S23"},"S23","S23","S23","S23","S24","S24","S24","S24","S24","S24","S24","S25","S25","S25","S25","S25","S25","S25","S26","S26","S26","S26","S26","S26","S26","S27","S27","S27","S27","S27","S27","S27","S28","S28","S28","S28","S28","S28","S28","S29","S29","S29","S29","S29","S29","S29","S30","S30","S30","S30","S30","S30","S30","S31","S31","S31","S31","S31","S31","S31","S32","S32","S32",{"$f":"CONCATENATE(\"S\",WEEKNUM(GIB5,2))","v":"S32"},"S32","S32","S32","S33","S33","S33","S33","S33","S33","S33","S34","S34","S34","S34","S34","S34","S34","S35","S35","S35","S35","S35","S35","S35","S36","S36","S36","S36","S36","S36","S36","S37","S37","S37","S37","S37","S37","S37","S38","S38","S38","S38","S38","S38","S38","S39","S39","S39","S39","S39","S39","S39","S40","S40","S40","S40","S40","S40","S40","S41","S41","S41","S41",{"$f":"CONCATENATE(\"S\",WEEKNUM(GKN5,2))","v":"S41"},"S41","S41","S42","S42","S42","S42","S42","S42","S42","S43","S43","S43","S43","S43","S43","S43","S44","S44","S44","S44","S44","S44","S44","S45","S45","S45","S45","S45","S45","S45","S46","S46","S46","S46","S46","S46","S46","S47","S47","S47","S47","S47","S47","S47","S48","S48","S48","S48","S48","S48","S48","S49","S49","S49","S49","S49","S49","S49","S50","S50","S50","S50","S50",{"$f":"CONCATENATE(\"S\",WEEKNUM(GMZ5,2))","v":"S50"},"S50","S51","S51","S51","S51","S51","S51","S51","S52","S52","S52","S52","S52","S52","S52","S53","S53","S53","S53","S53","S53","S1",{"$f":"CONCATENATE(\"S\",WEEKNUM(GNW5,2))","v":"S2"},"S2","S2","S2","S2","S2","S2","S3","S3","S3","S3","S3","S3","S3","S4","S4","S4","S4","S4","S4","S4","S5","S5","S5","S5","S5","S5","S5","S6","S6","S6","S6","S6","S6","S6","S7","S7","S7","S7","S7","S7","S7","S8","S8","S8","S8","S8","S8","S8","S9","S9","S9","S9","S9","S9","S9","S10","S10","S10","S10","S10","S10","S10","S11",{"$f":"CONCATENATE(\"S\",WEEKNUM(GQI5,2))","v":"S11"},"S11","S11","S11","S11","S11","S12","S12","S12","S12","S12","S12","S12","S13","S13","S13","S13","S13","S13","S13","S14","S14","S14","S14","S14","S14","S14","S15","S15","S15","S15","S15","S15","S15","S16","S16","S16","S16","S16","S16",{"$f":"CONCATENATE(\"S\",WEEKNUM(GRW5,2))","v":"S16"},"S17","S17","S17","S17",{"$f":"CONCATENATE(\"S\",WEEKNUM(GSB5,2))","v":"S17"},"S17","S17","S18","S18","S18","S18","S18","S18","S18","S19","S19","S19","S19","S19","S19","S19","S20","S20","S20","S20","S20","S20","S20","S21","S21","S21","S21","S21","S21","S21","S22","S22","S22","S22","S22","S22","S22","S23","S23","S23","S23","S23","S23","S23","S24","S24","S24","S24","S24","S24","S24","S25","S25","S25","S25","S25","S25","S25","S26","S26","S26","S26","S26",{"$f":"CONCATENATE(\"S\",WEEKNUM(GUN5,2))","v":"S26"},"S26","S27","S27","S27","S27","S27","S27","S27","S28","S28","S28","S28","S28","S28","S28","S29","S29","S29","S29","S29","S29","S29","S30","S30","S30","S30","S30","S30","S30","S31","S31","S31","S31","S31","S31","S31","S32","S32","S32","S32","S32","S32","S32","S33","S33","S33","S33","S33","S33","S33","S34","S34","S34","S34","S34","S34","S34","S35","S35","S35","S35","S35","S35",{"$f":"CONCATENATE(\"S\",WEEKNUM(GWZ5,2))","v":"S35"},"S36","S36","S36","S36","S36","S36","S36","S37","S37","S37","S37","S37","S37","S37","S38","S38","S38","S38","S38","S38","S38","S39","S39","S39","S39","S39","S39","S39","S40","S40","S40","S40","S40","S40","S40","S41","S41","S41","S41","S41","S41","S41","S42","S42","S42","S42","S42","S42","S42","S43","S43","S43","S43","S43","S43","S43","S44","S44","S44","S44","S44","S44","S44",{"$f":"CONCATENATE(\"S\",WEEKNUM(GZL5,2))","v":"S45"},"S45","S45","S45","S45","S45","S45","S46","S46","S46","S46","S46","S46","S46","S47","S47","S47","S47","S47","S47","S47","S48","S48","S48","S48","S48","S48","S48","S49","S49","S49","S49","S49","S49","S49","S50","S50","S50","S50","S50","S50","S50","S51","S51","S51","S51","S51","S51","S51","S52","S52","S52","S52","S52","S52","S52","S53","S53","S53","S53","S53","S53","S53","S1",{"$f":"CONCATENATE(\"S\",WEEKNUM(HBX5,2))","v":"S1"},"S1","S1","S1","S1","S1","S2","S2","S2","S2","S2","S2","S2","S3","S3","S3","S3","S3","S3","S3","S4","S4","S4","S4","S4","S4","S4","S5","S5","S5","S5","S5","S5","S5","S6","S6","S6","S6","S6","S6","S6","S7","S7","S7","S7","S7","S7","S7","S8","S8","S8","S8","S8","S8","S8","S9","S9","S9","S9","S9","S9","S9","S10","S10",{"$f":"CONCATENATE(\"S\",WEEKNUM(HEJ5,2))","v":"S10"},"S10","S10","S10","S10","S11","S11","S11","S11","S11","S11","S11","S12","S12","S12","S12","S12","S12","S12","S13","S13","S13","S13","S13","S13","S13","S14","S14","S14","S14","S14","S14","S14","S15","S15","S15","S15","S15","S15","S15","S16","S16","S16","S16","S16","S16","S16","S17","S17","S17","S17","S17","S17","S17","S18","S18","S18","S18","S18","S18","S18","S19","S19","S19",{"$f":"CONCATENATE(\"S\",WEEKNUM(HGV5,2))","v":"S19"},"S19","S19","S19","S20","S20","S20","S20","S20","S20","S20","S21","S21","S21","S21","S21","S21","S21","S22","S22","S22","S22","S22","S22","S22","S23","S23","S23","S23","S23","S23","S23","S24","S24","S24","S24","S24","S24","S24","S25","S25","S25","S25","S25","S25","S25","S26","S26","S26","S26","S26","S26","S26","S27","S27","S27","S27","S27","S27","S27","S28","S28","S28","S28",{"$f":"CONCATENATE(\"S\",WEEKNUM(HJH5,2))","v":"S28"},"S28","S28","S29","S29","S29","S29","S29","S29","S29","S30","S30","S30","S30","S30","S30","S30","S31","S31","S31","S31","S31","S31","S31","S32","S32","S32","S32","S32","S32","S32","S33","S33","S33","S33","S33","S33","S33","S34","S34","S34","S34","S34","S34","S34","S35","S35","S35","S35","S35","S35","S35","S36","S36","S36","S36","S36","S36","S36","S37","S37","S37","S37","S37",{"$f":"CONCATENATE(\"S\",WEEKNUM(HLT5,2))","v":"S37"},"S37","S38","S38","S38","S38","S38","S38","S38","S39","S39","S39","S39","S39","S39","S39","S40","S40","S40","S40","S40","S40","S40","S41","S41","S41","S41","S41","S41","S41","S42","S42","S42","S42","S42","S42","S42","S43","S43","S43","S43","S43","S43","S43","S44","S44","S44","S44","S44","S44","S44","S45","S45","S45","S45","S45","S45","S45","S46","S46","S46","S46","S46","S46",{"$f":"CONCATENATE(\"S\",WEEKNUM(HOF5,2))","v":"S46"},"S47","S47","S47","S47","S47","S47","S47","S48","S48","S48","S48","S48","S48","S48","S49","S49","S49","S49","S49","S49","S49","S50","S50","S50","S50","S50","S50","S50","S51","S51","S51","S51","S51","S51","S51","S52","S52","S52","S52","S52","S52","S52","S53","S1","S1","S1","S1","S1","S1","S2","S2","S2","S2","S2","S2","S2","S3","S3","S3","S3","S3","S3","S3",{"$f":"CONCATENATE(\"S\",WEEKNUM(HQR5,2))","v":"S4"},"S4","S4","S4","S4","S4","S4","S5","S5","S5","S5","S5","S5","S5","S6","S6","S6","S6","S6","S6","S6","S7","S7","S7","S7","S7","S7","S7","S8","S8","S8","S8","S8","S8","S8","S9","S9","S9","S9","S9","S9","S9","S10","S10","S10","S10","S10","S10","S10","S11","S11","S11","S11","S11","S11","S11","S12","S12","S12","S12","S12","S12","S12","S13",{"$f":"CONCATENATE(\"S\",WEEKNUM(HTD5,2))","v":"S13"},"S13","S13","S13","S13","S13","S14","S14","S14","S14","S14","S14","S14","S15","S15","S15","S15","S15","S15","S15","S16","S16","S16","S16","S16","S16","S16","S17","S17","S17","S17","S17","S17","S17","S18","S18","S18","S18","S18","S18","S18","S19","S19","S19","S19","S19","S19","S19","S20","S20","S20","S20","S20","S20","S20","S21","S21","S21","S21","S21","S21","S21","S22","S22",{"$f":"CONCATENATE(\"S\",WEEKNUM(HVP5,2))","v":"S22"},"S22","S22","S22","S22","S23","S23","S23","S23","S23","S23","S23","S24","S24","S24","S24","S24","S24","S24","S25","S25","S25","S25","S25","S25","S25","S26","S26","S26","S26","S26","S26","S26","S27","S27","S27","S27","S27","S27","S27","S28","S28","S28","S28","S28","S28","S28","S29","S29","S29","S29","S29","S29","S29","S30","S30","S30","S30","S30","S30","S30","S31","S31","S31",{"$f":"CONCATENATE(\"S\",WEEKNUM(HYB5,2))","v":"S31"},"S31","S31","S31","S32","S32","S32","S32","S32","S32","S32","S33","S33","S33","S33","S33","S33","S33","S34","S34","S34","S34","S34","S34","S34","S35","S35","S35","S35","S35","S35","S35","S36","S36","S36","S36","S36","S36","S36","S37","S37","S37","S37","S37","S37","S37","S38","S38","S38","S38","S38","S38","S38","S39","S39","S39","S39","S39","S39","S39","S40","S40","S40","S40",{"$f":"CONCATENATE(\"S\",WEEKNUM(IAN5,2))","v":"S40"},"S40","S40","S41","S41","S41","S41","S41","S41","S41","S42","S42","S42","S42","S42","S42","S42","S43","S43","S43","S43","S43","S43","S43","S44","S44","S44","S44","S44","S44","S44","S45","S45","S45","S45","S45","S45","S45","S46","S46","S46","S46","S46","S46","S46","S47","S47","S47","S47","S47","S47","S47","S48","S48","S48","S48","S48","S48","S48","S49","S49","S49","S49","S49",{"$f":"CONCATENATE(\"S\",WEEKNUM(ICZ5,2))","v":"S49"},"S49","S50","S50","S50","S50","S50","S50","S50","S51","S51","S51","S51","S51","S51","S51","S52","S52","S52","S52","S52","S52","S52","S53","S53","S53","S1","S1","S1","S1","S2","S2","S2","S2","S2","S2","S2","S3","S3","S3","S3","S3","S3","S3","S4","S4","S4","S4","S4","S4","S4","S5","S5","S5","S5","S5","S5","S5","S6","S6","S6","S6","S6","S6",{"$f":"CONCATENATE(\"S\",WEEKNUM(IFL5,2))","v":"S6"},"S7","S7","S7","S7","S7","S7","S7","S8","S8","S8","S8","S8","S8","S8","S9","S9","S9","S9","S9","S9","S9","S10","S10","S10","S10","S10","S10","S10","S11","S11","S11","S11","S11","S11","S11","S12","S12","S12","S12","S12","S12","S12","S13","S13","S13","S13","S13","S13","S13","S14","S14","S14","S14","S14","S14","S14","S15","S15","S15","S15","S15","S15","S15",{"$f":"CONCATENATE(\"S\",WEEKNUM(IHX5,2))","v":"S16"},"S16","S16","S16","S16","S16","S16","S17","S17","S17","S17","S17","S17","S17","S18","S18","S18","S18","S18","S18","S18","S19","S19","S19","S19","S19","S19","S19","S20","S20","S20","S20","S20","S20","S20","S21","S21","S21","S21","S21","S21","S21","S22","S22","S22","S22","S22","S22","S22","S23","S23","S23","S23","S23","S23","S23","S24","S24","S24","S24","S24","S24","S24","S25",{"$f":"CONCATENATE(\"S\",WEEKNUM(IKJ5,2))","v":"S25"},"S25","S25","S25","S25","S25","S26","S26","S26","S26","S26","S26","S26","S27","S27","S27","S27","S27","S27","S27","S28","S28","S28","S28","S28","S28","S28","S29","S29","S29","S29","S29","S29","S29","S30","S30","S30","S30","S30","S30","S30","S31","S31","S31","S31","S31","S31","S31","S32","S32","S32","S32","S32","S32","S32","S33","S33","S33","S33","S33","S33","S33","S34","S34",{"$f":"CONCATENATE(\"S\",WEEKNUM(IMV5,2))","v":"S34"},"S34","S34","S34","S34","S35","S35","S35","S35","S35","S35","S35","S36","S36","S36","S36","S36","S36","S36","S37","S37","S37","S37","S37","S37","S37","S38","S38","S38","S38","S38","S38","S38","S39","S39","S39","S39","S39","S39","S39","S40","S40","S40","S40","S40","S40","S40","S41","S41","S41","S41","S41","S41","S41","S42","S42","S42","S42","S42","S42","S42","S43","S43","S43",{"$f":"CONCATENATE(\"S\",WEEKNUM(IPH5,2))","v":"S43"},"S43","S43","S43","S44","S44","S44","S44","S44","S44","S44","S45","S45","S45","S45","S45","S45","S45","S46","S46","S46","S46","S46","S46","S46","S47","S47","S47","S47","S47","S47","S47","S48","S48","S48","S48","S48","S48","S48","S49","S49","S49","S49","S49","S49","S49","S50","S50","S50","S50","S50","S50","S50","S51","S51","S51","S51","S51","S51","S51","S52","S52","S52","S52",{"$f":"CONCATENATE(\"S\",WEEKNUM(IRT5,2))","v":"S52"},"S52","S52","S53","S53","S53","S53","S1","S1","S1","S2","S2","S2","S2","S2","S2","S2","S3","S3","S3","S3","S3","S3","S3","S4","S4","S4","S4","S4","S4","S4","S5","S5","S5","S5","S5","S5","S5","S6","S6","S6","S6","S6","S6","S6","S7","S7","S7","S7","S7","S7","S7","S8","S8","S8","S8","S8","S8","S8","S9","S9","S9","S9","S9",{"$f":"CONCATENATE(\"S\",WEEKNUM(IUF5,2))","v":"S9"},"S9","S10","S10","S10","S10","S10","S10","S10","S11","S11","S11","S11","S11","S11","S11","S12","S12","S12","S12","S12","S12","S12","S13","S13","S13","S13","S13","S13","S13","S14","S14","S14","S14","S14","S14","S14","S15","S15","S15","S15","S15","S15","S15","S16","S16","S16","S16","S16","S16","S16","S17","S17","S17","S17","S17","S17","S17","S18","S18","S18","S18","S18","S18",{"$f":"CONCATENATE(\"S\",WEEKNUM(IWR5,2))","v":"S18"},"S19","S19","S19","S19","S19","S19","S19","S20","S20","S20","S20","S20","S20","S20","S21","S21","S21","S21","S21","S21","S21","S22","S22","S22","S22","S22","S22","S22","S23","S23","S23","S23","S23","S23","S23","S24","S24","S24","S24","S24","S24","S24","S25","S25","S25","S25","S25","S25","S25","S26","S26","S26","S26","S26","S26","S26","S27","S27","S27","S27","S27","S27","S27",{"$f":"CONCATENATE(\"S\",WEEKNUM(IZD5,2))","v":"S28"},"S28","S28","S28","S28","S28","S28","S29","S29","S29","S29","S29","S29","S29","S30","S30","S30","S30","S30","S30","S30","S31","S31","S31","S31","S31","S31","S31","S32","S32","S32","S32","S32","S32","S32","S33","S33","S33","S33","S33","S33","S33","S34","S34","S34","S34","S34","S34","S34","S35","S35","S35","S35","S35","S35","S35","S36","S36","S36","S36","S36","S36","S36","S37",{"$f":"CONCATENATE(\"S\",WEEKNUM(JBP5,2))","v":"S37"},"S37","S37","S37","S37","S37","S38","S38","S38","S38","S38","S38","S38","S39","S39","S39","S39","S39","S39","S39","S40","S40","S40","S40","S40","S40","S40","S41","S41","S41","S41","S41","S41","S41","S42","S42","S42","S42","S42","S42","S42","S43","S43","S43","S43","S43","S43","S43","S44","S44","S44","S44","S44","S44","S44","S45","S45","S45","S45","S45","S45","S45","S46","S46",{"$f":"CONCATENATE(\"S\",WEEKNUM(JEB5,2))","v":"S46"},"S46","S46","S46","S46","S47","S47","S47","S47","S47","S47","S47","S48","S48","S48","S48","S48","S48","S48","S49","S49","S49","S49","S49","S49","S49","S50","S50","S50","S50","S50","S50","S50","S51","S51","S51","S51","S51","S51","S51","S52","S52","S52","S52","S52","S52","S52","S53","S53","S53","S53","S53","S1","S1","S2","S2","S2","S2","S2","S2","S2","S3","S3","S3",{"$f":"CONCATENATE(\"S\",WEEKNUM(JGN5,2))","v":"S3"},"S3","S3","S3","S4","S4","S4","S4","S4","S4","S4","S5","S5","S5","S5","S5","S5","S5","S6","S6","S6","S6","S6","S6","S6","S7","S7","S7","S7","S7","S7","S7","S8","S8","S8","S8","S8","S8","S8","S9","S9","S9","S9","S9","S9","S9","S10","S10","S10","S10","S10","S10","S10","S11","S11","S11","S11","S11","S11","S11","S12","S12","S12","S12",{"$f":"CONCATENATE(\"S\",WEEKNUM(JIZ5,2))","v":"S12"},"S12","S12","S13","S13","S13","S13","S13","S13","S13","S14","S14","S14","S14","S14","S14","S14","S15","S15","S15","S15","S15","S15","S15","S16","S16","S16","S16","S16","S16","S16","S17","S17","S17","S17","S17","S17","S17","S18","S18","S18","S18","S18","S18","S18","S19","S19","S19","S19","S19","S19","S19","S20","S20","S20","S20","S20","S20","S20","S21","S21","S21","S21","S21",{"$f":"CONCATENATE(\"S\",WEEKNUM(JLL5,2))","v":"S21"},"S21","S22","S22","S22","S22","S22","S22","S22","S23","S23","S23","S23","S23","S23","S23","S24","S24","S24","S24","S24","S24","S24","S25","S25","S25","S25","S25","S25","S25","S26","S26","S26","S26","S26","S26","S26","S27","S27","S27","S27","S27","S27","S27","S28","S28","S28","S28","S28","S28","S28","S29","S29","S29","S29","S29","S29","S29","S30","S30","S30","S30","S30","S30",{"$f":"CONCATENATE(\"S\",WEEKNUM(JNX5,2))","v":"S30"},"S31","S31","S31","S31","S31","S31","S31","S32","S32","S32","S32","S32","S32","S32","S33","S33","S33","S33","S33","S33","S33","S34","S34","S34","S34","S34","S34","S34","S35","S35","S35","S35","S35","S35","S35","S36","S36","S36","S36","S36","S36","S36","S37","S37","S37","S37","S37","S37","S37","S38","S38","S38","S38","S38","S38","S38","S39","S39","S39","S39","S39","S39","S39",{"$f":"CONCATENATE(\"S\",WEEKNUM(JQJ5,2))","v":"S40"},"S40","S40","S40","S40","S40","S40","S41","S41","S41","S41","S41","S41","S41","S42","S42","S42","S42","S42","S42","S42","S43","S43","S43","S43","S43","S43","S43","S44","S44","S44","S44","S44","S44","S44","S45","S45","S45","S45","S45","S45","S45","S46","S46","S46","S46","S46","S46","S46","S47","S47","S47","S47","S47","S47","S47","S48","S48","S48","S48","S48","S48","S48","S49",{"$f":"CONCATENATE(\"S\",WEEKNUM(JSV5,2))","v":"S49"},"S49","S49","S49","S49","S49","S50","S50","S50","S50","S50","S50","S50","S51","S51","S51","S51","S51","S51","S51","S52","S52","S52","S52","S52","S52","S52","S53","S53","S53","S53","S53","S53","S1"]
[{"$nulls":3},{"$f":"DAY(D5)","v":1},{"$f":"DAY(E5)","v":2},3,4,5,6,7,8,9,10,11,12,13,14,15,16,17,18,19,20,21,22,23,24,25,26,27,28,29,30,31,1,2,3,4,5,6,7,8,9,10,11,12,13,14,15,16,17,18,19,20,21,22,23,24,25,26,27,28,29,1,2,3,4,5,{"$f":"DAY(BQ5)","v":6},7,8,9,10,11,12,13,14,15,16,17,18,19,20,21,22,23,24,25,26,27,28,29,30,31,1,2,3,4,5,6,7,8,9,10,11,12,13,14,15,16,17,18,19,20,21,22,23,24,25,26,27,28,29,30,1,2,3,4,5,6,7,8,{"$f":"DAY(EC5)","v":9},10,11,12,13,14,15,16,17,18,19,20,21,22,23,24,25,26,27,28,29,30,31,1,2,3,4,5,6,7,8,9,10,11,12,13,14,15,16,17,18,19,20,21,22,23,24,25,26,27,28,29,30,1,2,3,4,5,6,7,8,9,10,11,{"$f":"DAY(GO5)","v":12},13,14,15,16,17,18,19,20,21,22,23,24,25,26,27,28,29,30,31,1,2,3,4,5,6,7,8,9,10,11,12,13,14,15,16,17,18,19,20,21,22,23,24,25,26,27,28,29,30,31,1,2,3,4,5,6,7,8,9,10,11,12,13,{"$f":"DAY(JA5)","v":14},15,16,17,18,19,20,21,22,23,24,25,26,27,28,29,30,1,2,3,4,5,6,7,8,9,10,11,12,13,14,15,16,17,18,19,20,21,22,23,24,25,26,27,28,29,30,31,1,2,3,4,5,6,7,8,9,10,11,12,13,14,15,16,{"$f":"DAY(LM5)","v":17},18,19,20,21,22,23,24,25,26,27,28,29,30,1,2,3,4,5,6,7,8,9,10,11,12,13,14,15,16,17,18,19,20,21,22,23,24,25,26,27,28,29,30,31,1,2,3,4,5,6,7,8,9,10,11,12,13,14,15,16,17,18,19,{"$f":"DAY(NY5)","v":20},21,22,23,24,25,26,27,28,29,30,31,1,2,3,4,5,6,7,8,9,10,11,12,13,14,15,16,17,18,19,20,21,22,23,24,25,26,27,28,1,2,3,4,5,6,7,8,9,10,11,12,13,14,15,16,17,18,19,20,21,22,23,24,{"$f":"DAY(QK5)","v":25},26,27,28,29,30,31,1,2,3,4,5,6,7,8,9,10,11,12,13,14,15,16,17,18,19,20,21,22,23,24,25,26,27,28,29,30,1,2,3,4,5,6,7,8,9,10,11,12,13,14,15,16,17,18,19,20,21,22,23,24,25,26,27,{"$f":"DAY(SW5)","v":28},29,30,31,1,2,3,4,5,6,7,8,9,10,11,12,13,14,15,16,17,18,19,20,21,22,23,24,25,26,27,28,29,30,1,2,3,4,5,6,7,8,9,10,11,12,13,14,15,16,17,18,19,20,21,22,23,24,25,26,27,28,29,30,{"$f":"DAY(VI5)","v":31},1,2,3,4,5,6,7,8,9,10,11,12,13,14,15,16,17,18,19,20,21,22,23,24,25,26,27,28,29,30,31,1,2,3,4,5,6,7,8,9,10,11,12,13,14,15,16,17,18,19,20,21,22,23,24,25,26,27,28,29,30,1,2,{"$f":"DAY(XU5)","v":3},4,5,6,7,8,9,10,11,12,13,14,15,16,17,18,19,20,21,22,23,24,25,26,27,28,29,30,31,1,2,3,4,5,6,7,8,9,10,11,12,13,14,15,16,17,18,19,20,21,22,23,24,25,26,27,28,29,30,1,2,3,4,5,{"$f":"DAY(AAG5)","v":6},7,8,9,10,11,12,13,14,15,16,17,18,19,20,21,22,23,24,25,26,27,28,29,30,31,1,2,3,4,5,6,7,8,9,10,11,12,13,14,15,16,17,18,19,20,21,22,23,24,25,26,27,28,29,30,31,1,2,3,4,5,6,7,{"$f":"DAY(ACS5)","v":8},9,10,11,12,13,14,15,16,17,18,19,20,21,22,23,24,25,26,27,28,1,2,3,4,5,6,7,8,9,10,11,12,13,14,15,16,17,18,19,20,21,22,23,24,25,26,27,28,29,30,31,1,2,3,4,5,6,7,8,9,10,11,12,{"$f":"DAY(AFE5)","v":13},14,15,16,17,18,19,20,21,22,23,24,25,26,27,28,29,30,1,2,3,4,5,6,7,8,9,10,11,12,13,14,15,16,17,18,19,20,21,22,23,24,25,26,27,28,29,30,31,1,2,3,4,5,6,7,8,9,10,11,12,13,14,15,{"$f":"DAY(AHQ5)","v":16},17,18,19,20,21,22,23,24,25,26,27,28,29,30,1,2,3,4,5,6,7,8,9,10,11,12,13,14,15,16,17,18,19,20,21,22,23,24,25,26,27,28,29,30,31,1,2,3,4,5,6,7,8,9,10,11,12,13,14,15,16,17,18,{"$f":"DAY(AKC5)","v":19},20,21,22,23,24,25,26,27,28,29,30,31,1,2,3,4,5,6,7,8,9,10,11,12,13,14,15,16,17,18,19,20,21,22,23,24,25,26,27,28,29,30,1,2,3,4,5,6,7,8,9,10,11,12,13,14,15,16,17,18,19,20,21,{"$f":"DAY(AMO5)","v":22},23,24,25,26,27,28,29,30,31,1,2,3,4,5,6,7,8,9,10,11,12,13,14,15,16,17,18,19,20,21,22,23,24,25,26,27,28,29,30,1,2,3,4,5,6,7,8,9,10,11,12,13,14,15,16,17,18,19,20,21,22,23,24,{"$f":"DAY(APA5)","v":25},26,27,28,29,30,31,1,2,3,4,5,6,7,8,9,10,11,12,13,14,15,16,17,18,19,20,21,22,23,24,25,26,27,28,29,30,31,1,2,3,4,5,6,7,8,9,10,11,12,13,14,15,16,17,18,19,20,21,22,23,24,25,26,{"$f":"DAY(ARM5)","v":27},28,1,2,3,4,5,6,7,8,9,10,11,12,13,14,15,16,17,18,19,20,21,22,23,24,25,26,27,28,29,30,31,1,2,3,4,5,6,7,8,9,10,11,12,13,14,15,16,17,18,19,20,21,22,23,24,25,26,27,28,29,30,1,{"$f":"DAY(ATY5)","v":2},3,4,5,6,7,8,9,10,11,12,13,14,15,16,17,18,19,20,21,22,23,24,25,26,27,28,29,30,31,1,2,3,4,5,6,7,8,9,10,11,12,13,14,15,16,17,18,19,20,21,22,23,24,25,26,27,28,29,30,1,2,3,4,{"$f":"DAY(AWK5)","v":5},6,7,8,9,10,11,12,13,14,15,16,17,18,19,20,21,22,23,24,25,26,27,28,29,30,31,1,2,3,4,5,6,7,8,9,10,11,12,13,14,15,16,17,18,19,20,21,22,23,24,25,26,27,28,29,30,31,1,2,3,4,5,6,{"$f":"DAY(AYW5)","v":7},8,9,10,11,12,13,14,15,16,17,18,19,20,21,22,23,24,25,26,27,28,29,30,1,2,3,4,5,6,7,8,9,10,11,12,13,14,15,16,17,18,19,20,21,22,23,24,25,26,27,28,29,30,31,1,2,3,4,5,6,7,8,9,{"$f":"DAY(BBI5)","v":10},11,12,13,14,15,16,17,18,19,20,21,22,23,24,25,26,27,28,29,30,1,2,3,4,5,6,7,8,9,10,11,12,13,14,15,16,17,18,19,20,21,22,23,24,25,26,27,28,29,30,31,1,2,3,4,5,6,7,8,9,10,11,12,{"$f":"DAY(BDU5)","v":13},14,15,16,17,18,19,20,21,22,23,24,25,26,27,28,29,30,31,1,2,3,4,5,6,7,8,9,10,11,12,13,14,15,16,17,18,19,20,21,22,23,24,25,26,27,28,29,1,2,3,4,5,6,7,8,9,10,11,12,13,14,15,16,{"$f":"DAY(BGG5)","v":17},18,19,20,21,22,23,24,25,26,27,28,29,30,31,1,2,3,4,5,6,7,8,9,10,11,12,13,14,15,16,17,18,19,20,21,22,23,24,25,26,27,28,29,30,1,2,3,4,5,6,7,8,9,10,11,12,13,14,15,16,17,18,19,{"$f":"DAY(BIS5)","v":20},21,22,23,24,25,26,27,28,29,30,31,1,2,3,4,5,6,7,8,9,10,11,12,13,14,15,16,17,18,19,20,21,22,23,24,25,26,27,28,29,30,1,2,3,4,5,6,7,8,9,10,11,12,13,14,15,16,17,18,19,20,21,22,{"$f":"DAY(BLE5)","v":23},24,25,26,27,28,29,30,31,1,2,3,4,5,6,7,8,9,10,11,12,13,14,15,16,17,18,19,20,21,22,23,24,25,26,27,28,29,30,31,1,2,3,4,5,6,7,8,9,10,11,12,13,14,15,16,17,18,19,20,21,22,23,24,{"$f":"DAY(BNQ5)","v":25},26,27,28,29,30,1,2,3,4,5,6,7,8,9,10,11,12,13,14,15,16,17,18,19,20,21,22,23,24,25,26,27,28,29,30,31,1,2,3,4,5,6,7,8,9,10,11,12,13,14,15,16,17,18,19,20,21,22,23,24,25,26,27,{"$f":"DAY(BQC5)","v":28},29,30,1,2,3,4,5,6,7,8,9,10,11,12,13,14,15,16,17,18,19,20,21,22,23,24,25,26,27,28,29,30,31,1,2,3,4,5,6,7,8,9,10,11,12,13,14,15,16,17,18,19,20,21,22,23,24,25,26,27,28,29,30,{"$f":"DAY(BSO5)","v":31},1,2,3,4,5,6,7,8,9,10,11,12,13,14,15,16,17,18,19,20,21,22,23,24,25,26,27,28,1,2,3,4,5,6,7,8,9,10,11,12,13,14,15,16,17,18,19,20,21,22,23,24,25,26,27,28,29,30,31,1,2,3,4,{"$f":"DAY(BVA5)","v":5},6,7,8,9,10,11,12,13,14,15,16,17,18,19,20,21,22,23,24,25,26,27,28,29,30,1,2,3,4,5,6,7,8,9,10,11,12,13,14,15,16,17,18,19,20,21,22,23,24,25,26,27,28,29,30,31,1,2,3,4,5,6,7,{"$f":"DAY(BXM5)","v":8},9,10,11,12,13,14,15,16,17,18,19,20,21,22,23,24,25,26,27,28,29,30,1,2,3,4,5,6,7,8,9,10,11,12,13,14,15,16,17,18,19,20,21,22,23,24,25,26,27,28,29,30,31,1,2,3,4,5,6,7,8,9,10,{"$f":"DAY(BZY5)","v":11},12,13,14,15,16,17,18,19,20,21,22,23,24,25,26,27,28,29,30,31,1,2,3,4,5,6,7,8,9,10,11,12,13,14,15,16,17,18,19,20,21,22,23,24,25,26,27,28,29,30,1,2,3,4,5,6,7,8,9,10,11,12,13,{"$f":"DAY(CCK5)","v":14},15,16,17,18,19,20,21,22,23,24,25,26,27,28,29,30,31,1,2,3,4,5,6,7,8,9,10,11,12,13,14,15,16,17,18,19,20,21,22,23,24,25,26,27,28,29,30,1,2,3,4,5,6,7,8,9,10,11,12,13,14,15,16,{"$f":"DAY(CEW5)","v":17},18,19,20,21,22,23,24,25,26,27,28,29,30,31,1,2,3,4,5,6,7,8,9,10,11,12,13,14,15,16,17,18,19,20,21,22,23,24,25,26,27,28,29,30,31,1,2,3,4,5,6,7,8,9,10,11,12,13,14,15,16,17,18,{"$f":"DAY(CHI5)","v":19},20,21,22,23,24,25,26,27,28,1,2,3,4,5,6,7,8,9,10,11,12,13,14,15,16,17,18,19,20,21,22,23,24,25,26,27,28,29,30,31,1,2,3,4,5,6,7,8,9,10,11,12,13,14,15,16,17,18,19,20,21,22,23,{"$f":"DAY(CJU5)","v":24},25,26,27,28,29,30,1,2,3,4,5,6,7,8,9,10,11,12,13,14,15,16,17,18,19,20,21,22,23,24,25,26,27,28,29,30,31,1,2,3,4,5,6,7,8,9,10,11,12,13,14,15,16,17,18,19,20,21,22,23,24,25,26,{"$f":"DAY(CMG5)","v":27},28,29,30,1,2,3,4,5,6,7,8,9,10,11,12,13,14,15,16,17,18,19,20,21,22,23,24,25,26,27,28,29,30,31,1,2,3,4,5,6,7,8,9,10,11,12,13,14,15,16,17,18,19,20,21,22,23,24,25,26,27,28,29,{"$f":"DAY(COS5)","v":30},31,1,2,3,4,5,6,7,8,9,10,11,12,13,14,15,16,17,18,19,20,21,22,23,24,25,26,27,28,29,30,1,2,3,4,5,6,7,8,9,10,11,12,13,14,15,16,17,18,19,20,21,22,23,24,25,26,27,28,29,30,31,1,{"$f":"DAY(CRE5)","v":2},3,4,5,6,7,8,9,10,11,12,13,14,15,16,17,18,19,20,21,22,23,24,25,26,27,28,29,30,1,2,3,4,5,6,7,8,9,10,11,12,13,14,15,16,17,18,19,20,21,22,23,24,25,26,27,28,29,30,31,1,2,3,4,{"$f":"DAY(CTQ5)","v":5},6,7,8,9,10,11,12,13,14,15,16,17,18,19,20,21,22,23,24,25,26,27,28,29,30,31,1,2,3,4,5,6,7,8,9,10,11,12,13,14,15,16,17,18,19,20,21,22,23,24,25,26,27,28,1,2,3,4,5,6,7,8,9,{"$f":"DAY(CWC5)","v":10},11,12,13,14,15,16,17,18,19,20,21,22,23,24,25,26,27,28,29,30,31,1,2,3,4,5,6,7,8,9,10,11,12,13,14,15,16,17,18,19,20,21,22,23,24,25,26,27,28,29,30,1,2,3,4,5,6,7,8,9,10,11,12,{"$f":"DAY(CYO5)","v":13},14,15,16,17,18,19,20,21,22,23,24,25,26,27,28,29,30,31,1,2,3,4,5,6,7,8,9,10,11,12,13,14,15,16,17,18,19,20,21,22,23,24,25,26,27,28,29,30,1,2,3,4,5,6,7,8,9,10,11,12,13,14,15,{"$f":"DAY(DBA5)","v":16},17,18,19,20,21,22,23,24,25,26,27,28,29,30,31,1,2,3,4,5,6,7,8,9,10,11,12,13,14,15,16,17,18,19,20,21,22,23,24,25,26,27,28,29,30,31,1,2,3,4,5,6,7,8,9,10,11,12,13,14,15,16,17,{"$f":"DAY(DDM5)","v":18},19,20,21,22,23,24,25,26,27,28,29,30,1,2,3,4,5,6,7,8,9,10,11,12,13,14,15,16,17,18,19,20,21,22,23,24,25,26,27,28,29,30,31,1,2,3,4,5,6,7,8,9,10,11,12,13,14,15,16,17,18,19,20,{"$f":"DAY(DFY5)","v":21},22,23,24,25,26,27,28,29,30,1,2,3,4,5,6,7,8,9,10,11,12,13,14,15,16,17,18,19,20,21,22,23,24,25,26,27,28,29,30,31,1,2,3,4,5,6,7,8,9,10,11,12,13,14,15,16,17,18,19,20,21,22,23,{"$f":"DAY(DIK5)","v":24},25,26,27,28,29,30,31,1,2,3,4,5,6,7,8,9,10,11,12,13,14,15,16,17,18,19,20,21,22,23,24,25,26,27,28,29,1,2,3,4,5,6,7,8,9,10,11,12,13,14,15,16,17,18,19,20,21,22,23,24,25,26,27,{"$f":"DAY(DKW5)","v":28},29,30,31,1,2,3,4,5,6,7,8,9,10,11,12,13,14,15,16,17,18,19,20,21,22,23,24,25,26,27,28,29,30,1,2,3,4,5,6,7,8,9,10,11,12,13,14,15,16,17,18,19,20,21,22,23,24,25,26,27,28,29,30,{"$f":"DAY(DNI5)","v":31},1,2,3,4,5,6,7,8,9,10,11,12,13,14,15,16,17,18,19,20,21,22,23,24,25,26,27,28,29,30,1,2,3,4,5,6,7,8,9,10,11,12,13,14,15,16,17,18,19,20,21,22,23,24,25,26,27,28,29,30,31,1,2,{"$f":"DAY(DPU5)","v":3},4,5,6,7,8,9,10,11,12,13,14,15,16,17,18,19,20,21,22,23,24,25,26,27,28,29,30,31,1,2,3,4,5,6,7,8,9,10,11,12,13,14,15,16,17,18,19,20,21,22,23,24,25,26,27,28,29,30,1,2,3,4,5,{"$f":"DAY(DSG5)","v":6},7,8,9,10,11,12,13,14,15,16,17,18,19,20,21,22,23,24,25,26,27,28,29,30,31,1,2,3,4,5,6,7,8,9,10,11,12,13,14,15,16,17,18,19,20,21,22,23,24,25,26,27,28,29,30,1,2,3,4,5,6,7,8,{"$f":"DAY(DUS5)","v":9},10,11,12,13,14,15,16,17,18,19,20,21,22,23,24,25,26,27,28,29,30,31,1,2,3,4,5,6,7,8,9,10,11,12,13,14,15,16,17,18,19,20,21,22,23,24,25,26,27,28,29,30,31,1,2,3,4,5,6,7,8,9,10,{"$f":"DAY(DXE5)","v":11},12,13,14,15,16,17,18,19,20,21,22,23,24,25,26,27,28,1,2,3,4,5,6,7,8,9,10,11,12,13,14,15,16,17,18,19,20,21,22,23,24,25,26,27,28,29,30,31,1,2,3,4,5,6,7,8,9,10,11,12,13,14,15,{"$f":"DAY(DZQ5)","v":16},17,18,19,20,21,22,23,24,25,26,27,28,29,30,1,2,3,4,5,6,7,8,9,10,11,12,13,14,15,16,17,18,19,20,21,22,23,24,25,26,27,28,29,30,31,1,2,3,4,5,6,7,8,9,10,11,12,13,14,15,16,17,18,{"$f":"DAY(ECC5)","v":19},20,21,22,23,24,25,26,27,28,29,30,1,2,3,4,5,6,7,8,9,10,11,12,13,14,15,16,17,18,19,20,21,22,23,24,25,26,27,28,29,30,31,1,2,3,4,5,6,7,8,9,10,11,12,13,14,15,16,17,18,19,20,21,{"$f":"DAY(EEO5)","v":22},23,24,25,26,27,28,29,30,31,1,2,3,4,5,6,7,8,9,10,11,12,13,14,15,16,17,18,19,20,21,22,23,24,25,26,27,28,29,30,1,2,3,4,5,6,7,8,9,10,11,12,13,14,15,16,17,18,19,20,21,22,23,24,{"$f":"DAY(EHA5)","v":25},26,27,28,29,30,31,1,2,3,4,5,6,7,8,9,10,11,12,13,14,15,16,17,18,19,20,21,22,23,24,25,26,27,28,29,30,1,2,3,4,5,6,7,8,9,10,11,12,13,14,15,16,17,18,19,20,21,22,23,24,25,26,27,{"$f":"DAY(EJM5)","v":28},29,30,31,1,2,3,4,5,6,7,8,9,10,11,12,13,14,15,16,17,18,19,20,21,22,23,24,25,26,27,28,29,30,31,1,2,3,4,5,6,7,8,9,10,11,12,13,14,15,16,17,18,19,20,21,22,23,24,25,26,27,28,1,{"$f":"DAY(ELY5)","v":2},3,4,5,6,7,8,9,10,11,12,13,14,15,16,17,18,19,20,21,22,23,24,25,26,27,28,29,30,31,1,2,3,4,5,6,7,8,9,10,11,12,13,14,15,16,17,18,19,20,21,22,23,24,25,26,27,28,29,30,1,2,3,4,{"$f":"DAY(EOK5)","v":5},6,7,8,9,10,11,12,13,14,15,16,17,18,19,20,21,22,23,24,25,26,27,28,29,30,31,1,2,3,4,5,6,7,8,9,10,11,12,13,14,15,16,17,18,19,20,21,22,23,24,25,26,27,28,29,30,1,2,3,4,5,6,7,{"$f":"DAY(EQW5)","v":8},9,10,11,12,13,14,15,16,17,18,19,20,21,22,23,24,25,26,27,28,29,30,31,1,2,3,4,5,6,7,8,9,10,11,12,13,14,15,16,17,18,19,20,21,22,23,24,25,26,27,28,29,30,31,1,2,3,4,5,6,7,8,9,{"$f":"DAY(ETI5)","v":10},11,12,13,14,15,16,17,18,19,20,21,22,23,24,25,26,27,28,29,30,1,2,3,4,5,6,7,8,9,10,11,12,13,14,15,16,17,18,19,20,21,22,23,24,25,26,27,28,29,30,31,1,2,3,4,5,6,7,8,9,10,11,12,{"$f":"DAY(EVU5)","v":13},14,15,16,17,18,19,20,21,22,23,24,25,26,27,28,29,30,1,2,3,4,5,6,7,8,9,10,11,12,13,14,15,16,17,18,19,20,21,22,23,24,25,26,27,28,29,30,31,1,2,3,4,5,6,7,8,9,10,11,12,13,14,15,{"$f":"DAY(EYG5)","v":16},17,18,19,20,21,22,23,24,25,26,27,28,29,30,31,1,2,3,4,5,6,7,8,9,10,11,12,13,14,15,16,17,18,19,20,21,22,23,24,25,26,27,28,1,2,3,4,5,6,7,8,9,10,11,12,13,14,15,16,17,18,19,20,{"$f":"DAY(FAS5)","v":21},22,23,24,25,26,27,28,29,30,31,1,2,3,4,5,6,7,8,9,10,11,12,13,14,15,16,17,18,19,20,21,22,23,24,25,26,27,28,29,30,1,2,3,4,5,6,7,8,9,10,11,12,13,14,15,16,17,18,19,20,21,22,23,{"$f":"DAY(FDE5)","v":24},25,26,27,28,29,30,31,1,2,3,4,5,6,7,8,9,10,11,12,13,14,15,16,17,18,19,20,21,22,23,24,25,26,27,28,29,30,1,2,3,4,5,6,7,8,9,10,11,12,13,14,15,16,17,18,19,20,21,22,23,24,25,26,{"$f":"DAY(FFQ5)","v":27},28,29,30,31,1,2,3,4,5,6,7,8,9,10,11,12,13,14,15,16,17,18,19,20,21,22,23,24,25,26,27,28,29,30,31,1,2,3,4,5,6,7,8,9,10,11,12,13,14,15,16,17,18,19,20,21,22,23,24,25,26,27,28,{"$f":"DAY(FIC5)","v":29},30,1,2,3,4,5,6,7,8,9,10,11,12,13,14,15,16,17,18,19,20,21,22,23,24,25,26,27,28,29,30,31,1,2,3,4,5,6,7,8,9,10,11,12,13,14,15,16,17,18,19,20,21,22,23,24,25,26,27,28,29,30,1,{"$f":"DAY(FKO5)","v":2},3,4,5,6,7,8,9,10,11,12,13,14,15,16,17,18,19,20,21,22,23,24,25,26,27,28,29,30,31,1,2,3,4,5,6,7,8,9,10,11,12,13,14,15,16,17,18,19,20,21,22,23,24,25,26,27,28,29,30,31,1,2,3,{"$f":"DAY(FNA5)","v":4},5,6,7,8,9,10,11,12,13,14,15,16,17,18,19,20,21,22,23,24,25,26,27,28,29,1,2,3,4,5,6,7,8,9,10,11,12,13,14,15,16,17,18,19,20,21,22,23,24,25,26,27,28,29,30,31,1,2,3,4,5,6,7,{"$f":"DAY(FPM5)","v":8},9,10,11,12,13,14,15,16,17,18,19,20,21,22,23,24,25,26,27,28,29,30,1,2,3,4,5,6,7,8,9,10,11,12,13,14,15,16,17,18,19,20,21,22,23,24,25,26,27,28,29,30,31,1,2,3,4,5,6,7,8,9,10,{"$f":"DAY(FRY5)","v":11},12,13,14,15,16,17,18,19,20,21,22,23,24,25,26,27,28,29,30,1,2,3,4,5,6,7,8,9,10,11,12,13,14,15,16,17,18,19,20,21,22,23,24,25,26,27,28,29,30,31,1,2,3,4,5,6,7,8,9,10,11,12,13,{"$f":"DAY(FUK5)","v":14},15,16,17,18,19,20,21,22,23,24,25,26,27,28,29,30,31,1,2,3,4,5,6,7,8,9,10,11,12,13,14,15,16,17,18,19,20,21,22,23,24,25,26,27,28,29,30,1,2,3,4,5,6,7,8,9,10,11,12,13,14,15,16,{"$f":"DAY(FWW5)","v":17},18,19,20,21,22,23,24,25,26,27,28,29,30,31,1,2,3,4,5,6,7,8,9,10,11,12,13,14,15,16,17,18,19,20,21,22,23,24,25,26,27,28,29,30,1,2,3,4,5,6,7,8,9,10,11,12,13,14,15,16,17,18,19,{"$f":"DAY(FZI5)","v":20},21,22,23,24,25,26,27,28,29,30,31,1,2,3,4,5,6,7,8,9,10,11,12,13,14,15,16,17,18,19,20,21,22,23,24,25,26,27,28,29,30,31,1,2,3,4,5,6,7,8,9,10,11,12,13,14,15,16,17,18,19,20,21,{"$f":"DAY(GBU5)","v":22},23,24,25,26,27,28,1,2,3,4,5,6,7,8,9,10,11,12,13,14,15,16,17,18,19,20,21,22,23,24,25,26,27,28,29,30,31,1,2,3,4,5,6,7,8,9,10,11,12,13,14,15,16,17,18,19,20,21,22,23,24,25,26,{"$f":"DAY(GEG5)","v":27},28,29,30,1,2,3,4,5,6,7,8,9,10,11,12,13,14,15,16,17,18,19,20,21,22,23,24,25,26,27,28,29,30,31,1,2,3,4,5,6,7,8,9,10,11,12,13,14,15,16,17,18,19,20,21,22,23,24,25,26,27,28,29,{"$f":"DAY(GGS5)","v":30},1,2,3,4,5,6,7,8,9,10,11,12,13,14,15,16,17,18,19,20,21,22,23,24,25,26,27,28,29,30,31,1,2,3,4,5,6,7,8,9,10,11,12,13,14,15,16,17,18,19,20,21,22,23,24,25,26,27,28,29,30,31,1,{"$f":"DAY(GJE5)","v":2},3,4,5,6,7,8,9,10,11,12,13,14,15,16,17,18,19,20,21,22,23,24,25,26,27,28,29,30,1,2,3,4,5,6,7,8,9,10,11,12,13,14,15,16,17,18,19,20,21,22,23,24,25,26,27,28,29,30,31,1,2,3,4,{"$f":"DAY(GLQ5)","v":5},6,7,8,9,10,11,12,13,14,15,16,17,18,19,20,21,22,23,24,25,26,27,28,29,30,1,2,3,4,5,6,7,8,9,10,11,12,13,14,15,16,17,18,19,20,21,22,23,24,25,26,27,28,29,30,31,1,2,3,4,5,6,7,{"$f":"DAY(GOC5)","v":8},9,10,11,12,13,14,15,16,17,18,19,20,21,22,23,24,25,26,27,28,29,30,31,1,2,3,4,5,6,7,8,9,10,11,12,13,14,15,16,17,18,19,20,21,22,23,24,25,26,27,28,1,2,3,4,5,6,7,8,9,10,11,12,{"$f":"DAY(GQO5)","v":13},14,15,16,17,18,19,20,21,22,23,24,25,26,27,28,29,30,31,1,2,3,4,5,6,7,8,9,10,11,12,13,14,15,16,17,18,19,20,21,22,23,24,25,26,27,28,29,30,1,2,3,4,5,6,7,8,9,10,11,12,13,14,15,{"$f":"DAY(GTA5)","v":16},17,18,19,20,21,22,23,24,25,26,27,28,29,30,31,1,2,3,4,5,6,7,8,9,10,11,12,13,14,15,16,17,18,19,20,21,22,23,24,25,26,27,28,29,30,1,2,3,4,5,6,7,8,9,10,11,12,13,14,15,16,17,18,{"$f":"DAY(GVM5)","v":19},20,21,22,23,24,25,26,27,28,29,30,31,1,2,3,4,5,6,7,8,9,10,11,12,13,14,15,16,17,18,19,20,21,22,23,24,25,26,27,28,29,30,31,1,2,3,4,5,6,7,8,9,10,11,12,13,14,15,16,17,18,19,20,{"$f":"DAY(GXY5)","v":21},22,23,24,25,26,27,28,29,30,1,2,3,4,5,6,7,8,9,10,11,12,13,14,15,16,17,18,19,20,21,22,23,24,25,26,27,28,29,30,31,1,2,3,4,5,6,7,8,9,10,11,12,13,14,15,16,17,18,19,20,21,22,23,{"$f":"DAY(HAK5)","v":24},25,26,27,28,29,30,1,2,3,4,5,6,7,8,9,10,11,12,13,14,15,16,17,18,19,20,21,22,23,24,25,26,27,28,29,30,31,1,2,3,4,5,6,7,8,9,10,11,12,13,14,15,16,17,18,19,20,21,22,23,24,25,26,{"$f":"DAY(HCW5)","v":27},28,29,30,31,1,2,3,4,5,6,7,8,9,10,11,12,13,14,15,16,17,18,19,20,21,22,23,24,25,26,27,28,1,2,3,4,5,6,7,8,9,10,11,12,13,14,15,16,17,18,19,20,21,22,23,24,25,26,27,28,29,30,31,{"$f":"DAY(HFI5)","v":1},2,3,4,5,6,7,8,9,10,11,12,13,14,15,16,17,18,19,20,21,22,23,24,25,26,27,28,29,30,1,2,3,4,5,6,7,8,9,10,11,12,13,14,15,16,17,18,19,20,21,22,23,24,25,26,27,28,29,30,31,1,2,3,{"$f":"DAY(HHU5)","v":4},5,6,7,8,9,10,11,12,13,14,15,16,17,18,19,20,21,22,23,24,25,26,27,28,29,30,1,2,3,4,5,6,7,8,9,10,11,12,13,14,15,16,17,18,19,20,21,22,23,24,25,26,27,28,29,30,31,1,2,3,4,5,6,{"$f":"DAY(HKG5)","v":7},8,9,10,11,12,13,14,15,16,17,18,19,20,21,22,23,24,25,26,27,28,29,30,31,1,2,3,4,5,6,7,8,9,10,11,12,13,14,15,16,17,18,19,20,21,22,23,24,25,26,27,28,29,30,1,2,3,4,5,6,7,8,9,{"$f":"DAY(HMS5)","v":10},11,12,13,14,15,16,17,18,19,20,21,22,23,24,25,26,27,28,29,30,31,1,2,3,4,5,6,7,8,9,10,11,12,13,14,15,16,17,18,19,20,21,22,23,24,25,26,27,28,29,30,1,2,3,4,5,6,7,8,9,10,11,12,{"$f":"DAY(HPE5)","v":13},14,15,16,17,18,19,20,21,22,23,24,25,26,27,28,29,30,31,1,2,3,4,5,6,7,8,9,10,11,12,13,14,15,16,17,18,19,20,21,22,23,24,25,26,27,28,29,30,31,1,2,3,4,5,6,7,8,9,10,11,12,13,14,{"$f":"DAY(HRQ5)","v":15},16,17,18,19,20,21,22,23,24,25,26,27,28,29,1,2,3,4,5,6,7,8,9,10,11,12,13,14,15,16,17,18,19,20,21,22,23,24,25,26,27,28,29,30,31,1,2,3,4,5,6,7,8,9,10,11,12,13,14,15,16,17,18,{"$f":"DAY(HUC5)","v":19},20,21,22,23,24,25,26,27,28,29,30,1,2,3,4,5,6,7,8,9,10,11,12,13,14,15,16,17,18,19,20,21,22,23,24,25,26,27,28,29,30,31,1,2,3,4,5,6,7,8,9,10,11,12,13,14,15,16,17,18,19,20,21,{"$f":"DAY(HWO5)","v":22},23,24,25,26,27,28,29,30,1,2,3,4,5,6,7,8,9,10,11,12,13,14,15,16,17,18,19,20,21,22,23,24,25,26,27,28,29,30,31,1,2,3,4,5,6,7,8,9,10,11,12,13,14,15,16,17,18,19,20,21,22,23,24,{"$f":"DAY(HZA5)","v":25},26,27,28,29,30,31,1,2,3,4,5,6,7,8,9,10,11,12,13,14,15,16,17,18,19,20,21,22,23,24,25,26,27,28,29,30,1,2,3,4,5,6,7,8,9,10,11,12,13,14,15,16,17,18,19,20,21,22,23,24,25,26,27,{"$f":"DAY(IBM5)","v":28},29,30,31,1,2,3,4,5,6,7,8,9,10,11,12,13,14,15,16,17,18,19,20,21,22,23,24,25,26,27,28,29,30,1,2,3,4,5,6,7,8,9,10,11,12,13,14,15,16,17,18,19,20,21,22,23,24,25,26,27,28,29,30,{"$f":"DAY(IDY5)","v":31},1,2,3,4,5,6,7,8,9,10,11,12,13,14,15,16,17,18,19,20,21,22,23,24,25,26,27,28,29,30,31,1,2,3,4,5,6,7,8,9,10,11,12,13,14,15,16,17,18,19,20,21,22,23,24,25,26,27,28,1,2,3,4,{"$f":"DAY(IGK5)","v":5},6,7,8,9,10,11,12,13,14,15,16,17,18,19,20,21,22,23,24,25,26,27,28,29,30,31,1,2,3,4,5,6,7,8,9,10,11,12,13,14,15,16,17,18,19,20,21,22,23,24,25,26,27,28,29,30,1,2,3,4,5,6,7,{"$f":"DAY(IIW5)","v":8},9,10,11,12,13,14,15,16,17,18,19,20,21,22,23,24,25,26,27,28,29,30,31,1,2,3,4,5,6,7,8,9,10,11,12,13,14,15,16,17,18,19,20,21,22,23,24,25,26,27,28,29,30,1,2,3,4,5,6,7,8,9,10,{"$f":"DAY(ILI5)","v":11},12,13,14,15,16,17,18,19,20,21,22,23,24,25,26,27,28,29,30,31,1,2,3,4,5,6,7,8,9,10,11,12,13,14,15,16,17,18,19,20,21,22,23,24,25,26,27,28,29,30,31,1,2,3,4,5,6,7,8,9,10,11,12,{"$f":"DAY(INU5)","v":13},14,15,16,17,18,19,20,21,22,23,24,25,26,27,28,29,30,1,2,3,4,5,6,7,8,9,10,11,12,13,14,15,16,17,18,19,20,21,22,23,24,25,26,27,28,29,30,31,1,2,3,4,5,6,7,8,9,10,11,12,13,14,15,{"$f":"DAY(IQG5)","v":16},17,18,19,20,21,22,23,24,25,26,27,28,29,30,1,2,3,4,5,6,7,8,9,10,11,12,13,14,15,16,17,18,19,20,21,22,23,24,25,26,27,28,29,30,31,1,2,3,4,5,6,7,8,9,10,11,12,13,14,15,16,17,18,{"$f":"DAY(ISS5)","v":19},20,21,22,23,24,25,26,27,28,29,30,31,1,2,3,4,5,6,7,8,9,10,11,12,13,14,15,16,17,18,19,20,21,22,23,24,25,26,27,28,1,2,3,4,5,6,7,8,9,10,11,12,13,14,15,16,17,18,19,20,21,22,23,{"$f":"DAY(IVE5)","v":24},25,26,27,28,29,30,31,1,2,3,4,5,6,7,8,9,10,11,12,13,14,15,16,17,18,19,20,21,22,23,24,25,26,27,28,29,30,1,2,3,4,5,6,7,8,9,10,11,12,13,14,15,16,17,18,19,20,21,22,23,24,25,26,{"$f":"DAY(IXQ5)","v":27},28,29,30,31,1,2,3,4,5,6,7,8,9,10,11,12,13,14,15,16,17,18,19,20,21,22,23,24,25,26,27,28,29,30,1,2,3,4,5,6,7,8,9,10,11,12,13,14,15,16,17,18,19,20,21,22,23,24,25,26,27,28,29,{"$f":"DAY(JAC5)","v":30},31,1,2,3,4,5,6,7,8,9,10,11,12,13,14,15,16,17,18,19,20,21,22,23,24,25,26,27,28,29,30,31,1,2,3,4,5,6,7,8,9,10,11,12,13,14,15,16,17,18,19,20,21,22,23,24,25,26,27,28,29,30,1,{"$f":"DAY(JCO5)","v":2},3,4,5,6,7,8,9,10,11,12,13,14,15,16,17,18,19,20,21,22,23,24,25,26,27,28,29,30,31,1,2,3,4,5,6,7,8,9,10,11,12,13,14,15,16,17,18,19,20,21,22,23,24,25,26,27,28,29,30,1,2,3,4,{"$f":"DAY(JFA5)","v":5},6,7,8,9,10,11,12,13,14,15,16,17,18,19,20,21,22,23,24,25,26,27,28,29,30,31,1,2,3,4,5,6,7,8,9,10,11,12,13,14,15,16,17,18,19,20,21,22,23,24,25,26,27,28,29,30,31,1,2,3,4,5,6,{"$f":"DAY(JHM5)","v":7},8,9,10,11,12,13,14,15,16,17,18,19,20,21,22,23,24,25,26,27,28,1,2,3,4,5,6,7,8,9,10,11,12,13,14,15,16,17,18,19,20,21,22,23,24,25,26,27,28,29,30,31,1,2,3,4,5,6,7,8,9,10,11,{"$f":"DAY(JJY5)","v":12},13,14,15,16,17,18,19,20,21,22,23,24,25,26,27,28,29,30,1,2,3,4,5,6,7,8,9,10,11,12,13,14,15,16,17,18,19,20,21,22,23,24,25,26,27,28,29,30,31,1,2,3,4,5,6,7,8,9,10,11,12,13,14,{"$f":"DAY(JMK5)","v":15},16,17,18,19,20,21,22,23,24,25,26,27,28,29,30,1,2,3,4,5,6,7,8,9,10,11,12,13,14,15,16,17,18,19,20,21,22,23,24,25,26,27,28,29,30,31,1,2,3,4,5,6,7,8,9,10,11,12,13,14,15,16,17,{"$f":"DAY(JOW5)","v":18},19,20,21,22,23,24,25,26,27,28,29,30,31,1,2,3,4,5,6,7,8,9,10,11,12,13,14,15,16,17,18,19,20,21,22,23,24,25,26,27,28,29,30,1,2,3,4,5,6,7,8,9,10,11,12,13,14,15,16,17,18,19,20,{"$f":"DAY(JRI5)","v":21},22,23,24,25,26,27,28,29,30,31,1,2,3,4,5,6,7,8,9,10,11,12,13,14,15,16,17,18,19,20,21,22,23,24,25,26,27,28,29,30,1,2,3,4,5,6,7,8,9,10,11,12,13,14,15,16,17,18,19,20,21,22,23,{"$f":"DAY(JTU5)","v":24},25,26,27,28,29,30,31,1]
[{"$nulls":3},"2020-01-01","2020-01-02","2020-01-03","2020-01-04","2020-01-05","2020-01-06","2020-01-07","2020-01-08","2020-01-09","2020-01-10","2020-01-11","2020-01-12","2020-01-13","2020-01-14","2020-01-15","2020-01-16","2020-01-17","2020-01-18","2020-01-19","2020-01-20","2020-01-21","2020-01-22","2020-01-23","2020-01-24","2020-01-25","2020-01-26","2020-01-27","2020-01-28","2020-01-29","2020-01-30","2020-01-31","2020-02-01","2020-02-02","2020-02-03","2020-02-04","2020-02-05","2020-02-06","2020-02-07","2020-02-08","2020-02-09","2020-02-10","2020-02-11","2020-02-12","2020-02-13","2020-02-14","2020-02-15","2020-02-16","2020-02-17","2020-02-18","2020-02-19","2020-02-20","2020-02-21","2020-02-22","2020-02-23","2020-02-24","2020-02-25","2020-02-26","2020-02-27","2020-02-28","2020-02-29","2020-03-01","2020-03-02","2020-03-03","2020-03-04","2020-03-05","2020-03-06","2020-03-07","2020-03-08","2020-03-09","2020-03-10","2020-03-11","2020-03-12","2020-03-13","2020-03-14","2020-03-15","2020-03-16","2020-03-17","2020-03-18","2020-03-19","2020-03-20","2020-03-21","2020-03-22","2020-03-23","2020-03-24","2020-03-25","2020-03-26","2020-03-27","2020-03-28","2020-03-29","2020-03-30","2020-03-31","2020-04-01","2020-04-02","2020-04-03","2020-04-04","2020-04-05","2020-04-06","2020-04-07","2020-04-08","2020-04-09","2020-04-10","2020-04-11","2020-04-12","2020-04-13","2020-04-14","2020-04-15","2020-04-16","2020-04-17","2020-04-18","2020-04-19","2020-04-20","2020-04-21","2020-04-22","2020-04-23","2020-04-24","2020-04-25","2020-04-26","2020-04-27","2020-04-28","2020-04-29","2020-04-30","2020-05-01","2020-05-02","2020-05-03","2020-05-04","2020-05-05","2020-05-06","2020-05-07","2020-05-08","2020-05-09","2020-05-10","2020-05-11","2020-05-12","2020-05-13","2020-05-14","2020-05-15","2020-05-16","2020-05-17","2020-05-18","2020-05-19","2020-05-20","2020-05-21","2020-05-22","2020-05-23","2020-05-24","2020-05-25","2020-05-26","2020-05-27","2020-05-28","2020-05-29","2020-05-30","2020-05-31","2020-06-01","2020-06-02","2020-06-03","2020-06-04","2020-06-05","2020-06-06","2020-06-07","2020-06-08","2020-06-09","2020-06-10","2020-06-11","2020-06-12","2020-06-13","2020-06-14","2020-06-15","2020-06-16","2020-06-17","2020-06-18","2020-06-19","2020-06-20","2020-06-21","2020-06-22","2020-06-23","2020-06-24","2020-06-25","2020-06-26","2020-06-27","2020-06-28","2020-06-29","2020-06-30","2020-07-01","2020-07-02","2020-07-03","2020-07-04","2020-07-05","2020-07-06","2020-07-07","2020-07-08","2020-07-09","2020-07-10","2020-07-11","2020-07-12","2020-07-13","2020-07-14","2020-07-15","2020-07-16","2020-07-17","2020-07-18","2020-07-19","2020-07-20","2020-07-21","2020-07-22","2020-07-23","2020-07-24","2020-07-25","2020-07-26","2020-07-27","2020-07-28","2020-07-29","2020-07-30","2020-07-31","2020-08-01","2020-08-02","2020-08-03","2020-08-04","2020-08-05","2020-08-06","2020-08-07","2020-08-08","2020-08-09","2020-08-10","2020-08-11","2020-08-12","2020-08-13","2020-08-14","2020-08-15","2020-08-16","2020-08-17","2020-08-18","2020-08-19","2020-08-20","2020-08-21","2020-08-22","2020-08-23","2020-08-24","2020-08-25","2020-08-26","2020-08-27","2020-08-28","2020-08-29","2020-08-30","2020-08-31","2020-09-01","2020-09-02","2020-09-03","2020-09-04","2020-09-05","2020-09-06","2020-09-07","2020-09-08","2020-09-09","2020-09-10","2020-09-11","2020-09-12","2020-09-13","2020-09-14","2020-09-15","2020-09-16","2020-09-17","2020-09-18","2020-09-19","2020-09-20","2020-09-21","2020-09-22","2020-09-23","2020-09-24","2020-09-25","2020-09-26","2020-09-27","2020-09-28","2020-09-29","2020-09-30","2020-10-01","2020-10-02","2020-10-03","2020-10-04","2020-10-05","2020-10-06","2020-10-07","2020-10-08","2020-10-09","2020-10-10","2020-10-11","2020-10-12","2020-10-13","2020-10-14","2020-10-15","2020-10-16","2020-10-17","2020-10-18","2020-10-19","2020-10-20","2020-10-21","2020-10-22","2020-10-23","2020-10-24","2020-10-25","2020-10-26","2020-10-27","2020-10-28","2020-10-29","2020-10-30","2020-10-31","2020-11-01","2020-11-02","2020-11-03","2020-11-04","2020-11-05","2020-11-06","2020-11-07","2020-11-08","2020-11-09","2020-11-10","2020-11-11","2020-11-12","2020-11-13","2020-11-14","2020-11-15","2020-11-16","2020-11-17","2020-11-18","2020-11-19","2020-11-20","2020-11-21","2020-11-22","2020-11-23","2020-11-24","2020-11-25","2020-11-26","2020-11-27","2020-11-28","2020-11-29","2020-11-30","2020-12-01","2020-12-02","2020-12-03","2020-12-04","2020-12-05","2020-12-06","2020-12-07","2020-12-08","2020-12-09","2020-12-10","2020-12-11","2020-12-12","2020-12-13","2020-12-14","2020-12-15","2020-12-16","2020-12-17","2020-12-18","2020-12-19","2020-12-20","2020-12-21","2020-12-22","2020-12-23","2020-12-24","2020-12-25","2020-12-26","2020-12-27","2020-12-28","2020-12-29","2020-12-30","2020-12-31","2021-01-01","2021-01-02","2021-01-03","2021-01-04","2021-01-05","2021-01-06","2021-01-07","2021-01-08","2021-01-09","2021-01-10","2021-01-11","2021-01-12","2021-01-13","2021-01-14","2021-01-15","2021-01-16","2021-01-17","2021-01-18","2021-01-19","2021-01-20","2021-01-21","2021-01-22","2021-01-23","2021-01-24","2021-01-25","2021-01-26","2021-01-27","2021-01-28","2021-01-29","2021-01-30","2021-01-31","2021-02-01","2021-02-02","2021-02-03","2021-02-04","2021-02-05","2021-02-06","2021-02-07","2021-02-08","2021-02-09","2021-02-10","2021-02-11","2021-02-12","2021-02-13","2021-02-14","2021-02-15","2021-02-16","2021-02-17","2021-02-18","2021-02-19","2021-02-20","2021-02-21","2021-02-22","2021-02-23","2021-02-24","2021-02-25","2021-02-26","2021-02-27","2021-02-28","2021-03-01","2021-03-02","2021-03-03","2021-03-04","2021-03-05","2021-03-06","2021-03-07","2021-03-08","2021-03-09","2021-03-10","2021-03-11","2021-03-12","2021-03-13","2021-03-14","2021-03-15","2021-03-16","2021-03-17","2021-03-18","2021-03-19","2021-03-20","2021-03-21","2021-03-22","2021-03-23","2021-03-24","2021-03-25","2021-03-26","2021-03-27","2021-03-28","2021-03-29","2021-03-30","2021-03-31","2021-04-01","2021-04-02","2021-04-03","2021-04-04","2021-04-05","2021-04-06","2021-04-07","2021-04-08","2021-04-09","2021-04-10","2021-04-11","2021-04-12","2021-04-13","2021-04-14","2021-04-15","2021-04-16","2021-04-17","2021-04-18","2021-04-19","2021-04-20","2021-04-21","2021-04-22","2021-04-23","2021-04-24","2021-04-25","2021-04-26","2021-04-27","2021-04-28","2021-04-29","2021-04-30","2021-05-01","2021-05-02","2021-05-03","2021-05-04","2021-05-05","2021-05-06","2021-05-07","2021-05-08","2021-05-09","2021-05-10","2021-05-11","2021-05-12","2021-05-13","2021-05-14","2021-05-15","2021-05-16","2021-05-17","2021-05-18","2021-05-19","2021-05-20","2021-05-21","2021-05-22","2021-05-23","2021-05-24","2021-05-25","2021-05-26","2021-05-27","2021-05-28","2021-05-29","2021-05-30","2021-05-31","2021-06-01","2021-06-02","2021-06-03","2021-06-04","2021-06-05","2021-06-06","2021-06-07","2021-06-08","2021-06-09","2021-06-10","2021-06-11","2021-06-12","2021-06-13","2021-06-14","2021-06-15","2021-06-16","2021-06-17","2021-06-18","2021-06-19","2021-06-20","2021-06-21","2021-06-22","2021-06-23","2021-06-24","2021-06-25","2021-06-26","2021-06-27","2021-06-28","2021-06-29","2021-06-30","2021-07-01","2021-07-02","2021-07-03","2021-07-04","2021-07-05","2021-07-06","2021-07-07","2021-07-08","2021-07-09","2021-07-10","2021-07-11","2021-07-12","2021-07-13","2021-07-14","2021-07-15","2021-07-16","2021-07-17","2021-07-18","2021-07-19","2021-07-20","2021-07-21","2021-07-22","2021-07-23","2021-07-24","2021-07-25","2021-07-26","2021-07-27","2021-07-28","2021-07-29","2021-07-30","2021-07-31","2021-08-01","2021-08-02","2021-08-03","2021-08-04","2021-08-05","2021-08-06","2021-08-07","2021-08-08","2021-08-09","2021-08-10","2021-08-11","2021-08-12","2021-08-13","2021-08-14","2021-08-15","2021-08-16","2021-08-17","2021-08-18","2021-08-19","2021-08-20","2021-08-21","2021-08-22","2021-08-23","2021-08-24","2021-08-25","2021-08-26","2021-08-27","2021-08-28","2021-08-29","2021-08-30","2021-08-31","2021-09-01","2021-09-02","2021-09-03","2021-09-04","2021-09-05","2021-09-06","2021-09-07","2021-09-08","2021-09-09","2021-09-10","2021-09-11","2021-09-12","2021-09-13","2021-09-14","2021-09-15","2021-09-16","2021-09-17","2021-09-18","2021-09-19","2021-09-20","2021-09-21","2021-09-22","2021-09-23","2021-09-24","2021-09-25","2021-09-26","2021-09-27","2021-09-28","2021-09-29","2021-09-30","2021-10-01","2021-10-02","2021-10-03","2021-10-04","2021-10-05","2021-10-06","2021-10-07","2021-10-08","2021-10-09","2021-10-10","2021-10-11","2021-10-12","2021-10-13","2021-10-14","2021-10-15","2021-10-16","2021-10-17","2021-10-18","2021-10-19","2021-10-20","2021-10-21","2021-10-22","2021-10-23","2021-10-24","2021-10-25","2021-10-26","2021-10-27","2021-10-28","2021-10-29","2021-10-30","2021-10-31","2021-11-01","2021-11-02","2021-11-03","2021-11-04","2021-11-05","2021-11-06","2021-11-07","2021-11-08","2021-11-09","2021-11-10","2021-11-11","2021-11-12","2021-11-13","2021-11-14","2021-11-15","2021-11-16","2021-11-17","2021-11-18","2021-11-19","2021-11-20","2021-11-21","2021-11-22","2021-11-23","2021-11-24","2021-11-25","2021-11-26","2021-11-27","2021-11-28","2021-11-29","2021-11-30","2021-12-01","2021-12-02","2021-12-03","2021-12-04","2021-12-05","2021-12-06","2021-12-07","2021-12-08","2021-12-09","2021-12-10","2021-12-11","2021-12-12","2021-12-13","2021-12-14","2021-12-15","2021-12-16","2021-12-17","2021-12-18","2021-12-19","2021-12-20","2021-12-21","2021-12-22","2021-12-23","2021-12-24","2021-12-25","2021-12-26","2021-12-27","2021-12-28","2021-12-29","2021-12-30","2021-12-31","2022-01-01","2022-01-02","2022-01-03","2022-01-04","2022-01-05","2022-01-06","2022-01-07","2022-01-08","2022-01-09","2022-01-10","2022-01-11","2022-01-12","2022-01-13","2022-01-14","2022-01-15","2022-01-16","2022-01-17","2022-01-18","2022-01-19","2022-01-20","2022-01-21","2022-01-22","2022-01-23","2022-01-24","2022-01-25","2022-01-26","2022-01-27","2022-01-28","2022-01-29","2022-01-30","2022-01-31","2022-02-01","2022-02-02","2022-02-03","2022-02-04","2022-02-05","2022-02-06","2022-02-07","2022-02-08","2022-02-09","2022-02-10","2022-02-11","2022-02-12","2022-02-13","2022-02-14","2022-02-15","2022-02-16","2022-02-17","2022-02-18","2022-02-19","2022-02-20","2022-02-21","2022-02-22","2022-02-23","2022-02-24","2022-02-25","2022-02-26","2022-02-27","2022-02-28","2022-03-01","2022-03-02","2022-03-03","2022-03-04","2022-03-05","2022-03-06","2022-03-07","2022-03-08","2022-03-09","2022-03-10","2022-03-11","2022-03-12","2022-03-13","2022-03-14","2022-03-15","2022-03-16","2022-03-17","2022-03-18","2022-03-19","2022-03-20","2022-03-21","2022-03-22","2022-03-23","2022-03-24","2022-03-25","2022-03-26","2022-03-27","2022-03-28","2022-03-29","2022-03-30","2022-03-31","2022-04-01","2022-04-02","2022-04-03","2022-04-04","2022-04-05","2022-04-06","2022-04-07","2022-04-08","2022-04-09","2022-04-10","2022-04-11","2022-04-12","2022-04-13","2022-04-14","2022-04-15","2022-04-16","2022-04-17","2022-04-18","2022-04-19","2022-04-20","2022-04-21","2022-04-22","2022-04-23","2022-04-24","2022-04-25","2022-04-26","2022-04-27","2022-04-28","2022-04-29","2022-04-30","2022-05-01","2022-05-02","2022-05-03","2022-05-04","2022-05-05","2022-05-06","2022-05-07","2022-05-08","2022-05-09","2022-05-10","2022-05-11","2022-05-12","2022-05-13","2022-05-14","2022-05-15","2022-05-16","2022-05-17","2022-05-18","2022-05-19","2022-05-20","2022-05-21","2022-05-22","2022-05-23","2022-05-24","2022-05-25","2022-05-26","2022-05-27","2022-05-28","2022-05-29","2022-05-30","2022-05-31","2022-06-01","2022-06-02","2022-06-03","2022-06-04","2022-06-05","2022-06-06","2022-06-07","2022-06-08","2022-06-09","2022-06-10","2022-06-11","2022-06-12","2022-06-13","2022-06-14","2022-06-15","2022-06-16","2022-06-17","2022-06-18","2022-06-19","2022-06-20","2022-06-21","2022-06-22","2022-06-23","2022-06-24","2022-06-25","2022-06-26","2022-06-27","2022-06-28","2022-06-29","2022-06-30","2022-07-01","2022-07-02","2022-07-03","2022-07-04","2022-07-05","2022-07-06","2022-07-07","2022-07-08","2022-07-09","2022-07-10","2022-07-11","2022-07-12","2022-07-13","2022-07-14","2022-07-15","2022-07-16","2022-07-17","2022-07-18","2022-07-19","2022-07-20","2022-07-21","2022-07-22","2022-07-23","2022-07-24","2022-07-25","2022-07-26","2022-07-27","2022-07-28","2022-07-29","2022-07-30","2022-07-31","2022-08-01","2022-08-02","2022-08-03","2022-08-04","2022-08-05","2022-08-06","2022-08-07","2022-08-08","2022-08-09","2022-08-10","2022-08-11","2022-08-12","2022-08-13","2022-08-14","2022-08-15","2022-08-16","2022-08-17","2022-08-18","2022-08-19","2022-08-20","2022-08-21","2022-08-22","2022-08-23","2022-08-24","2022-08-25","2022-08-26","2022-08-27","2022-08-28","2022-08-29","2022-08-30","2022-08-31","2022-09-01","2022-09-02","2022-09-03","2022-09-04","2022-09-05","2022-09-06","2022-09-07","2022-09-08","2022-09-09","2022-09-10","2022-09-11","2022-09-12","2022-09-13","2022-09-14","2022-09-15","2022-09-16","2022-09-17","2022-09-18","2022-09-19","2022-09-20","2022-09-21","2022-09-22","2022-09-23","2022-09-24","2022-09-25","2022-09-26","2022-09-27","2022-09-28","2022-09-29","2022-09-30","2022-10-01","2022-10-02","2022-10-03","2022-10-04","2022-10-05","2022-10-06","2022-10-07","2022-10-08","2022-10-09","2022-10-10","2022-10-11","2022-10-12","2022-10-13","2022-10-14","2022-10-15","2022-10-16","2022-10-17","2022-10-18","2022-10-19","2022-10-20","2022-10-21","2022-10-22","2022-10-23","2022-10-24","2022-10-25","2022-10-26","2022-10-27","2022-10-28","2022-10-29","2022-10-30","2022-10-31","2022-11-01","2022-11-02","2022-11-03","2022-11-04","2022-11-05","2022-11-06","2022-11-07","2022-11-08","2022-11-09","2022-11-10","2022-11-11","2022-11-12","2022-11-13","2022-11-14","2022-11-15","2022-11-16","2022-11-17","2022-11-18","2022-11-19","2022-11-20","2022-11-21","2022-11-22","2022-11-23","2022-11-24","2022-11-25","2022-11-26","2022-11-27","2022-11-28","2022-11-29","2022-11-30","2022-12-01","2022-12-02","2022-12-03","2022-12-04","2022-12-05","2022-12-06","2022-12-07","2022-12-08","2022-12-09","2022-12-10","2022-12-11","2022-12-12","2022-12-13","2022-12-14","2022-12-15","2022-12-16","2022-12-17","2022-12-18","2022-12-19","2022-12-20","2022-12-21","2022-12-22","2022-12-23","2022-12-24","2022-12-25","2022-12-26","2022-12-27","2022-12-28","2022-12-29","2022-12-30","2022-12-31","2023-01-01","2023-01-02","2023-01-03","2023-01-04","2023-01-05","2023-01-06","2023-01-07","2023-01-08","2023-01-09","2023-01-10","2023-01-11","2023-01-12","2023-01-13","2023-01-14","2023-01-15","2023-01-16","2023-01-17","2023-01-18","2023-01-19","2023-01-20","2023-01-21","2023-01-22","2023-01-23","2023-01-24","2023-01-25","2023-01-26","2023-01-27","2023-01-28","2023-01-29","2023-01-30","2023-01-31","2023-02-01","2023-02-02","2023-02-03","2023-02-04","2023-02-05","2023-02-06","2023-02-07","2023-02-08","2023-02-09","2023-02-10","2023-02-11","2023-02-12","2023-02-13","2023-02-14","2023-02-15","2023-02-16","2023-02-17","2023-02-18","2023-02-19","2023-02-20","2023-02-21","2023-02-22","2023-02-23","2023-02-24","2023-02-25","2023-02-26","2023-02-27","2023-02-28","2023-03-01","2023-03-02","2023-03-03","2023-03-04","2023-03-05","2023-03-06","2023-03-07","2023-03-08","2023-03-09","2023-03-10","2023-03-11","2023-03-12","2023-03-13","2023-03-14","2023-03-15","2023-03-16","2023-03-17","2023-03-18","2023-03-19","2023-03-20","2023-03-21","2023-03-22","2023-03-23","2023-03-24","2023-03-25","2023-03-26","2023-03-27","2023-03-28","2023-03-29","2023-03-30","2023-03-31","2023-04-01","2023-04-02","2023-04-03","2023-04-04","2023-04-05","2023-04-06","2023-04-07","2023-04-08","2023-04-09","2023-04-10","2023-04-11","2023-04-12","2023-04-13","2023-04-14","2023-04-15","2023-04-16","2023-04-17","2023-04-18","2023-04-19","2023-04-20","2023-04-21","2023-04-22","2023-04-23","2023-04-24","2023-04-25","2023-04-26","2023-04-27","2023-04-28","2023-04-29","2023-04-30","2023-05-01","2023-05-02","2023-05-03","2023-05-04","2023-05-05","2023-05-06","2023-05-07","2023-05-08","2023-05-09","2023-05-10","2023-05-11","2023-05-12","2023-05-13","2023-05-14","2023-05-15","2023-05-16","2023-05-17","2023-05-18","2023-05-19","2023-05-20","2023-05-21","2023-05-22","2023-05-23","2023-05-24","2023-05-25","2023-05-26","2023-05-27","2023-05-28","2023-05-29","2023-05-30","2023-05-31","2023-06-01","2023-06-02","2023-06-03","2023-06-04","2023-06-05","2023-06-06","2023-06-07","2023-06-08","2023-06-09","2023-06-10","2023-06-11","2023-06-12","2023-06-13","2023-06-14","2023-06-15","2023-06-16","2023-06-17","2023-06-18","2023-06-19","2023-06-20","2023-06-21","2023-06-22","2023-06-23","2023-06-24","2023-06-25","2023-06-26","2023-06-27","2023-06-28","2023-06-29","2023-06-30","2023-07-01","2023-07-02","2023-07-03","2023-07-04","2023-07-05","2023-07-06","2023-07-07","2023-07-08","2023-07-09","2023-07-10","2023-07-11","2023-07-12","2023-07-13","2023-07-14","2023-07-15","2023-07-16","2023-07-17","2023-07-18","2023-07-19","2023-07-20","2023-07-21","2023-07-22","2023-07-23","2023-07-24","2023-07-25","2023-07-26","2023-07-27","2023-07-28","2023-07-29","2023-07-30","2023-07-31","2023-08-01","2023-08-02","2023-08-03","2023-08-04","2023-08-05","2023-08-06","2023-08-07","2023-08-08","2023-08-09","2023-08-10","2023-08-11","2023-08-12","2023-08-13","2023-08-14","2023-08-15","2023-08-16","2023-08-17","2023-08-18","2023-08-19","2023-08-20","2023-08-21","2023-08-22","2023-08-23","2023-08-24","2023-08-25","2023-08-26","2023-08-27","2023-08-28","2023-08-29","2023-08-30","2023-08-31","2023-09-01","2023-09-02","2023-09-03","2023-09-04","2023-09-05","2023-09-06","2023-09-07","2023-09-08","2023-09-09","2023-09-10","2023-09-11","2023-09-12","2023-09-13","2023-09-14","2023-09-15","2023-09-16","2023-09-17","2023-09-18","2023-09-19","2023-09-20","2023-09-21","2023-09-22","2023-09-23","2023-09-24","2023-09-25","2023-09-26","2023-09-27","2023-09-28","2023-09-29","2023-09-30","2023-10-01","2023-10-02","2023-10-03","2023-10-04","2023-10-05","2023-10-06","2023-10-07","2023-10-08","2023-10-09","2023-10-10","2023-10-11","2023-10-12","2023-10-13","2023-10-14","2023-10-15","2023-10-16","2023-10-17","2023-10-18","2023-10-19","2023-10-20","2023-10-21","2023-10-22","2023-10-23","2023-10-24","2023-10-25","2023-10-26","2023-10-27","2023-10-28","2023-10-29","2023-10-30","2023-10-31","2023-11-01","2023-11-02","2023-11-03","2023-11-04","2023-11-05","2023-11-06","2023-11-07","2023-11-08","2023-11-09","2023-11-10","2023-11-11","2023-11-12","2023-11-13","2023-11-14","2023-11-15","2023-11-16","2023-11-17","2023-11-18","2023-11-19","2023-11-20","2023-11-21","2023-11-22","2023-11-23","2023-11-24","2023-11-25","2023-11-26","2023-11-27","2023-11-28","2023-11-29","2023-11-30","2023-12-01","2023-12-02","2023-12-03","2023-12-04","2023-12-05","2023-12-06","2023-12-07","2023-12-08","2023-12-09","2023-12-10","2023-12-11","2023-12-12","2023-12-13","2023-12-14","2023-12-15","2023-12-16","2023-12-17","2023-12-18","2023-12-19","2023-12-20","2023-12-21","2023-12-22","2023-12-23","2023-12-24","2023-12-25","2023-12-26","2023-12-27","2023-12-28","2023-12-29","2023-12-30","2023-12-31","2024-01-01","2024-01-02","2024-01-03","2024-01-04","2024-01-05","2024-01-06","2024-01-07","2024-01-08","2024-01-09","2024-01-10","2024-01-11","2024-01-12","2024-01-13","2024-01-14","2024-01-15","2024-01-16","2024-01-17","2024-01-18","2024-01-19","2024-01-20","2024-01-21","2024-01-22","2024-01-23","2024-01-24","2024-01-25","2024-01-26","2024-01-27","2024-01-28","2024-01-29","2024-01-30","2024-01-31","2024-02-01","2024-02-02","2024-02-03","2024-02-04","2024-02-05","2024-02-06","2024-02-07","2024-02-08","2024-02-09","2024-02-10","2024-02-11","2024-02-12","2024-02-13","2024-02-14","2024-02-15","2024-02-16","2024-02-17","2024-02-18","2024-02-19","2024-02-20","2024-02-21","2024-02-22","2024-02-23","2024-02-24","2024-02-25","2024-02-26","2024-02-27","2024-02-28","2024-02-29","2024-03-01","2024-03-02","2024-03-03","2024-03-04","2024-03-05","2024-03-06","2024-03-07","2024-03-08","2024-03-09","2024-03-10","2024-03-11","2024-03-12","2024-03-13","2024-03-14","2024-03-15","2024-03-16","2024-03-17","2024-03-18","2024-03-19","2024-03-20","2024-03-21","2024-03-22","2024-03-23","2024-03-24","2024-03-25","2024-03-26","2024-03-27","2024-03-28","2024-03-29","2024-03-30","2024-03-31","2024-04-01","2024-04-02","2024-04-03","2024-04-04","2024-04-05","2024-04-06","2024-04-07","2024-04-08","2024-04-09","2024-04-10","2024-04-11","2024-04-12","2024-04-13","2024-04-14","2024-04-15","2024-04-16","2024-04-17","2024-04-18","2024-04-19","2024-04-20","2024-04-21","2024-04-22","2024-04-23","2024-04-24","2024-04-25","2024-04-26","2024-04-27","2024-04-28","2024-04-29","2024-04-30","2024-05-01","2024-05-02","2024-05-03","2024-05-04","2024-05-05","2024-05-06","2024-05-07","2024-05-08","2024-05-09","2024-05-10","2024-05-11","2024-05-12","2024-05-13","2024-05-14","2024-05-15","2024-05-16","2024-05-17","2024-05-18","2024-05-19","2024-05-20","2024-05-21","2024-05-22","2024-05-23","2024-05-24","2024-05-25","2024-05-26","2024-05-27","2024-05-28","2024-05-29","2024-05-30","2024-05-31","2024-06-01","2024-06-02","2024-06-03","2024-06-04","2024-06-05","2024-06-06","2024-06-07","2024-06-08","2024-06-09","2024-06-10","2024-06-11","2024-06-12","2024-06-13","2024-06-14","2024-06-15","2024-06-16","2024-06-17","2024-06-18","2024-06-19","2024-06-20","2024-06-21","2024-06-22","2024-06-23","2024-06-24","2024-06-25","2024-06-26","2024-06-27","2024-06-28","2024-06-29","2024-06-30","2024-07-01","2024-07-02","2024-07-03","2024-07-04","2024-07-05","2024-07-06","2024-07-07","2024-07-08","2024-07-09","2024-07-10","2024-07-11","2024-07-12","2024-07-13","2024-07-14","2024-07-15","2024-07-16","2024-07-17","2024-07-18","2024-07-19","2024-07-20","2024-07-21","2024-07-22","2024-07-23","2024-07-24","2024-07-25","2024-07-26","2024-07-27","2024-07-28","2024-07-29","2024-07-30","2024-07-31","2024-08-01","2024-08-02","2024-08-03","2024-08-04","2024-08-05","2024-08-06","2024-08-07","2024-08-08","2024-08-09","2024-08-10","2024-08-11","2024-08-12","2024-08-13","2024-08-14","2024-08-15","2024-08-16","2024-08-17","2024-08-18","2024-08-19","2024-08-20","2024-08-21","2024-08-22","2024-08-23","2024-08-24","2024-08-25","2024-08-26","2024-08-27","2024-08-28","2024-08-29","2024-08-30","2024-08-31","2024-09-01","2024-09-02","2024-09-03","2024-09-04","2024-09-05","2024-09-06","2024-09-07","2024-09-08","2024-09-09","2024-09-10","2024-09-11","2024-09-12","2024-09-13","2024-09-14","2024-09-15","2024-09-16","2024-09-17","2024-09-18","2024-09-19","2024-09-20","2024-09-21","2024-09-22","2024-09-23","2024-09-24","2024-09-25","2024-09-26","2024-09-27","2024-09-28","2024-09-29","2024-09-30","2024-10-01","2024-10-02","2024-10-03","2024-10-04","2024-10-05","2024-10-06","2024-10-07","2024-10-08","2024-10-09","2024-10-10","2024-10-11","2024-10-12","2024-10-13","2024-10-14","2024-10-15","2024-10-16","2024-10-17","2024-10-18","2024-10-19","2024-10-20","2024-10-21","2024-10-22","2024-10-23","2024-10-24","2024-10-25","2024-10-26","2024-10-27","2024-10-28","2024-10-29","2024-10-30","2024-10-31","2024-11-01","2024-11-02","2024-11-03","2024-11-04","2024-11-05","2024-11-06","2024-11-07","2024-11-08","2024-11-09","2024-11-10","2024-11-11","2024-11-12","2024-11-13","2024-11-14","2024-11-15","2024-11-16","2024-11-17","2024-11-18","2024-11-19","2024-11-20","2024-11-21","2024-11-22","2024-11-23","2024-11-24","2024-11-25","2024-11-26","2024-11-27","2024-11-28","2024-11-29","2024-11-30","2024-12-01","2024-12-02","2024-12-03","2024-12-04","2024-12-05","2024-12-06","2024-12-07","2024-12-08","2024-12-09","2024-12-10","2024-12-11","2024-12-12","2024-12-13","2024-12-14","2024-12-15","2024-12-16","2024-12-17","2024-12-18","2024-12-19","2024-12-20","2024-12-21","2024-12-22","2024-12-23","2024-12-24","2024-12-25","2024-12-26","2024-12-27","2024-12-28","2024-12-29","2024-12-30","2024-12-31","2025-01-01","2025-01-02","2025-01-03","2025-01-04","2025-01-05","2025-01-06","2025-01-07","2025-01-08","2025-01-09","2025-01-10","2025-01-11","2025-01-12","2025-01-13","2025-01-14","2025-01-15","2025-01-16","2025-01-17","2025-01-18","2025-01-19","2025-01-20","2025-01-21","2025-01-22","2025-01-23","2025-01-24","2025-01-25","2025-01-26","2025-01-27","2025-01-28","2025-01-29","2025-01-30","2025-01-31","2025-02-01","2025-02-02","2025-02-03","2025-02-04","2025-02-05","2025-02-06","2025-02-07","2025-02-08","2025-02-09","2025-02-10","2025-02-11","2025-02-12","2025-02-13","2025-02-14","2025-02-15","2025-02-16","2025-02-17","2025-02-18","2025-02-19","2025-02-20","2025-02-21","2025-02-22","2025-02-23","2025-02-24","2025-02-25","2025-02-26","2025-02-27","2025-02-28","2025-03-01","2025-03-02","2025-03-03","2025-03-04","2025-03-05","2025-03-06","2025-03-07","2025-03-08","2025-03-09","2025-03-10","2025-03-11","2025-03-12","2025-03-13","2025-03-14","2025-03-15","2025-03-16","2025-03-17","2025-03-18","2025-03-19","2025-03-20","2025-03-21","2025-03-22","2025-03-23","2025-03-24","2025-03-25","2025-03-26","2025-03-27","2025-03-28","2025-03-29","2025-03-30","2025-03-31","2025-04-01","2025-04-02","2025-04-03","2025-04-04","2025-04-05","2025-04-06","2025-04-07","2025-04-08","2025-04-09","2025-04-10","2025-04-11","2025-04-12","2025-04-13","2025-04-14","2025-04-15","2025-04-16","2025-04-17","2025-04-18","2025-04-19","2025-04-20","2025-04-21","2025-04-22","2025-04-23","2025-04-24","2025-04-25","2025-04-26","2025-04-27","2025-04-28","2025-04-29","2025-04-30","2025-05-01","2025-05-02","2025-05-03","2025-05-04","2025-05-05","2025-05-06","2025-05-07","2025-05-08","2025-05-09","2025-05-10","2025-05-11","2025-05-12","2025-05-13","2025-05-14","2025-05-15","2025-05-16","2025-05-17","2025-05-18","2025-05-19","2025-05-20","2025-05-21","2025-05-22","2025-05-23","2025-05-24","2025-05-25","2025-05-26","2025-05-27","2025-05-28","2025-05-29","2025-05-30","2025-05-31","2025-06-01","2025-06-02","2025-06-03","2025-06-04","2025-06-05","2025-06-06","2025-06-07","2025-06-08","2025-06-09","2025-06-10","2025-06-11","2025-06-12","2025-06-13","2025-06-14","2025-06-15","2025-06-16","2025-06-17","2025-06-18","2025-06-19","2025-06-20","2025-06-21","2025-06-22","2025-06-23","2025-06-24","2025-06-25","2025-06-26","2025-06-27","2025-06-28","2025-06-29","2025-06-30","2025-07-01","2025-07-02","2025-07-03","2025-07-04","2025-07-05","2025-07-06","2025-07-07","2025-07-08","2025-07-09","2025-07-10","2025-07-11","2025-07-12","2025-07-13","2025-07-14","2025-07-15","2025-07-16","2025-07-17","2025-07-18","2025-07-19","2025-07-20","2025-07-21","2025-07-22","2025-07-23","2025-07-24","2025-07-25","2025-07-26","2025-07-27","2025-07-28","2025-07-29","2025-07-30","2025-07-31","2025-08-01","2025-08-02","2025-08-03","2025-08-04","2025-08-05","2025-08-06","2025-08-07","2025-08-08","2025-08-09","2025-08-10","2025-08-11","2025-08-12","2025-08-13","2025-08-14","2025-08-15","2025-08-16","2025-08-17","2025-08-18","2025-08-19","2025-08-20","2025-08-21","2025-08-22","2025-08-23","2025-08-24","2025-08-25","2025-08-26","2025-08-27","2025-08-28","2025-08-29","2025-08-30","2025-08-31","2025-09-01","2025-09-02","2025-09-03","2025-09-04","2025-09-05","2025-09-06","2025-09-07","2025-09-08","2025-09-09","2025-09-10","2025-09-11","2025-09-12","2025-09-13","2025-09-14","2025-09-15","2025-09-16","2025-09-17","2025-09-18","2025-09-19","2025-09-20","2025-09-21","2025-09-22","2025-09-23","2025-09-24","2025-09-25","2025-09-26","2025-09-27","2025-09-28","2025-09-29","2025-09-30","2025-10-01","2025-10-02","2025-10-03","2025-10-04","2025-10-05","2025-10-06","2025-10-07","2025-10-08","2025-10-09","2025-10-10","2025-10-11","2025-10-12","2025-10-13","2025-10-14","2025-10-15","2025-10-16","2025-10-17","2025-10-18","2025-10-19","2025-10-20","2025-10-21","2025-10-22","2025-10-23","2025-10-24","2025-10-25","2025-10-26","2025-10-27","2025-10-28","2025-10-29","2025-10-30","2025-10-31","2025-11-01","2025-11-02","2025-11-03","2025-11-04","2025-11-05","2025-11-06","2025-11-07","2025-11-08","2025-11-09","2025-11-10","2025-11-11","2025-11-12","2025-11-13","2025-11-14","2025-11-15","2025-11-16","2025-11-17","2025-11-18","2025-11-19","2025-11-20","2025-11-21","2025-11-22","2025-11-23","2025-11-24","2025-11-25","2025-11-26","2025-11-27","2025-11-28","2025-11-29","2025-11-30","2025-12-01","2025-12-02","2025-12-03","2025-12-04","2025-12-05","2025-12-06","2025-12-07","2025-12-08","2025-12-09","2025-12-10","2025-12-11","2025-12-12","2025-12-13","2025-12-14","2025-12-15","2025-12-16","2025-12-17","2025-12-18","2025-12-19","2025-12-20","2025-12-21","2025-12-22","2025-12-23","2025-12-24","2025-12-25","2025-12-26","2025-12-27","2025-12-28","2025-12-29","2025-12-30","2025-12-31","2026-01-01","2026-01-02","2026-01-03","2026-01-04","2026-01-05","2026-01-06","2026-01-07","2026-01-08","2026-01-09","2026-01-10","2026-01-11","2026-01-12","2026-01-13","2026-01-14","2026-01-15","2026-01-16","2026-01-17","2026-01-18","2026-01-19","2026-01-20","2026-01-21","2026-01-22","2026-01-23","2026-01-24","2026-01-25","2026-01-26","2026-01-27","2026-01-28","2026-01-29","2026-01-30","2026-01-31","2026-02-01","2026-02-02","2026-02-03","2026-02-04","2026-02-05","2026-02-06","2026-02-07","2026-02-08","2026-02-09","2026-02-10","2026-02-11","2026-02-12","2026-02-13","2026-02-14","2026-02-15","2026-02-16","2026-02-17","2026-02-18","2026-02-19","2026-02-20","2026-02-21","2026-02-22","2026-02-23","2026-02-24","2026-02-25","2026-02-26","2026-02-27","2026-02-28","2026-03-01","2026-03-02","2026-03-03","2026-03-04","2026-03-05","2026-03-06","2026-03-07","2026-03-08","2026-03-09","2026-03-10","2026-03-11","2026-03-12","2026-03-13","2026-03-14","2026-03-15","2026-03-16","2026-03-17","2026-03-18","2026-03-19","2026-03-20","2026-03-21","2026-03-22","2026-03-23","2026-03-24","2026-03-25","2026-03-26","2026-03-27","2026-03-28","2026-03-29","2026-03-30","2026-03-31","2026-04-01","2026-04-02","2026-04-03","2026-04-04","2026-04-05","2026-04-06","2026-04-07","2026-04-08","2026-04-09","2026-04-10","2026-04-11","2026-04-12","2026-04-13","2026-04-14","2026-04-15","2026-04-16","2026-04-17","2026-04-18","2026-04-19","2026-04-20","2026-04-21","2026-04-22","2026-04-23","2026-04-24","2026-04-25","2026-04-26","2026-04-27","2026-04-28","2026-04-29","2026-04-30","2026-05-01","2026-05-02","2026-05-03","2026-05-04","2026-05-05","2026-05-06","2026-05-07","2026-05-08","2026-05-09","2026-05-10","2026-05-11","2026-05-12","2026-05-13","2026-05-14","2026-05-15","2026-05-16","2026-05-17","2026-05-18","2026-05-19","2026-05-20","2026-05-21","2026-05-22","2026-05-23","2026-05-24","2026-05-25","2026-05-26","2026-05-27","2026-05-28","2026-05-29","2026-05-30","2026-05-31","2026-06-01","2026-06-02","2026-06-03","2026-06-04","2026-06-05","2026-06-06","2026-06-07","2026-06-08","2026-06-09","2026-06-10","2026-06-11","2026-06-12","2026-06-13","2026-06-14","2026-06-15","2026-06-16","2026-06-17","2026-06-18","2026-06-19","2026-06-20","2026-06-21","2026-06-22","2026-06-23","2026-06-24","2026-06-25","2026-06-26","2026-06-27","2026-06-28","2026-06-29","2026-06-30","2026-07-01","2026-07-02","2026-07-03","2026-07-04","2026-07-05","2026-07-06","2026-07-07","2026-07-08","2026-07-09","2026-07-10","2026-07-11","2026-07-12","2026-07-13","2026-07-14","2026-07-15","2026-07-16","2026-07-17","2026-07-18","2026-07-19","2026-07-20","2026-07-21","2026-07-22","2026-07-23","2026-07-24","2026-07-25","2026-07-26","2026-07-27","2026-07-28","2026-07-29","2026-07-30","2026-07-31","2026-08-01","2026-08-02","2026-08-03","2026-08-04","2026-08-05","2026-08-06","2026-08-07","2026-08-08","2026-08-09","2026-08-10","2026-08-11","2026-08-12","2026-08-13","2026-08-14","2026-08-15","2026-08-16","2026-08-17","2026-08-18","2026-08-19","2026-08-20","2026-08-21","2026-08-22","2026-08-23","2026-08-24","2026-08-25","2026-08-26","2026-08-27","2026-08-28","2026-08-29","2026-08-30","2026-08-31","2026-09-01","2026-09-02","2026-09-03","2026-09-04","2026-09-05","2026-09-06","2026-09-07","2026-09-08","2026-09-09","2026-09-10","2026-09-11","2026-09-12","2026-09-13","2026-09-14","2026-09-15","2026-09-16","2026-09-17","2026-09-18","2026-09-19","2026-09-20","2026-09-21","2026-09-22","2026-09-23","2026-09-24","2026-09-25","2026-09-26","2026-09-27","2026-09-28","2026-09-29","2026-09-30","2026-10-01","2026-10-02","2026-10-03","2026-10-04","2026-10-05","2026-10-06","2026-10-07","2026-10-08","2026-10-09","2026-10-10","2026-10-11","2026-10-12","2026-10-13","2026-10-14","2026-10-15","2026-10-16","2026-10-17","2026-10-18","2026-10-19","2026-10-20","2026-10-21","2026-10-22","2026-10-23","2026-10-24","2026-10-25","2026-10-26","2026-10-27","2026-10-28","2026-10-29","2026-10-30","2026-10-31","2026-11-01","2026-11-02","2026-11-03","2026-11-04","2026-11-05","2026-11-06","2026-11-07","2026-11-08","2026-11-09","2026-11-10","2026-11-11","2026-11-12","2026-11-13","2026-11-14","2026-11-15","2026-11-16","2026-11-17","2026-11-18","2026-11-19","2026-11-20","2026-11-21","2026-11-22","2026-11-23","2026-11-24","2026-11-25","2026-11-26","2026-11-27","2026-11-28","2026-11-29","2026-11-30","2026-12-01","2026-12-02","2026-12-03","2026-12-04","2026-12-05","2026-12-06","2026-12-07","2026-12-08","2026-12-09","2026-12-10","2026-12-11","2026-12-12","2026-12-13","2026-12-14","2026-12-15","2026-12-16","2026-12-17","2026-12-18","2026-12-19","2026-12-20","2026-12-21","2026-12-22","2026-12-23","2026-12-24","2026-12-25","2026-12-26","2026-12-27","2026-12-28","2026-12-29","2026-12-30","2026-12-31","2027-01-01","2027-01-02","2027-01-03","2027-01-04","2027-01-05","2027-01-06","2027-01-07","2027-01-08","2027-01-09","2027-01-10","2027-01-11","2027-01-12","2027-01-13","2027-01-14","2027-01-15","2027-01-16","2027-01-17","2027-01-18","2027-01-19","2027-01-20","2027-01-21","2027-01-22","2027-01-23","2027-01-24","2027-01-25","2027-01-26","2027-01-27","2027-01-28","2027-01-29","2027-01-30","2027-01-31","2027-02-01","2027-02-02","2027-02-03","2027-02-04","2027-02-05","2027-02-06","2027-02-07","2027-02-08","2027-02-09","2027-02-10","2027-02-11","2027-02-12","2027-02-13","2027-02-14","2027-02-15","2027-02-16","2027-02-17","2027-02-18","2027-02-19","2027-02-20","2027-02-21","2027-02-22","2027-02-23","2027-02-24","2027-02-25","2027-02-26","2027-02-27","2027-02-28","2027-03-01","2027-03-02","2027-03-03","2027-03-04","2027-03-05","2027-03-06","2027-03-07","2027-03-08","2027-03-09","2027-03-10","2027-03-11","2027-03-12","2027-03-13","2027-03-14","2027-03-15","2027-03-16","2027-03-17","2027-03-18","2027-03-19","2027-03-20","2027-03-21","2027-03-22","2027-03-23","2027-03-24","2027-03-25","2027-03-26","2027-03-27","2027-03-28","2027-03-29","2027-03-30","2027-03-31","2027-04-01","2027-04-02","2027-04-03","2027-04-04","2027-04-05","2027-04-06","2027-04-07","2027-04-08","2027-04-09","2027-04-10","2027-04-11","2027-04-12","2027-04-13","2027-04-14","2027-04-15","2027-04-16","2027-04-17","2027-04-18","2027-04-19","2027-04-20","2027-04-21","2027-04-22","2027-04-23","2027-04-24","2027-04-25","2027-04-26","2027-04-27","2027-04-28","2027-04-29","2027-04-30","2027-05-01","2027-05-02","2027-05-03","2027-05-04","2027-05-05","2027-05-06","2027-05-07","2027-05-08","2027-05-09","2027-05-10","2027-05-11","2027-05-12","2027-05-13","2027-05-14","2027-05-15","2027-05-16","2027-05-17","2027-05-18","2027-05-19","2027-05-20","2027-05-21","2027-05-22","2027-05-23","2027-05-24","2027-05-25","2027-05-26","2027-05-27","2027-05-28","2027-05-29","2027-05-30","2027-05-31","2027-06-01","2027-06-02","2027-06-03","2027-06-04","2027-06-05","2027-06-06","2027-06-07","2027-06-08","2027-06-09","2027-06-10","2027-06-11","2027-06-12","2027-06-13","2027-06-14","2027-06-15","2027-06-16","2027-06-17","2027-06-18","2027-06-19","2027-06-20","2027-06-21","2027-06-22","2027-06-23","2027-06-24","2027-06-25","2027-06-26","2027-06-27","2027-06-28","2027-06-29","2027-06-30","2027-07-01","2027-07-02","2027-07-03","2027-07-04","2027-07-05","2027-07-06","2027-07-07","2027-07-08","2027-07-09","2027-07-10","2027-07-11","2027-07-12","2027-07-13","2027-07-14","2027-07-15","2027-07-16","2027-07-17","2027-07-18","2027-07-19","2027-07-20","2027-07-21","2027-07-22","2027-07-23","2027-07-24","2027-07-25","2027-07-26","2027-07-27","2027-07-28","2027-07-29","2027-07-30","2027-07-31","2027-08-01","2027-08-02","2027-08-03","2027-08-04","2027-08-05","2027-08-06","2027-08-07","2027-08-08","2027-08-09","2027-08-10","2027-08-11","2027-08-12","2027-08-13","2027-08-14","2027-08-15","2027-08-16","2027-08-17","2027-08-18","2027-08-19","2027-08-20","2027-08-21","2027-08-22","2027-08-23","2027-08-24","2027-08-25","2027-08-26","2027-08-27","2027-08-28","2027-08-29","2027-08-30","2027-08-31","2027-09-01","2027-09-02","2027-09-03","2027-09-04","2027-09-05","2027-09-06","2027-09-07","2027-09-08","2027-09-09","2027-09-10","2027-09-11","2027-09-12","2027-09-13","2027-09-14","2027-09-15","2027-09-16","2027-09-17","2027-09-18","2027-09-19","2027-09-20","2027-09-21","2027-09-22","2027-09-23","2027-09-24","2027-09-25","2027-09-26","2027-09-27","2027-09-28","2027-09-29","2027-09-30","2027-10-01","2027-10-02","2027-10-03","2027-10-04","2027-10-05","2027-10-06","2027-10-07","2027-10-08","2027-10-09","2027-10-10","2027-10-11","2027-10-12","2027-10-13","2027-10-14","2027-10-15","2027-10-16","2027-10-17","2027-10-18","2027-10-19","2027-10-20","2027-10-21","2027-10-22","2027-10-23","2027-10-24","2027-10-25","2027-10-26","2027-10-27","2027-10-28","2027-10-29","2027-10-30","2027-10-31","2027-11-01","2027-11-02","2027-11-03","2027-11-04","2027-11-05","2027-11-06","2027-11-07","2027-11-08","2027-11-09","2027-11-10","2027-11-11","2027-11-12","2027-11-13","2027-11-14","2027-11-15","2027-11-16","2027-11-17","2027-11-18","2027-11-19","2027-11-20","2027-11-21","2027-11-22","2027-11-23","2027-11-24","2027-11-25","2027-11-26","2027-11-27","2027-11-28","2027-11-29","2027-11-30","2027-12-01","2027-12-02","2027-12-03","2027-12-04","2027-12-05","2027-12-06","2027-12-07","2027-12-08","2027-12-09","2027-12-10","2027-12-11","2027-12-12","2027-12-13","2027-12-14","2027-12-15","2027-12-16","2027-12-17","2027-12-18","2027-12-19","2027-12-20","2027-12-21","2027-12-22","2027-12-23","2027-12-24","2027-12-25","2027-12-26","2027-12-27","2027-12-28","2027-12-29","2027-12-30","2027-12-31","2028-01-01","2028-01-02","2028-01-03","2028-01-04","2028-01-05","2028-01-06","2028-01-07","2028-01-08","2028-01-09","2028-01-10","2028-01-11","2028-01-12","2028-01-13","2028-01-14","2028-01-15","2028-01-16","2028-01-17","2028-01-18","2028-01-19","2028-01-20","2028-01-21","2028-01-22","2028-01-23","2028-01-24","2028-01-25","2028-01-26","2028-01-27","2028-01-28","2028-01-29","2028-01-30","2028-01-31","2028-02-01","2028-02-02","2028-02-03","2028-02-04","2028-02-05","2028-02-06","2028-02-07","2028-02-08","2028-02-09","2028-02-10","2028-02-11","2028-02-12","2028-02-13","2028-02-14","2028-02-15","2028-02-16","2028-02-17","2028-02-18","2028-02-19","2028-02-20","2028-02-21","2028-02-22","2028-02-23","2028-02-24","2028-02-25","2028-02-26","2028-02-27","2028-02-28","2028-02-29","2028-03-01","2028-03-02","2028-03-03","2028-03-04","2028-03-05","2028-03-06","2028-03-07","2028-03-08","2028-03-09","2028-03-10","2028-03-11","2028-03-12","2028-03-13","2028-03-14","2028-03-15","2028-03-16","2028-03-17","2028-03-18","2028-03-19","2028-03-20","2028-03-21","2028-03-22","2028-03-23","2028-03-24","2028-03-25","2028-03-26","2028-03-27","2028-03-28","2028-03-29","2028-03-30","2028-03-31","2028-04-01","2028-04-02","2028-04-03","2028-04-04","2028-04-05","2028-04-06","2028-04-07","2028-04-08","2028-04-09","2028-04-10","2028-04-11","2028-04-12","2028-04-13","2028-04-14","2028-04-15","2028-04-16","2028-04-17","2028-04-18","2028-04-19","2028-04-20","2028-04-21","2028-04-22","2028-04-23","2028-04-24","2028-04-25","2028-04-26","2028-04-27","2028-04-28","2028-04-29","2028-04-30","2028-05-01","2028-05-02","2028-05-03","2028-05-04","2028-05-05","2028-05-06","2028-05-07","2028-05-08","2028-05-09","2028-05-10","2028-05-11","2028-05-12","2028-05-13","2028-05-14","2028-05-15","2028-05-16","2028-05-17","2028-05-18","2028-05-19","2028-05-20","2028-05-21","2028-05-22","2028-05-23","2028-05-24","2028-05-25","2028-05-26","2028-05-27","2028-05-28","2028-05-29","2028-05-30","2028-05-31","2028-06-01","2028-06-02","2028-06-03","2028-06-04","2028-06-05","2028-06-06","2028-06-07","2028-06-08","2028-06-09","2028-06-10","2028-06-11","2028-06-12","2028-06-13","2028-06-14","2028-06-15","2028-06-16","2028-06-17","2028-06-18","2028-06-19","2028-06-20","2028-06-21","2028-06-22","2028-06-23","2028-06-24","2028-06-25","2028-06-26","2028-06-27","2028-06-28","2028-06-29","2028-06-30","2028-07-01","2028-07-02","2028-07-03","2028-07-04","2028-07-05","2028-07-06","2028-07-07","2028-07-08","2028-07-09","2028-07-10","2028-07-11","2028-07-12","2028-07-13","2028-07-14","2028-07-15","2028-07-16","2028-07-17","2028-07-18","2028-07-19","2028-07-20","2028-07-21","2028-07-22","2028-07-23","2028-07-24","2028-07-25","2028-07-26","2028-07-27","2028-07-28","2028-07-29","2028-07-30","2028-07-31","2028-08-01","2028-08-02","2028-08-03","2028-08-04","2028-08-05","2028-08-06","2028-08-07","2028-08-08","2028-08-09","2028-08-10","2028-08-11","2028-08-12","2028-08-13","2028-08-14","2028-08-15","2028-08-16","2028-08-17","2028-08-18","2028-08-19","2028-08-20","2028-08-21","2028-08-22","2028-08-23","2028-08-24","2028-08-25","2028-08-26","2028-08-27","2028-08-28","2028-08-29","2028-08-30","2028-08-31","2028-09-01","2028-09-02","2028-09-03","2028-09-04","2028-09-05","2028-09-06","2028-09-07","2028-09-08","2028-09-09","2028-09-10","2028-09-11","2028-09-12","2028-09-13","2028-09-14","2028-09-15","2028-09-16","2028-09-17","2028-09-18","2028-09-19","2028-09-20","2028-09-21","2028-09-22","2028-09-23","2028-09-24","2028-09-25","2028-09-26","2028-09-27","2028-09-28","2028-09-29","2028-09-30","2028-10-01","2028-10-02","2028-10-03","2028-10-04","2028-10-05","2028-10-06","2028-10-07","2028-10-08","2028-10-09","2028-10-10","2028-10-11","2028-10-12","2028-10-13","2028-10-14","2028-10-15","2028-10-16","2028-10-17","2028-10-18","2028-10-19","2028-10-20","2028-10-21","2028-10-22","2028-10-23","2028-10-24","2028-10-25","2028-10-26","2028-10-27","2028-10-28","2028-10-29","2028-10-30","2028-10-31","2028-11-01","2028-11-02","2028-11-03","2028-11-04","2028-11-05","2028-11-06","2028-11-07","2028-11-08","2028-11-09","2028-11-10","2028-11-11","2028-11-12","2028-11-13","2028-11-14","2028-11-15","2028-11-16","2028-11-17","2028-11-18","2028-11-19","2028-11-20","2028-11-21","2028-11-22","2028-11-23","2028-11-24","2028-11-25","2028-11-26","2028-11-27","2028-11-28","2028-11-29","2028-11-30","2028-12-01","2028-12-02","2028-12-03","2028-12-04","2028-12-05","2028-12-06","2028-12-07","2028-12-08","2028-12-09","2028-12-10","2028-12-11","2028-12-12","2028-12-13","2028-12-14","2028-12-15","2028-12-16","2028-12-17","2028-12-18","2028-12-19","2028-12-20","2028-12-21","2028-12-22","2028-12-23","2028-12-24","2028-12-25","2028-12-26","2028-12-27","2028-12-28","2028-12-29","2028-12-30","2028-12-31","2029-01-01","2029-01-02","2029-01-03","2029-01-04","2029-01-05","2029-01-06","2029-01-07","2029-01-08","2029-01-09","2029-01-10","2029-01-11","2029-01-12","2029-01-13","2029-01-14","2029-01-15","2029-01-16","2029-01-17","2029-01-18","2029-01-19","2029-01-20","2029-01-21","2029-01-22","2029-01-23","2029-01-24","2029-01-25","2029-01-26","2029-01-27","2029-01-28","2029-01-29","2029-01-30","2029-01-31","2029-02-01","2029-02-02","2029-02-03","2029-02-04","2029-02-05","2029-02-06","2029-02-07","2029-02-08","2029-02-09","2029-02-10","2029-02-11","2029-02-12","2029-02-13","2029-02-14","2029-02-15","2029-02-16","2029-02-17","2029-02-18","2029-02-19","2029-02-20","2029-02-21","2029-02-22","2029-02-23","2029-02-24","2029-02-25","2029-02-26","2029-02-27","2029-02-28","2029-03-01","2029-03-02","2029-03-03","2029-03-04","2029-03-05","2029-03-06","2029-03-07","2029-03-08","2029-03-09","2029-03-10","2029-03-11","2029-03-12","2029-03-13","2029-03-14","2029-03-15","2029-03-16","2029-03-17","2029-03-18","2029-03-19","2029-03-20","2029-03-21","2029-03-22","2029-03-23","2029-03-24","2029-03-25","2029-03-26","2029-03-27","2029-03-28","2029-03-29","2029-03-30","2029-03-31","2029-04-01","2029-04-02","2029-04-03","2029-04-04","2029-04-05","2029-04-06","2029-04-07","2029-04-08","2029-04-09","2029-04-10","2029-04-11","2029-04-12","2029-04-13","2029-04-14","2029-04-15","2029-04-16","2029-04-17","2029-04-18","2029-04-19","2029-04-20","2029-04-21","2029-04-22","2029-04-23","2029-04-24","2029-04-25","2029-04-26","2029-04-27","2029-04-28","2029-04-29","2029-04-30","2029-05-01","2029-05-02","2029-05-03","2029-05-04","2029-05-05","2029-05-06","2029-05-07","2029-05-08","2029-05-09","2029-05-10","2029-05-11","2029-05-12","2029-05-13","2029-05-14","2029-05-15","2029-05-16","2029-05-17","2029-05-18","2029-05-19","2029-05-20","2029-05-21","2029-05-22","2029-05-23","2029-05-24","2029-05-25","2029-05-26","2029-05-27","2029-05-28","2029-05-29","2029-05-30","2029-05-31","2029-06-01","2029-06-02","2029-06-03","2029-06-04","2029-06-05","2029-06-06","2029-06-07","2029-06-08","2029-06-09","2029-06-10","2029-06-11","2029-06-12","2029-06-13","2029-06-14","2029-06-15","2029-06-16","2029-06-17","2029-06-18","2029-06-19","2029-06-20","2029-06-21","2029-06-22","2029-06-23","2029-06-24","2029-06-25","2029-06-26","2029-06-27","2029-06-28","2029-06-29","2029-06-30","2029-07-01","2029-07-02","2029-07-03","2029-07-04","2029-07-05","2029-07-06","2029-07-07","2029-07-08","2029-07-09","2029-07-10","2029-07-11","2029-07-12","2029-07-13","2029-07-14","2029-07-15","2029-07-16","2029-07-17","2029-07-18","2029-07-19","2029-07-20","2029-07-21","2029-07-22","2029-07-23","2029-07-24","2029-07-25","2029-07-26","2029-07-27","2029-07-28","2029-07-29","2029-07-30","2029-07-31","2029-08-01","2029-08-02","2029-08-03","2029-08-04","2029-08-05","2029-08-06","2029-08-07","2029-08-08","2029-08-09","2029-08-10","2029-08-11","2029-08-12","2029-08-13","2029-08-14","2029-08-15","2029-08-16","2029-08-17","2029-08-18","2029-08-19","2029-08-20","2029-08-21","2029-08-22","2029-08-23","2029-08-24","2029-08-25","2029-08-26","2029-08-27","2029-08-28","2029-08-29","2029-08-30","2029-08-31","2029-09-01","2029-09-02","2029-09-03","2029-09-04","2029-09-05","2029-09-06","2029-09-07","2029-09-08","2029-09-09","2029-09-10","2029-09-11","2029-09-12","2029-09-13","2029-09-14","2029-09-15","2029-09-16","2029-09-17","2029-09-18","2029-09-19","2029-09-20","2029-09-21","2029-09-22","2029-09-23","2029-09-24","2029-09-25","2029-09-26","2029-09-27","2029-09-28","2029-09-29","2029-09-30","2029-10-01","2029-10-02","2029-10-03","2029-10-04","2029-10-05","2029-10-06","2029-10-07","2029-10-08","2029-10-09","2029-10-10","2029-10-11","2029-10-12","2029-10-13","2029-10-14","2029-10-15","2029-10-16","2029-10-17","2029-10-18","2029-10-19","2029-10-20","2029-10-21","2029-10-22","2029-10-23","2029-10-24","2029-10-25","2029-10-26","2029-10-27","2029-10-28","2029-10-29","2029-10-30","2029-10-31","2029-11-01","2029-11-02","2029-11-03","2029-11-04","2029-11-05","2029-11-06","2029-11-07","2029-11-08","2029-11-09","2029-11-10","2029-11-11","2029-11-12","2029-11-13","2029-11-14","2029-11-15","2029-11-16","2029-11-17","2029-11-18","2029-11-19","2029-11-20","2029-11-21","2029-11-22","2029-11-23","2029-11-24","2029-11-25","2029-11-26","2029-11-27","2029-11-28","2029-11-29","2029-11-30","2029-12-01","2029-12-02","2029-12-03","2029-12-04","2029-12-05","2029-12-06","2029-12-07","2029-12-08","2029-12-09","2029-12-10","2029-12-11","2029-12-12","2029-12-13","2029-12-14","2029-12-15","2029-12-16","2029-12-17","2029-12-18","2029-12-19","2029-12-20","2029-12-21","2029-12-22","2029-12-23","2029-12-24","2029-12-25","2029-12-26","2029-12-27","2029-12-28","2029-12-29","2029-12-30","2029-12-31","2030-01-01","2030-01-02","2030-01-03","2030-01-04","2030-01-05","2030-01-06","2030-01-07","2030-01-08","2030-01-09","2030-01-10","2030-01-11","2030-01-12","2030-01-13","2030-01-14","2030-01-15","2030-01-16","2030-01-17","2030-01-18","2030-01-19","2030-01-20","2030-01-21","2030-01-22","2030-01-23","2030-01-24","2030-01-25","2030-01-26","2030-01-27","2030-01-28","2030-01-29","2030-01-30","2030-01-31","2030-02-01","2030-02-02","2030-02-03","2030-02-04","2030-02-05","2030-02-06","2030-02-07","2030-02-08","2030-02-09","2030-02-10","2030-02-11","2030-02-12","2030-02-13","2030-02-14","2030-02-15","2030-02-16","2030-02-17","2030-02-18","2030-02-19","2030-02-20","2030-02-21","2030-02-22","2030-02-23","2030-02-24","2030-02-25","2030-02-26","2030-02-27","2030-02-28","2030-03-01","2030-03-02","2030-03-03","2030-03-04","2030-03-05","2030-03-06","2030-03-07","2030-03-08","2030-03-09","2030-03-10","2030-03-11","2030-03-12","2030-03-13","2030-03-14","2030-03-15","2030-03-16","2030-03-17","2030-03-18","2030-03-19","2030-03-20","2030-03-21","2030-03-22","2030-03-23","2030-03-24","2030-03-25","2030-03-26","2030-03-27","2030-03-28","2030-03-29","2030-03-30","2030-03-31","2030-04-01","2030-04-02","2030-04-03","2030-04-04","2030-04-05","2030-04-06","2030-04-07","2030-04-08","2030-04-09","2030-04-10","2030-04-11","2030-04-12","2030-04-13","2030-04-14","2030-04-15","2030-04-16","2030-04-17","2030-04-18","2030-04-19","2030-04-20","2030-04-21","2030-04-22","2030-04-23","2030-04-24","2030-04-25","2030-04-26","2030-04-27","2030-04-28","2030-04-29","2030-04-30","2030-05-01","2030-05-02","2030-05-03","2030-05-04","2030-05-05","2030-05-06","2030-05-07","2030-05-08","2030-05-09","2030-05-10","2030-05-11","2030-05-12","2030-05-13","2030-05-14","2030-05-15","2030-05-16","2030-05-17","2030-05-18","2030-05-19","2030-05-20","2030-05-21","2030-05-22","2030-05-23","2030-05-24","2030-05-25","2030-05-26","2030-05-27","2030-05-28","2030-05-29","2030-05-30","2030-05-31","2030-06-01","2030-06-02","2030-06-03","2030-06-04","2030-06-05","2030-06-06","2030-06-07","2030-06-08","2030-06-09","2030-06-10","2030-06-11","2030-06-12","2030-06-13","2030-06-14","2030-06-15","2030-06-16","2030-06-17","2030-06-18","2030-06-19","2030-06-20","2030-06-21","2030-06-22","2030-06-23","2030-06-24","2030-06-25","2030-06-26","2030-06-27","2030-06-28","2030-06-29","2030-06-30","2030-07-01","2030-07-02","2030-07-03","2030-07-04","2030-07-05","2030-07-06","2030-07-07","2030-07-08","2030-07-09","2030-07-10","2030-07-11","2030-07-12","2030-07-13","2030-07-14","2030-07-15","2030-07-16","2030-07-17","2030-07-18","2030-07-19","2030-07-20","2030-07-21","2030-07-22","2030-07-23","2030-07-24","2030-07-25","2030-07-26","2030-07-27","2030-07-28","2030-07-29","2030-07-30","2030-07-31","2030-08-01","2030-08-02","2030-08-03","2030-08-04","2030-08-05","2030-08-06","2030-08-07","2030-08-08","2030-08-09","2030-08-10","2030-08-11","2030-08-12","2030-08-13","2030-08-14","2030-08-15","2030-08-16","2030-08-17","2030-08-18","2030-08-19","2030-08-20","2030-08-21","2030-08-22","2030-08-23","2030-08-24","2030-08-25","2030-08-26","2030-08-27","2030-08-28","2030-08-29","2030-08-30","2030-08-31","2030-09-01","2030-09-02","2030-09-03","2030-09-04","2030-09-05","2030-09-06","2030-09-07","2030-09-08","2030-09-09","2030-09-10","2030-09-11","2030-09-12","2030-09-13","2030-09-14","2030-09-15","2030-09-16","2030-09-17","2030-09-18","2030-09-19","2030-09-20","2030-09-21","2030-09-22","2030-09-23","2030-09-24","2030-09-25","2030-09-26","2030-09-27","2030-09-28","2030-09-29","2030-09-30","2030-10-01","2030-10-02","2030-10-03","2030-10-04","2030-10-05","2030-10-06","2030-10-07","2030-10-08","2030-10-09","2030-10-10","2030-10-11","2030-10-12","2030-10-13","2030-10-14","2030-10-15","2030-10-16","2030-10-17","2030-10-18","2030-10-19","2030-10-20","2030-10-21","2030-10-22","2030-10-23","2030-10-24","2030-10-25","2030-10-26","2030-10-27","2030-10-28","2030-10-29","2030-10-30","2030-10-31","2030-11-01","2030-11-02","2030-11-03","2030-11-04","2030-11-05","2030-11-06","2030-11-07","2030-11-08","2030-11-09","2030-11-10","2030-11-11","2030-11-12","2030-11-13","2030-11-14","2030-11-15","2030-11-16","2030-11-17","2030-11-18","2030-11-19","2030-11-20","2030-11-21","2030-11-22","2030-11-23","2030-11-24","2030-11-25","2030-11-26","2030-11-27","2030-11-28","2030-11-29","2030-11-30","2030-12-01","2030-12-02","2030-12-03","2030-12-04","2030-12-05","2030-12-06","2030-12-07","2030-12-08","2030-12-09","2030-12-10","2030-12-11","2030-12-12","2030-12-13","2030-12-14","2030-12-15","2030-12-16","2030-12-17","2030-12-18","2030-12-19","2030-12-20","2030-12-21","2030-12-22","2030-12-23","2030-12-24","2030-12-25","2030-12-26","2030-12-27","2030-12-28","2030-12-29","2030-12-30","2030-12-31","2031-01-01","2031-01-02","2031-01-03","2031-01-04","2031-01-05","2031-01-06","2031-01-07","2031-01-08","2031-01-09","2031-01-10","2031-01-11","2031-01-12","2031-01-13","2031-01-14","2031-01-15","2031-01-16","2031-01-17","2031-01-18","2031-01-19","2031-01-20","2031-01-21","2031-01-22","2031-01-23","2031-01-24","2031-01-25","2031-01-26","2031-01-27","2031-01-28","2031-01-29","2031-01-30","2031-01-31","2031-02-01","2031-02-02","2031-02-03","2031-02-04","2031-02-05","2031-02-06","2031-02-07","2031-02-08","2031-02-09","2031-02-10","2031-02-11","2031-02-12","2031-02-13","2031-02-14","2031-02-15","2031-02-16","2031-02-17","2031-02-18","2031-02-19","2031-02-20","2031-02-21","2031-02-22","2031-02-23","2031-02-24","2031-02-25","2031-02-26","2031-02-27","2031-02-28","2031-03-01","2031-03-02","2031-03-03","2031-03-04","2031-03-05","2031-03-06","2031-03-07","2031-03-08","2031-03-09","2031-03-10","2031-03-11","2031-03-12","2031-03-13","2031-03-14","2031-03-15","2031-03-16","2031-03-17","2031-03-18","2031-03-19","2031-03-20","2031-03-21","2031-03-22","2031-03-23","2031-03-24","2031-03-25","2031-03-26","2031-03-27","2031-03-28","2031-03-29","2031-03-30","2031-03-31","2031-04-01","2031-04-02","2031-04-03","2031-04-04","2031-04-05","2031-04-06","2031-04-07","2031-04-08","2031-04-09","2031-04-10","2031-04-11","2031-04-12","2031-04-13","2031-04-14","2031-04-15","2031-04-16","2031-04-17","2031-04-18","2031-04-19","2031-04-20","2031-04-21","2031-04-22","2031-04-23","2031-04-24","2031-04-25","2031-04-26","2031-04-27","2031-04-28","2031-04-29","2031-04-30","2031-05-01","2031-05-02","2031-05-03","2031-05-04","2031-05-05","2031-05-06","2031-05-07","2031-05-08","2031-05-09","2031-05-10","2031-05-11","2031-05-12","2031-05-13","2031-05-14","2031-05-15","2031-05-16","2031-05-17","2031-05-18","2031-05-19","2031-05-20","2031-05-21","2031-05-22","2031-05-23","2031-05-24","2031-05-25","2031-05-26","2031-05-27","2031-05-28","2031-05-29","2031-05-30","2031-05-31","2031-06-01","2031-06-02","2031-06-03","2031-06-04","2031-06-05","2031-06-06","2031-06-07","2031-06-08","2031-06-09","2031-06-10","2031-06-11","2031-06-12","2031-06-13","2031-06-14","2031-06-15","2031-06-16","2031-06-17","2031-06-18","2031-06-19","2031-06-20","2031-06-21","2031-06-22","2031-06-23","2031-06-24","2031-06-25","2031-06-26","2031-06-27","2031-06-28","2031-06-29","2031-06-30","2031-07-01","2031-07-02","2031-07-03","2031-07-04","2031-07-05","2031-07-06","2031-07-07","2031-07-08","2031-07-09","2031-07-10","2031-07-11","2031-07-12","2031-07-13","2031-07-14","2031-07-15","2031-07-16","2031-07-17","2031-07-18","2031-07-19","2031-07-20","2031-07-21","2031-07-22","2031-07-23","2031-07-24","2031-07-25","2031-07-26","2031-07-27","2031-07-28","2031-07-29","2031-07-30","2031-07-31","2031-08-01","2031-08-02","2031-08-03","2031-08-04","2031-08-05","2031-08-06","2031-08-07","2031-08-08","2031-08-09","2031-08-10","2031-08-11","2031-08-12","2031-08-13","2031-08-14","2031-08-15","2031-08-16","2031-08-17","2031-08-18","2031-08-19","2031-08-20","2031-08-21","2031-08-22","2031-08-23","2031-08-24","2031-08-25","2031-08-26","2031-08-27","2031-08-28","2031-08-29","2031-08-30","2031-08-31","2031-09-01","2031-09-02","2031-09-03","2031-09-04","2031-09-05","2031-09-06","2031-09-07","2031-09-08","2031-09-09","2031-09-10","2031-09-11","2031-09-12","2031-09-13","2031-09-14","2031-09-15","2031-09-16","2031-09-17","2031-09-18","2031-09-19","2031-09-20","2031-09-21","2031-09-22","2031-09-23","2031-09-24","2031-09-25","2031-09-26","2031-09-27","2031-09-28","2031-09-29","2031-09-30","2031-10-01","2031-10-02","2031-10-03","2031-10-04","2031-10-05","2031-10-06","2031-10-07","2031-10-08","2031-10-09","2031-10-10","2031-10-11","2031-10-12","2031-10-13","2031-10-14","2031-10-15","2031-10-16","2031-10-17","2031-10-18","2031-10-19","2031-10-20","2031-10-21","2031-10-22","2031-10-23","2031-10-24","2031-10-25","2031-10-26","2031-10-27","2031-10-28","2031-10-29","2031-10-30","2031-10-31","2031-11-01","2031-11-02","2031-11-03","2031-11-04","2031-11-05","2031-11-06","2031-11-07","2031-11-08","2031-11-09","2031-11-10","2031-11-11","2031-11-12","2031-11-13","2031-11-14","2031-11-15","2031-11-16","2031-11-17","2031-11-18","2031-11-19","2031-11-20","2031-11-21","2031-11-22","2031-11-23","2031-11-24","2031-11-25","2031-11-26","2031-11-27","2031-11-28","2031-11-29","2031-11-30","2031-12-01","2031-12-02","2031-12-03","2031-12-04","2031-12-05","2031-12-06","2031-12-07","2031-12-08","2031-12-09","2031-12-10","2031-12-11","2031-12-12","2031-12-13","2031-12-14","2031-12-15","2031-12-16","2031-12-17","2031-12-18","2031-12-19","2031-12-20","2031-12-21","2031-12-22","2031-12-23","2031-12-24","2031-12-25","2031-12-26","2031-12-27","2031-12-28","2031-12-29","2031-12-30","2031-12-31","2032-01-01","2032-01-02","2032-01-03","2032-01-04","2032-01-05","2032-01-06","2032-01-07","2032-01-08","2032-01-09","2032-01-10","2032-01-11","2032-01-12","2032-01-13","2032-01-14","2032-01-15","2032-01-16","2032-01-17","2032-01-18","2032-01-19","2032-01-20","2032-01-21","2032-01-22","2032-01-23","2032-01-24","2032-01-25","2032-01-26","2032-01-27","2032-01-28","2032-01-29","2032-01-30","2032-01-31","2032-02-01","2032-02-02","2032-02-03","2032-02-04","2032-02-05","2032-02-06","2032-02-07","2032-02-08","2032-02-09","2032-02-10","2032-02-11","2032-02-12","2032-02-13","2032-02-14","2032-02-15","2032-02-16","2032-02-17","2032-02-18","2032-02-19","2032-02-20","2032-02-21","2032-02-22","2032-02-23","2032-02-24","2032-02-25","2032-02-26","2032-02-27","2032-02-28","2032-02-29","2032-03-01","2032-03-02","2032-03-03","2032-03-04","2032-03-05","2032-03-06","2032-03-07","2032-03-08","2032-03-09","2032-03-10","2032-03-11","2032-03-12","2032-03-13","2032-03-14","2032-03-15","2032-03-16","2032-03-17","2032-03-18","2032-03-19","2032-03-20","2032-03-21","2032-03-22","2032-03-23","2032-03-24","2032-03-25","2032-03-26","2032-03-27","2032-03-28","2032-03-29","2032-03-30","2032-03-31","2032-04-01","2032-04-02","2032-04-03","2032-04-04","2032-04-05","2032-04-06","2032-04-07","2032-04-08","2032-04-09","2032-04-10","2032-04-11","2032-04-12","2032-04-13","2032-04-14","2032-04-15","2032-04-16","2032-04-17","2032-04-18","2032-04-19","2032-04-20","2032-04-21","2032-04-22","2032-04-23","2032-04-24","2032-04-25","2032-04-26","2032-04-27","2032-04-28","2032-04-29","2032-04-30","2032-05-01","2032-05-02","2032-05-03","2032-05-04","2032-05-05","2032-05-06","2032-05-07","2032-05-08","2032-05-09","2032-05-10","2032-05-11","2032-05-12","2032-05-13","2032-05-14","2032-05-15","2032-05-16","2032-05-17","2032-05-18","2032-05-19","2032-05-20","2032-05-21","2032-05-22","2032-05-23","2032-05-24","2032-05-25","2032-05-26","2032-05-27","2032-05-28","2032-05-29","2032-05-30","2032-05-31","2032-06-01","2032-06-02","2032-06-03","2032-06-04","2032-06-05","2032-06-06","2032-06-07","2032-06-08","2032-06-09","2032-06-10","2032-06-11","2032-06-12","2032-06-13","2032-06-14","2032-06-15","2032-06-16","2032-06-17","2032-06-18","2032-06-19","2032-06-20","2032-06-21","2032-06-22","2032-06-23","2032-06-24","2032-06-25","2032-06-26","2032-06-27","2032-06-28","2032-06-29","2032-06-30","2032-07-01","2032-07-02","2032-07-03","2032-07-04","2032-07-05","2032-07-06","2032-07-07","2032-07-08","2032-07-09","2032-07-10","2032-07-11","2032-07-12","2032-07-13","2032-07-14","2032-07-15","2032-07-16","2032-07-17","2032-07-18","2032-07-19","2032-07-20","2032-07-21","2032-07-22","2032-07-23","2032-07-24","2032-07-25","2032-07-26","2032-07-27","2032-07-28","2032-07-29","2032-07-30","2032-07-31","2032-08-01","2032-08-02","2032-08-03","2032-08-04","2032-08-05","2032-08-06","2032-08-07","2032-08-08","2032-08-09","2032-08-10","2032-08-11","2032-08-12","2032-08-13","2032-08-14","2032-08-15","2032-08-16","2032-08-17","2032-08-18","2032-08-19","2032-08-20","2032-08-21","2032-08-22","2032-08-23","2032-08-24","2032-08-25","2032-08-26","2032-08-27","2032-08-28","2032-08-29","2032-08-30","2032-08-31","2032-09-01","2032-09-02","2032-09-03","2032-09-04","2032-09-05","2032-09-06","2032-09-07","2032-09-08","2032-09-09","2032-09-10","2032-09-11","2032-09-12","2032-09-13","2032-09-14","2032-09-15","2032-09-16","2032-09-17","2032-09-18","2032-09-19","2032-09-20","2032-09-21","2032-09-22","2032-09-23","2032-09-24","2032-09-25","2032-09-26","2032-09-27","2032-09-28","2032-09-29","2032-09-30","2032-10-01","2032-10-02","2032-10-03","2032-10-04","2032-10-05","2032-10-06","2032-10-07","2032-10-08","2032-10-09","2032-10-10","2032-10-11","2032-10-12","2032-10-13","2032-10-14","2032-10-15","2032-10-16","2032-10-17","2032-10-18","2032-10-19","2032-10-20","2032-10-21","2032-10-22","2032-10-23","2032-10-24","2032-10-25","2032-10-26","2032-10-27","2032-10-28","2032-10-29","2032-10-30","2032-10-31","2032-11-01","2032-11-02","2032-11-03","2032-11-04","2032-11-05","2032-11-06","2032-11-07","2032-11-08","2032-11-09","2032-11-10","2032-11-11","2032-11-12","2032-11-13","2032-11-14","2032-11-15","2032-11-16","2032-11-17","2032-11-18","2032-11-19","2032-11-20","2032-11-21","2032-11-22","2032-11-23","2032-11-24","2032-11-25","2032-11-26","2032-11-27","2032-11-28","2032-11-29","2032-11-30","2032-12-01","2032-12-02","2032-12-03","2032-12-04","2032-12-05","2032-12-06","2032-12-07","2032-12-08","2032-12-09","2032-12-10","2032-12-11","2032-12-12","2032-12-13","2032-12-14","2032-12-15","2032-12-16","2032-12-17","2032-12-18","2032-12-19","2032-12-20","2032-12-21","2032-12-22","2032-12-23","2032-12-24","2032-12-25","2032-12-26","2032-12-27","2032-12-28","2032-12-29","2032-12-30","2032-12-31","2033-01-01","2033-01-02","2033-01-03","2033-01-04","2033-01-05","2033-01-06","2033-01-07","2033-01-08","2033-01-09","2033-01-10","2033-01-11","2033-01-12","2033-01-13","2033-01-14","2033-01-15","2033-01-16","2033-01-17","2033-01-18","2033-01-19","2033-01-20","2033-01-21","2033-01-22","2033-01-23","2033-01-24","2033-01-25","2033-01-26","2033-01-27","2033-01-28","2033-01-29","2033-01-30","2033-01-31","2033-02-01","2033-02-02","2033-02-03","2033-02-04","2033-02-05","2033-02-06","2033-02-07","2033-02-08","2033-02-09","2033-02-10","2033-02-11","2033-02-12","2033-02-13","2033-02-14","2033-02-15","2033-02-16","2033-02-17","2033-02-18","2033-02-19","2033-02-20","2033-02-21","2033-02-22","2033-02-23","2033-02-24","2033-02-25","2033-02-26","2033-02-27","2033-02-28","2033-03-01","2033-03-02","2033-03-03","2033-03-04","2033-03-05","2033-03-06","2033-03-07","2033-03-08","2033-03-09","2033-03-10","2033-03-11","2033-03-12","2033-03-13","2033-03-14","2033-03-15","2033-03-16","2033-03-17","2033-03-18","2033-03-19","2033-03-20","2033-03-21","2033-03-22","2033-03-23","2033-03-24","2033-03-25","2033-03-26","2033-03-27","2033-03-28","2033-03-29","2033-03-30","2033-03-31","2033-04-01","2033-04-02","2033-04-03","2033-04-04","2033-04-05","2033-04-06","2033-04-07","2033-04-08","2033-04-09","2033-04-10","2033-04-11","2033-04-12","2033-04-13","2033-04-14","2033-04-15","2033-04-16","2033-04-17","2033-04-18","2033-04-19","2033-04-20","2033-04-21","2033-04-22","2033-04-23","2033-04-24","2033-04-25","2033-04-26","2033-04-27","2033-04-28","2033-04-29","2033-04-30","2033-05-01","2033-05-02","2033-05-03","2033-05-04","2033-05-05","2033-05-06","2033-05-07","2033-05-08","2033-05-09","2033-05-10","2033-05-11","2033-05-12","2033-05-13","2033-05-14","2033-05-15","2033-05-16","2033-05-17","2033-05-18","2033-05-19","2033-05-20","2033-05-21","2033-05-22","2033-05-23","2033-05-24","2033-05-25","2033-05-26","2033-05-27","2033-05-28","2033-05-29","2033-05-30","2033-05-31","2033-06-01","2033-06-02","2033-06-03","2033-06-04","2033-06-05","2033-06-06","2033-06-07","2033-06-08","2033-06-09","2033-06-10","2033-06-11","2033-06-12","2033-06-13","2033-06-14","2033-06-15","2033-06-16","2033-06-17","2033-06-18","2033-06-19","2033-06-20","2033-06-21","2033-06-22","2033-06-23","2033-06-24","2033-06-25","2033-06-26","2033-06-27","2033-06-28","2033-06-29","2033-06-30","2033-07-01","2033-07-02","2033-07-03","2033-07-04","2033-07-05","2033-07-06","2033-07-07","2033-07-08","2033-07-09","2033-07-10","2033-07-11","2033-07-12","2033-07-13","2033-07-14","2033-07-15","2033-07-16","2033-07-17","2033-07-18","2033-07-19","2033-07-20","2033-07-21","2033-07-22","2033-07-23","2033-07-24","2033-07-25","2033-07-26","2033-07-27","2033-07-28","2033-07-29","2033-07-30","2033-07-31","2033-08-01","2033-08-02","2033-08-03","2033-08-04","2033-08-05","2033-08-06","2033-08-07","2033-08-08","2033-08-09","2033-08-10","2033-08-11","2033-08-12","2033-08-13","2033-08-14","2033-08-15","2033-08-16","2033-08-17","2033-08-18","2033-08-19","2033-08-20","2033-08-21","2033-08-22","2033-08-23","2033-08-24","2033-08-25","2033-08-26","2033-08-27","2033-08-28","2033-08-29","2033-08-30","2033-08-31","2033-09-01","2033-09-02","2033-09-03","2033-09-04","2033-09-05","2033-09-06","2033-09-07","2033-09-08","2033-09-09","2033-09-10","2033-09-11","2033-09-12","2033-09-13","2033-09-14","2033-09-15","2033-09-16","2033-09-17","2033-09-18","2033-09-19","2033-09-20","2033-09-21","2033-09-22","2033-09-23","2033-09-24","2033-09-25","2033-09-26","2033-09-27","2033-09-28","2033-09-29","2033-09-30","2033-10-01","2033-10-02","2033-10-03","2033-10-04","2033-10-05","2033-10-06","2033-10-07","2033-10-08","2033-10-09","2033-10-10","2033-10-11","2033-10-12","2033-10-13","2033-10-14","2033-10-15","2033-10-16","2033-10-17","2033-10-18","2033-10-19","2033-10-20","2033-10-21","2033-10-22","2033-10-23","2033-10-24","2033-10-25","2033-10-26","2033-10-27","2033-10-28","2033-10-29","2033-10-30","2033-10-31","2033-11-01","2033-11-02","2033-11-03","2033-11-04","2033-11-05","2033-11-06","2033-11-07","2033-11-08","2033-11-09","2033-11-10","2033-11-11","2033-11-12","2033-11-13","2033-11-14","2033-11-15","2033-11-16","2033-11-17","2033-11-18","2033-11-19","2033-11-20","2033-11-21","2033-11-22","2033-11-23","2033-11-24","2033-11-25","2033-11-26","2033-11-27","2033-11-28","2033-11-29","2033-11-30","2033-12-01","2033-12-02","2033-12-03","2033-12-04","2033-12-05","2033-12-06","2033-12-07","2033-12-08","2033-12-09","2033-12-10","2033-12-11","2033-12-12","2033-12-13","2033-12-14","2033-12-15","2033-12-16","2033-12-17","2033-12-18","2033-12-19","2033-12-20","2033-12-21","2033-12-22","2033-12-23","2033-12-24","2033-12-25","2033-12-26","2033-12-27","2033-12-28","2033-12-29","2033-12-30","2033-12-31","2034-01-01","2034-01-02","2034-01-03","2034-01-04","2034-01-05","2034-01-06","2034-01-07","2034-01-08","2034-01-09","2034-01-10","2034-01-11","2034-01-12","2034-01-13","2034-01-14","2034-01-15","2034-01-16","2034-01-17","2034-01-18","2034-01-19","2034-01-20","2034-01-21","2034-01-22","2034-01-23","2034-01-24","2034-01-25","2034-01-26","2034-01-27","2034-01-28","2034-01-29","2034-01-30","2034-01-31","2034-02-01","2034-02-02","2034-02-03","2034-02-04","2034-02-05","2034-02-06","2034-02-07","2034-02-08","2034-02-09","2034-02-10","2034-02-11","2034-02-12","2034-02-13","2034-02-14","2034-02-15","2034-02-16","2034-02-17","2034-02-18","2034-02-19","2034-02-20","2034-02-21","2034-02-22","2034-02-23","2034-02-24","2034-02-25","2034-02-26","2034-02-27","2034-02-28","2034-03-01","2034-03-02","2034-03-03","2034-03-04","2034-03-05","2034-03-06","2034-03-07","2034-03-08","2034-03-09","2034-03-10","2034-03-11","2034-03-12","2034-03-13","2034-03-14","2034-03-15","2034-03-16","2034-03-17","2034-03-18","2034-03-19","2034-03-20","2034-03-21","2034-03-22","2034-03-23","2034-03-24","2034-03-25","2034-03-26","2034-03-27","2034-03-28","2034-03-29","2034-03-30","2034-03-31","2034-04-01","2034-04-02","2034-04-03","2034-04-04","2034-04-05","2034-04-06","2034-04-07","2034-04-08","2034-04-09","2034-04-10","2034-04-11","2034-04-12","2034-04-13","2034-04-14","2034-04-15","2034-04-16","2034-04-17","2034-04-18","2034-04-19","2034-04-20","2034-04-21","2034-04-22","2034-04-23","2034-04-24","2034-04-25","2034-04-26","2034-04-27","2034-04-28","2034-04-29","2034-04-30","2034-05-01","2034-05-02","2034-05-03","2034-05-04","2034-05-05","2034-05-06","2034-05-07","2034-05-08","2034-05-09","2034-05-10","2034-05-11","2034-05-12","2034-05-13","2034-05-14","2034-05-15","2034-05-16","2034-05-17","2034-05-18","2034-05-19","2034-05-20","2034-05-21","2034-05-22","2034-05-23","2034-05-24","2034-05-25","2034-05-26","2034-05-27","2034-05-28","2034-05-29","2034-05-30","2034-05-31","2034-06-01","2034-06-02","2034-06-03","2034-06-04","2034-06-05","2034-06-06","2034-06-07","2034-06-08","2034-06-09","2034-06-10","2034-06-11","2034-06-12","2034-06-13","2034-06-14","2034-06-15","2034-06-16","2034-06-17","2034-06-18","2034-06-19","2034-06-20","2034-06-21","2034-06-22","2034-06-23","2034-06-24","2034-06-25","2034-06-26","2034-06-27","2034-06-28","2034-06-29","2034-06-30","2034-07-01","2034-07-02","2034-07-03","2034-07-04","2034-07-05","2034-07-06","2034-07-07","2034-07-08","2034-07-09","2034-07-10","2034-07-11","2034-07-12","2034-07-13","2034-07-14","2034-07-15","2034-07-16","2034-07-17","2034-07-18","2034-07-19","2034-07-20","2034-07-21","2034-07-22","2034-07-23","2034-07-24","2034-07-25","2034-07-26","2034-07-27","2034-07-28","2034-07-29","2034-07-30","2034-07-31","2034-08-01","2034-08-02","2034-08-03","2034-08-04","2034-08-05","2034-08-06","2034-08-07","2034-08-08","2034-08-09","2034-08-10","2034-08-11","2034-08-12","2034-08-13","2034-08-14","2034-08-15","2034-08-16","2034-08-17","2034-08-18","2034-08-19","2034-08-20","2034-08-21","2034-08-22","2034-08-23","2034-08-24","2034-08-25","2034-08-26","2034-08-27","2034-08-28","2034-08-29","2034-08-30","2034-08-31","2034-09-01","2034-09-02","2034-09-03","2034-09-04","2034-09-05","2034-09-06","2034-09-07","2034-09-08","2034-09-09","2034-09-10","2034-09-11","2034-09-12","2034-09-13","2034-09-14","2034-09-15","2034-09-16","2034-09-17","2034-09-18","2034-09-19","2034-09-20","2034-09-21","2034-09-22","2034-09-23","2034-09-24","2034-09-25","2034-09-26","2034-09-27","2034-09-28","2034-09-29","2034-09-30","2034-10-01","2034-10-02","2034-10-03","2034-10-04","2034-10-05","2034-10-06","2034-10-07","2034-10-08","2034-10-09","2034-10-10","2034-10-11","2034-10-12","2034-10-13","2034-10-14","2034-10-15","2034-10-16","2034-10-17","2034-10-18","2034-10-19","2034-10-20","2034-10-21","2034-10-22","2034-10-23","2034-10-24","2034-10-25","2034-10-26","2034-10-27","2034-10-28","2034-10-29","2034-10-30","2034-10-31","2034-11-01","2034-11-02","2034-11-03","2034-11-04","2034-11-05","2034-11-06","2034-11-07","2034-11-08","2034-11-09","2034-11-10","2034-11-11","2034-11-12","2034-11-13","2034-11-14","2034-11-15","2034-11-16","2034-11-17","2034-11-18","2034-11-19","2034-11-20","2034-11-21","2034-11-22","2034-11-23","2034-11-24","2034-11-25","2034-11-26","2034-11-27","2034-11-28","2034-11-29","2034-11-30","2034-12-01","2034-12-02","2034-12-03","2034-12-04","2034-12-05","2034-12-06","2034-12-07","2034-12-08","2034-12-09","2034-12-10","2034-12-11","2034-12-12","2034-12-13","2034-12-14","2034-12-15","2034-12-16","2034-12-17","2034-12-18","2034-12-19","2034-12-20","2034-12-21","2034-12-22","2034-12-23","2034-12-24","2034-12-25","2034-12-26","2034-12-27","2034-12-28","2034-12-29","2034-12-30","2034-12-31","2035-01-01","2035-01-02","2035-01-03","2035-01-04","2035-01-05","2035-01-06","2035-01-07","2035-01-08","2035-01-09","2035-01-10","2035-01-11","2035-01-12","2035-01-13","2035-01-14","2035-01-15","2035-01-16","2035-01-17","2035-01-18","2035-01-19","2035-01-20","2035-01-21","2035-01-22","2035-01-23","2035-01-24","2035-01-25","2035-01-26","2035-01-27","2035-01-28","2035-01-29","2035-01-30","2035-01-31","2035-02-01","2035-02-02","2035-02-03","2035-02-04","2035-02-05","2035-02-06","2035-02-07","2035-02-08","2035-02-09","2035-02-10","2035-02-11","2035-02-12","2035-02-13","2035-02-14","2035-02-15","2035-02-16","2035-02-17","2035-02-18","2035-02-19","2035-02-20","2035-02-21","2035-02-22","2035-02-23","2035-02-24","2035-02-25","2035-02-26","2035-02-27","2035-02-28","2035-03-01","2035-03-02","2035-03-03","2035-03-04","2035-03-05","2035-03-06","2035-03-07","2035-03-08","2035-03-09","2035-03-10","2035-03-11","2035-03-12","2035-03-13","2035-03-14","2035-03-15","2035-03-16","2035-03-17","2035-03-18","2035-03-19","2035-03-20","2035-03-21","2035-03-22","2035-03-23","2035-03-24","2035-03-25","2035-03-26","2035-03-27","2035-03-28","2035-03-29","2035-03-30","2035-03-31","2035-04-01","2035-04-02","2035-04-03","2035-04-04","2035-04-05","2035-04-06","2035-04-07","2035-04-08","2035-04-09","2035-04-10","2035-04-11","2035-04-12","2035-04-13","2035-04-14","2035-04-15","2035-04-16","2035-04-17","2035-04-18","2035-04-19","2035-04-20","2035-04-21","2035-04-22","2035-04-23","2035-04-24","2035-04-25","2035-04-26","2035-04-27","2035-04-28","2035-04-29","2035-04-30","2035-05-01","2035-05-02","2035-05-03","2035-05-04","2035-05-05","2035-05-06","2035-05-07","2035-05-08","2035-05-09","2035-05-10","2035-05-11","2035-05-12","2035-05-13","2035-05-14","2035-05-15","2035-05-16","2035-05-17","2035-05-18","2035-05-19","2035-05-20","2035-05-21","2035-05-22","2035-05-23","2035-05-24","2035-05-25","2035-05-26","2035-05-27","2035-05-28","2035-05-29","2035-05-30","2035-05-31","2035-06-01","2035-06-02","2035-06-03","2035-06-04","2035-06-05","2035-06-06","2035-06-07","2035-06-08","2035-06-09","2035-06-10","2035-06-11","2035-06-12","2035-06-13","2035-06-14","2035-06-15","2035-06-16","2035-06-17","2035-06-18","2035-06-19","2035-06-20","2035-06-21","2035-06-22","2035-06-23","2035-06-24","2035-06-25","2035-06-26","2035-06-27","2035-06-28","2035-06-29","2035-06-30","2035-07-01","2035-07-02","2035-07-03","2035-07-04","2035-07-05","2035-07-06","2035-07-07","2035-07-08","2035-07-09","2035-07-10","2035-07-11","2035-07-12","2035-07-13","2035-07-14","2035-07-15","2035-07-16","2035-07-17","2035-07-18","2035-07-19","2035-07-20","2035-07-21","2035-07-22","2035-07-23","2035-07-24","2035-07-25","2035-07-26","2035-07-27","2035-07-28","2035-07-29","2035-07-30","2035-07-31","2035-08-01","2035-08-02","2035-08-03","2035-08-04","2035-08-05","2035-08-06","2035-08-07","2035-08-08","2035-08-09","2035-08-10","2035-08-11","2035-08-12","2035-08-13","2035-08-14","2035-08-15","2035-08-16","2035-08-17","2035-08-18","2035-08-19","2035-08-20","2035-08-21","2035-08-22","2035-08-23","2035-08-24","2035-08-25","2035-08-26","2035-08-27","2035-08-28","2035-08-29","2035-08-30","2035-08-31","2035-09-01","2035-09-02","2035-09-03","2035-09-04","2035-09-05","2035-09-06","2035-09-07","2035-09-08","2035-09-09","2035-09-10","2035-09-11","2035-09-12","2035-09-13","2035-09-14","2035-09-15","2035-09-16","2035-09-17","2035-09-18","2035-09-19","2035-09-20","2035-09-21","2035-09-22","2035-09-23","2035-09-24","2035-09-25","2035-09-26","2035-09-27","2035-09-28","2035-09-29","2035-09-30","2035-10-01","2035-10-02","2035-10-03","2035-10-04","2035-10-05","2035-10-06","2035-10-07","2035-10-08","2035-10-09","2035-10-10","2035-10-11","2035-10-12","2035-10-13","2035-10-14","2035-10-15","2035-10-16","2035-10-17","2035-10-18","2035-10-19","2035-10-20","2035-10-21","2035-10-22","2035-10-23","2035-10-24","2035-10-25","2035-10-26","2035-10-27","2035-10-28","2035-10-29","2035-10-30","2035-10-31","2035-11-01","2035-11-02","2035-11-03","2035-11-04","2035-11-05","2035-11-06","2035-11-07","2035-11-08","2035-11-09","2035-11-10","2035-11-11","2035-11-12","2035-11-13","2035-11-14","2035-11-15","2035-11-16","2035-11-17","2035-11-18","2035-11-19","2035-11-20","2035-11-21","2035-11-22","2035-11-23","2035-11-24","2035-11-25","2035-11-26","2035-11-27","2035-11-28","2035-11-29","2035-11-30","2035-12-01","2035-12-02","2035-12-03","2035-12-04","2035-12-05","2035-12-06","2035-12-07","2035-12-08","2035-12-09","2035-12-10","2035-12-11","2035-12-12","2035-12-13","2035-12-14","2035-12-15","2035-12-16","2035-12-17","2035-12-18","2035-12-19","2035-12-20","2035-12-21","2035-12-22","2035-12-23","2035-12-24","2035-12-25","2035-12-26","2035-12-27","2035-12-28","2035-12-29","2035-12-30","2035-12-31","2036-01-01","2036-01-02","2036-01-03","2036-01-04","2036-01-05","2036-01-06","2036-01-07","2036-01-08","2036-01-09","2036-01-10","2036-01-11","2036-01-12","2036-01-13","2036-01-14","2036-01-15","2036-01-16","2036-01-17","2036-01-18","2036-01-19","2036-01-20","2036-01-21","2036-01-22","2036-01-23","2036-01-24","2036-01-25","2036-01-26","2036-01-27","2036-01-28","2036-01-29","2036-01-30","2036-01-31","2036-02-01","2036-02-02","2036-02-03","2036-02-04","2036-02-05","2036-02-06","2036-02-07","2036-02-08","2036-02-09","2036-02-10","2036-02-11","2036-02-12","2036-02-13","2036-02-14","2036-02-15","2036-02-16","2036-02-17","2036-02-18","2036-02-19","2036-02-20","2036-02-21","2036-02-22","2036-02-23","2036-02-24","2036-02-25","2036-02-26","2036-02-27","2036-02-28","2036-02-29","2036-03-01","2036-03-02","2036-03-03","2036-03-04","2036-03-05","2036-03-06","2036-03-07","2036-03-08","2036-03-09","2036-03-10","2036-03-11","2036-03-12","2036-03-13","2036-03-14","2036-03-15","2036-03-16","2036-03-17","2036-03-18","2036-03-19","2036-03-20","2036-03-21","2036-03-22","2036-03-23","2036-03-24","2036-03-25","2036-03-26","2036-03-27","2036-03-28","2036-03-29","2036-03-30","2036-03-31","2036-04-01","2036-04-02","2036-04-03","2036-04-04","2036-04-05","2036-04-06","2036-04-07","2036-04-08","2036-04-09","2036-04-10","2036-04-11","2036-04-12","2036-04-13","2036-04-14","2036-04-15","2036-04-16","2036-04-17","2036-04-18","2036-04-19","2036-04-20","2036-04-21","2036-04-22","2036-04-23","2036-04-24","2036-04-25","2036-04-26","2036-04-27","2036-04-28","2036-04-29","2036-04-30","2036-05-01","2036-05-02","2036-05-03","2036-05-04","2036-05-05","2036-05-06","2036-05-07","2036-05-08","2036-05-09","2036-05-10","2036-05-11","2036-05-12","2036-05-13","2036-05-14","2036-05-15","2036-05-16","2036-05-17","2036-05-18","2036-05-19","2036-05-20","2036-05-21","2036-05-22","2036-05-23","2036-05-24","2036-05-25","2036-05-26","2036-05-27","2036-05-28","2036-05-29","2036-05-30","2036-05-31","2036-06-01","2036-06-02","2036-06-03","2036-06-04","2036-06-05","2036-06-06","2036-06-07","2036-06-08","2036-06-09","2036-06-10","2036-06-11","2036-06-12","2036-06-13","2036-06-14","2036-06-15","2036-06-16","2036-06-17","2036-06-18","2036-06-19","2036-06-20","2036-06-21","2036-06-22","2036-06-23","2036-06-24","2036-06-25","2036-06-26","2036-06-27","2036-06-28","2036-06-29","2036-06-30","2036-07-01","2036-07-02","2036-07-03","2036-07-04","2036-07-05","2036-07-06","2036-07-07","2036-07-08","2036-07-09","2036-07-10","2036-07-11","2036-07-12","2036-07-13","2036-07-14","2036-07-15","2036-07-16","2036-07-17","2036-07-18","2036-07-19","2036-07-20","2036-07-21","2036-07-22","2036-07-23","2036-07-24","2036-07-25","2036-07-26","2036-07-27","2036-07-28","2036-07-29","2036-07-30","2036-07-31","2036-08-01","2036-08-02","2036-08-03","2036-08-04","2036-08-05","2036-08-06","2036-08-07","2036-08-08","2036-08-09","2036-08-10","2036-08-11","2036-08-12","2036-08-13","2036-08-14","2036-08-15","2036-08-16","2036-08-17","2036-08-18","2036-08-19","2036-08-20","2036-08-21","2036-08-22","2036-08-23","2036-08-24","2036-08-25","2036-08-26","2036-08-27","2036-08-28","2036-08-29","2036-08-30","2036-08-31","2036-09-01","2036-09-02","2036-09-03","2036-09-04","2036-09-05","2036-09-06","2036-09-07","2036-09-08","2036-09-09","2036-09-10","2036-09-11","2036-09-12","2036-09-13","2036-09-14","2036-09-15","2036-09-16","2036-09-17","2036-09-18","2036-09-19","2036-09-20","2036-09-21","2036-09-22","2036-09-23","2036-09-24","2036-09-25","2036-09-26","2036-09-27","2036-09-28","2036-09-29","2036-09-30","2036-10-01","2036-10-02","2036-10-03","2036-10-04","2036-10-05","2036-10-06","2036-10-07","2036-10-08","2036-10-09","2036-10-10","2036-10-11","2036-10-12","2036-10-13","2036-10-14","2036-10-15","2036-10-16","2036-10-17","2036-10-18","2036-10-19","2036-10-20","2036-10-21","2036-10-22","2036-10-23","2036-10-24","2036-10-25","2036-10-26","2036-10-27","2036-10-28","2036-10-29","2036-10-30","2036-10-31","2036-11-01","2036-11-02","2036-11-03","2036-11-04","2036-11-05","2036-11-06","2036-11-07","2036-11-08","2036-11-09","2036-11-10","2036-11-11","2036-11-12","2036-11-13","2036-11-14","2036-11-15","2036-11-16","2036-11-17","2036-11-18","2036-11-19","2036-11-20","2036-11-21","2036-11-22","2036-11-23","2036-11-24","2036-11-25","2036-11-26","2036-11-27","2036-11-28","2036-11-29","2036-11-30","2036-12-01","2036-12-02","2036-12-03","2036-12-04","2036-12-05","2036-12-06","2036-12-07","2036-12-08","2036-12-09","2036-12-10","2036-12-11","2036-12-12","2036-12-13","2036-12-14","2036-12-15","2036-12-16","2036-12-17","2036-12-18","2036-12-19","2036-12-20","2036-12-21","2036-12-22","2036-12-23","2036-12-24","2036-12-25","2036-12-26","2036-12-27","2036-12-28","2036-12-29","2036-12-30","2036-12-31","2037-01-01","2037-01-02","2037-01-03","2037-01-04","2037-01-05","2037-01-06","2037-01-07","2037-01-08","2037-01-09","2037-01-10","2037-01-11","2037-01-12","2037-01-13","2037-01-14","2037-01-15","2037-01-16","2037-01-17","2037-01-18","2037-01-19","2037-01-20","2037-01-21","2037-01-22","2037-01-23","2037-01-24","2037-01-25","2037-01-26","2037-01-27","2037-01-28","2037-01-29","2037-01-30","2037-01-31","2037-02-01","2037-02-02","2037-02-03","2037-02-04","2037-02-05","2037-02-06","2037-02-07","2037-02-08","2037-02-09","2037-02-10","2037-02-11","2037-02-12","2037-02-13","2037-02-14","2037-02-15","2037-02-16","2037-02-17","2037-02-18","2037-02-19","2037-02-20","2037-02-21","2037-02-22","2037-02-23","2037-02-24","2037-02-25","2037-02-26","2037-02-27","2037-02-28","2037-03-01","2037-03-02","2037-03-03","2037-03-04","2037-03-05","2037-03-06","2037-03-07","2037-03-08","2037-03-09","2037-03-10","2037-03-11","2037-03-12","2037-03-13","2037-03-14","2037-03-15","2037-03-16","2037-03-17","2037-03-18","2037-03-19","2037-03-20","2037-03-21","2037-03-22","2037-03-23","2037-03-24","2037-03-25","2037-03-26","2037-03-27","2037-03-28","2037-03-29","2037-03-30","2037-03-31","2037-04-01","2037-04-02","2037-04-03","2037-04-04","2037-04-05","2037-04-06","2037-04-07","2037-04-08","2037-04-09","2037-04-10","2037-04-11","2037-04-12","2037-04-13","2037-04-14","2037-04-15","2037-04-16","2037-04-17","2037-04-18","2037-04-19","2037-04-20","2037-04-21","2037-04-22","2037-04-23","2037-04-24","2037-04-25","2037-04-26","2037-04-27","2037-04-28","2037-04-29","2037-04-30","2037-05-01","2037-05-02","2037-05-03","2037-05-04","2037-05-05","2037-05-06","2037-05-07","2037-05-08","2037-05-09","2037-05-10","2037-05-11","2037-05-12","2037-05-13","2037-05-14","2037-05-15","2037-05-16","2037-05-17","2037-05-18","2037-05-19","2037-05-20","2037-05-21","2037-05-22","2037-05-23","2037-05-24","2037-05-25","2037-05-26","2037-05-27","2037-05-28","2037-05-29","2037-05-30","2037-05-31","2037-06-01","2037-06-02","2037-06-03","2037-06-04","2037-06-05","2037-06-06","2037-06-07","2037-06-08","2037-06-09","2037-06-10","2037-06-11","2037-06-12","2037-06-13","2037-06-14","2037-06-15","2037-06-16","2037-06-17","2037-06-18","2037-06-19","2037-06-20","2037-06-21","2037-06-22","2037-06-23","2037-06-24","2037-06-25","2037-06-26","2037-06-27","2037-06-28","2037-06-29","2037-06-30","2037-07-01","2037-07-02","2037-07-03","2037-07-04","2037-07-05","2037-07-06","2037-07-07","2037-07-08","2037-07-09","2037-07-10","2037-07-11","2037-07-12","2037-07-13","2037-07-14","2037-07-15","2037-07-16","2037-07-17","2037-07-18","2037-07-19","2037-07-20","2037-07-21","2037-07-22","2037-07-23","2037-07-24","2037-07-25","2037-07-26","2037-07-27","2037-07-28","2037-07-29","2037-07-30","2037-07-31","2037-08-01","2037-08-02","2037-08-03","2037-08-04","2037-08-05","2037-08-06","2037-08-07","2037-08-08","2037-08-09","2037-08-10","2037-08-11","2037-08-12","2037-08-13","2037-08-14","2037-08-15","2037-08-16","2037-08-17","2037-08-18","2037-08-19","2037-08-20","2037-08-21","2037-08-22","2037-08-23","2037-08-24","2037-08-25","2037-08-26","2037-08-27","2037-08-28","2037-08-29","2037-08-30","2037-08-31","2037-09-01","2037-09-02","2037-09-03","2037-09-04","2037-09-05","2037-09-06","2037-09-07","2037-09-08","2037-09-09","2037-09-10","2037-09-11","2037-09-12","2037-09-13","2037-09-14","2037-09-15","2037-09-16","2037-09-17","2037-09-18","2037-09-19","2037-09-20","2037-09-21","2037-09-22","2037-09-23","2037-09-24","2037-09-25","2037-09-26","2037-09-27","2037-09-28","2037-09-29","2037-09-30","2037-10-01","2037-10-02","2037-10-03","2037-10-04","2037-10-05","2037-10-06","2037-10-07","2037-10-08","2037-10-09","2037-10-10","2037-10-11","2037-10-12","2037-10-13","2037-10-14","2037-10-15","2037-10-16","2037-10-17","2037-10-18","2037-10-19","2037-10-20","2037-10-21","2037-10-22","2037-10-23","2037-10-24","2037-10-25","2037-10-26","2037-10-27","2037-10-28","2037-10-29","2037-10-30","2037-10-31","2037-11-01","2037-11-02","2037-11-03","2037-11-04","2037-11-05","2037-11-06","2037-11-07","2037-11-08","2037-11-09","2037-11-10","2037-11-11","2037-11-12","2037-11-13","2037-11-14","2037-11-15","2037-11-16","2037-11-17","2037-11-18","2037-11-19","2037-11-20","2037-11-21","2037-11-22","2037-11-23","2037-11-24","2037-11-25","2037-11-26","2037-11-27","2037-11-28","2037-11-29","2037-11-30","2037-12-01","2037-12-02","2037-12-03","2037-12-04","2037-12-05","2037-12-06","2037-12-07","2037-12-08","2037-12-09","2037-12-10","2037-12-11","2037-12-12","2037-12-13","2037-12-14","2037-12-15","2037-12-16","2037-12-17","2037-12-18","2037-12-19","2037-12-20","2037-12-21","2037-12-22","2037-12-23","2037-12-24","2037-12-25","2037-12-26","2037-12-27","2037-12-28","2037-12-29","2037-12-30","2037-12-31","2038-01-01","2038-01-02","2038-01-03","2038-01-04","2038-01-05","2038-01-06","2038-01-07","2038-01-08","2038-01-09","2038-01-10","2038-01-11","2038-01-12","2038-01-13","2038-01-14","2038-01-15","2038-01-16","2038-01-17","2038-01-18","2038-01-19","2038-01-20","2038-01-21","2038-01-22","2038-01-23","2038-01-24","2038-01-25","2038-01-26","2038-01-27","2038-01-28","2038-01-29","2038-01-30","2038-01-31","2038-02-01","2038-02-02","2038-02-03","2038-02-04","2038-02-05","2038-02-06","2038-02-07","2038-02-08","2038-02-09","2038-02-10","2038-02-11","2038-02-12","2038-02-13","2038-02-14","2038-02-15","2038-02-16","2038-02-17","2038-02-18","2038-02-19","2038-02-20","2038-02-21","2038-02-22","2038-02-23","2038-02-24","2038-02-25","2038-02-26","2038-02-27","2038-02-28","2038-03-01","2038-03-02","2038-03-03","2038-03-04","2038-03-05","2038-03-06","2038-03-07","2038-03-08","2038-03-09","2038-03-10","2038-03-11","2038-03-12","2038-03-13","2038-03-14","2038-03-15","2038-03-16","2038-03-17","2038-03-18","2038-03-19","2038-03-20","2038-03-21","2038-03-22","2038-03-23","2038-03-24","2038-03-25","2038-03-26","2038-03-27","2038-03-28","2038-03-29","2038-03-30","2038-03-31","2038-04-01","2038-04-02","2038-04-03","2038-04-04","2038-04-05","2038-04-06","2038-04-07","2038-04-08","2038-04-09","2038-04-10","2038-04-11","2038-04-12","2038-04-13","2038-04-14","2038-04-15","2038-04-16","2038-04-17","2038-04-18","2038-04-19","2038-04-20","2038-04-21","2038-04-22","2038-04-23","2038-04-24","2038-04-25","2038-04-26","2038-04-27","2038-04-28","2038-04-29","2038-04-30","2038-05-01","2038-05-02","2038-05-03","2038-05-04","2038-05-05","2038-05-06","2038-05-07","2038-05-08","2038-05-09","2038-05-10","2038-05-11","2038-05-12","2038-05-13","2038-05-14","2038-05-15","2038-05-16","2038-05-17","2038-05-18","2038-05-19","2038-05-20","2038-05-21","2038-05-22","2038-05-23","2038-05-24","2038-05-25","2038-05-26","2038-05-27","2038-05-28","2038-05-29","2038-05-30","2038-05-31","2038-06-01","2038-06-02","2038-06-03","2038-06-04","2038-06-05","2038-06-06","2038-06-07","2038-06-08","2038-06-09","2038-06-10","2038-06-11","2038-06-12","2038-06-13","2038-06-14","2038-06-15","2038-06-16","2038-06-17","2038-06-18","2038-06-19","2038-06-20","2038-06-21","2038-06-22","2038-06-23","2038-06-24","2038-06-25","2038-06-26","2038-06-27","2038-06-28","2038-06-29","2038-06-30","2038-07-01","2038-07-02","2038-07-03","2038-07-04","2038-07-05","2038-07-06","2038-07-07","2038-07-08","2038-07-09","2038-07-10","2038-07-11","2038-07-12","2038-07-13","2038-07-14","2038-07-15","2038-07-16","2038-07-17","2038-07-18","2038-07-19","2038-07-20","2038-07-21","2038-07-22","2038-07-23","2038-07-24","2038-07-25","2038-07-26","2038-07-27","2038-07-28","2038-07-29","2038-07-30","2038-07-31","2038-08-01","2038-08-02","2038-08-03","2038-08-04","2038-08-05","2038-08-06","2038-08-07","2038-08-08","2038-08-09","2038-08-10","2038-08-11","2038-08-12","2038-08-13","2038-08-14","2038-08-15","2038-08-16","2038-08-17","2038-08-18","2038-08-19","2038-08-20","2038-08-21","2038-08-22","2038-08-23","2038-08-24","2038-08-25","2038-08-26","2038-08-27","2038-08-28","2038-08-29","2038-08-30","2038-08-31","2038-09-01","2038-09-02","2038-09-03","2038-09-04","2038-09-05","2038-09-06","2038-09-07","2038-09-08","2038-09-09","2038-09-10","2038-09-11","2038-09-12","2038-09-13","2038-09-14","2038-09-15","2038-09-16","2038-09-17","2038-09-18","2038-09-19","2038-09-20","2038-09-21","2038-09-22","2038-09-23","2038-09-24","2038-09-25","2038-09-26","2038-09-27","2038-09-28","2038-09-29","2038-09-30","2038-10-01","2038-10-02","2038-10-03","2038-10-04","2038-10-05","2038-10-06","2038-10-07","2038-10-08","2038-10-09","2038-10-10","2038-10-11","2038-10-12","2038-10-13","2038-10-14","2038-10-15","2038-10-16","2038-10-17","2038-10-18","2038-10-19","2038-10-20","2038-10-21","2038-10-22","2038-10-23","2038-10-24","2038-10-25","2038-10-26","2038-10-27","2038-10-28","2038-10-29","2038-10-30","2038-10-31","2038-11-01","2038-11-02","2038-11-03","2038-11-04","2038-11-05","2038-11-06","2038-11-07","2038-11-08","2038-11-09","2038-11-10","2038-11-11","2038-11-12","2038-11-13","2038-11-14","2038-11-15","2038-11-16","2038-11-17","2038-11-18","2038-11-19","2038-11-20","2038-11-21","2038-11-22","2038-11-23","2038-11-24","2038-11-25","2038-11-26","2038-11-27","2038-11-28","2038-11-29","2038-11-30","2038-12-01","2038-12-02","2038-12-03","2038-12-04","2038-12-05","2038-12-06","2038-12-07","2038-12-08","2038-12-09","2038-12-10","2038-12-11","2038-12-12","2038-12-13","2038-12-14","2038-12-15","2038-12-16","2038-12-17","2038-12-18","2038-12-19","2038-12-20","2038-12-21","2038-12-22","2038-12-23","2038-12-24","2038-12-25","2038-12-26","2038-12-27","2038-12-28","2038-12-29","2038-12-30","2038-12-31","2039-01-01","2039-01-02","2039-01-03","2039-01-04","2039-01-05","2039-01-06","2039-01-07","2039-01-08","2039-01-09","2039-01-10","2039-01-11","2039-01-12","2039-01-13","2039-01-14","2039-01-15","2039-01-16","2039-01-17","2039-01-18","2039-01-19","2039-01-20","2039-01-21","2039-01-22","2039-01-23","2039-01-24","2039-01-25","2039-01-26","2039-01-27","2039-01-28","2039-01-29","2039-01-30","2039-01-31","2039-02-01","2039-02-02","2039-02-03","2039-02-04","2039-02-05","2039-02-06","2039-02-07","2039-02-08","2039-02-09","2039-02-10","2039-02-11","2039-02-12","2039-02-13","2039-02-14","2039-02-15","2039-02-16","2039-02-17","2039-02-18","2039-02-19","2039-02-20","2039-02-21","2039-02-22","2039-02-23","2039-02-24","2039-02-25","2039-02-26","2039-02-27","2039-02-28","2039-03-01","2039-03-02","2039-03-03","2039-03-04","2039-03-05","2039-03-06","2039-03-07","2039-03-08","2039-03-09","2039-03-10","2039-03-11","2039-03-12","2039-03-13","2039-03-14","2039-03-15","2039-03-16","2039-03-17","2039-03-18","2039-03-19","2039-03-20","2039-03-21","2039-03-22","2039-03-23","2039-03-24","2039-03-25","2039-03-26","2039-03-27","2039-03-28","2039-03-29","2039-03-30","2039-03-31","2039-04-01","2039-04-02","2039-04-03","2039-04-04","2039-04-05","2039-04-06","2039-04-07","2039-04-08","2039-04-09","2039-04-10","2039-04-11","2039-04-12","2039-04-13","2039-04-14","2039-04-15","2039-04-16","2039-04-17","2039-04-18","2039-04-19","2039-04-20","2039-04-21","2039-04-22","2039-04-23","2039-04-24","2039-04-25","2039-04-26","2039-04-27","2039-04-28","2039-04-29","2039-04-30","2039-05-01","2039-05-02","2039-05-03","2039-05-04","2039-05-05","2039-05-06","2039-05-07","2039-05-08","2039-05-09","2039-05-10","2039-05-11","2039-05-12","2039-05-13","2039-05-14","2039-05-15","2039-05-16","2039-05-17","2039-05-18","2039-05-19","2039-05-20","2039-05-21","2039-05-22","2039-05-23","2039-05-24","2039-05-25","2039-05-26","2039-05-27","2039-05-28","2039-05-29","2039-05-30","2039-05-31","2039-06-01","2039-06-02","2039-06-03","2039-06-04","2039-06-05","2039-06-06","2039-06-07","2039-06-08","2039-06-09","2039-06-10","2039-06-11","2039-06-12","2039-06-13","2039-06-14","2039-06-15","2039-06-16","2039-06-17","2039-06-18","2039-06-19","2039-06-20","2039-06-21","2039-06-22","2039-06-23","2039-06-24","2039-06-25","2039-06-26","2039-06-27","2039-06-28","2039-06-29","2039-06-30","2039-07-01","2039-07-02","2039-07-03","2039-07-04","2039-07-05","2039-07-06","2039-07-07","2039-07-08","2039-07-09","2039-07-10","2039-07-11","2039-07-12","2039-07-13","2039-07-14","2039-07-15","2039-07-16","2039-07-17","2039-07-18","2039-07-19","2039-07-20","2039-07-21","2039-07-22","2039-07-23","2039-07-24","2039-07-25","2039-07-26","2039-07-27","2039-07-28","2039-07-29","2039-07-30","2039-07-31","2039-08-01","2039-08-02","2039-08-03","2039-08-04","2039-08-05","2039-08-06","2039-08-07","2039-08-08","2039-08-09","2039-08-10","2039-08-11","2039-08-12","2039-08-13","2039-08-14","2039-08-15","2039-08-16","2039-08-17","2039-08-18","2039-08-19","2039-08-20","2039-08-21","2039-08-22","2039-08-23","2039-08-24","2039-08-25","2039-08-26","2039-08-27","2039-08-28","2039-08-29","2039-08-30","2039-08-31","2039-09-01","2039-09-02","2039-09-03","2039-09-04","2039-09-05","2039-09-06","2039-09-07","2039-09-08","2039-09-09","2039-09-10","2039-09-11","2039-09-12","2039-09-13","2039-09-14","2039-09-15","2039-09-16","2039-09-17","2039-09-18","2039-09-19","2039-09-20","2039-09-21","2039-09-22","2039-09-23","2039-09-24","2039-09-25","2039-09-26","2039-09-27","2039-09-28","2039-09-29","2039-09-30","2039-10-01","2039-10-02","2039-10-03","2039-10-04","2039-10-05","2039-10-06","2039-10-07","2039-10-08","2039-10-09","2039-10-10","2039-10-11","2039-10-12","2039-10-13","2039-10-14","2039-10-15","2039-10-16","2039-10-17","2039-10-18","2039-10-19","2039-10-20","2039-10-21","2039-10-22","2039-10-23","2039-10-24","2039-10-25","2039-10-26","2039-10-27","2039-10-28","2039-10-29","2039-10-30","2039-10-31","2039-11-01","2039-11-02","2039-11-03","2039-11-04","2039-11-05","2039-11-06","2039-11-07","2039-11-08","2039-11-09","2039-11-10","2039-11-11","2039-11-12","2039-11-13","2039-11-14","2039-11-15","2039-11-16","2039-11-17","2039-11-18","2039-11-19","2039-11-20","2039-11-21","2039-11-22","2039-11-23","2039-11-24","2039-11-25","2039-11-26","2039-11-27","2039-11-28","2039-11-29","2039-11-30","2039-12-01","2039-12-02","2039-12-03","2039-12-04","2039-12-05","2039-12-06","2039-12-07","2039-12-08","2039-12-09","2039-12-10","2039-12-11","2039-12-12","2039-12-13","2039-12-14","2039-12-15","2039-12-16","2039-12-17","2039-12-18","2039-12-19","2039-12-20","2039-12-21","2039-12-22","2039-12-23","2039-12-24","2039-12-25","2039-12-26","2039-12-27","2039-12-28","2039-12-29","2039-12-30","2039-12-31","2040-01-01"]
[null,null,{"$f":"IF(Données!A2<>\"\",Données!A2,\"\")","v":"Valentin"}]
[null,null,{"$f":"IF(Données!A3<>\"\",Données!A3,\"\")","v":"Cyril"}]
[null,null,{"$f":"IF(Données!A4<>\"\",Données!A4,\"\")","v":"Philippe"}]
[null,null,{"$f":"IF(Données!A5<>\"\",Données!A5,\"\")","v":"Arnaud"}]
[null,null,{"$f":"IF(Données!A6<>\"\",Données!A6,\"\")","v":""}]
[null,null,{"$f":"IF(Données!B7<>\"\",Données!B7,\"\")","v":""}]
[null,null,{"$f":"IF(Données!B8<>\"\",Données!B8,\"\")","v":""}]
[null,null,{"$f":"IF(Données!B9<>\"\",Données!B9,\"\")","v":""}]
[null,null,{"$f":"IF(Données!B10<>\"\",Données!B10,\"\")","v":""}]
[null,null,{"$f":"IF(Données!B11<>\"\",Données!B11,\"\")","v":""}]
[null,null,{"$f":"IF(Données!B12<>\"\",Données!B12,\"\")","v":""}]
[null,null,{"$f":"IF(Données!B13<>\"\",Données!B13,\"\")","v":""}]
[null,null,{"$f":"IF(Données!B14<>\"\",Données!B14,\"\")","v":""}]
[null,null,{"$f":"IF(Données!B15<>\"\",Données!B15,\"\")","v":""}]
[null,null,{"$f":"IF(Données!B16<>\"\",Données!B16,\"\")","v":""}]
[null,null,{"$f":"IF(Données!B17<>\"\",Données!B17,\"\")","v":""}]
[null,null,{"$f":"IF(Données!B18<>\"\",Données!B18,\"\")","v":""}]
[null,null,{"$f":"IF(Données!B19<>\"\",Données!B19,\"\")","v":""}]
[null,null,{"$f":"IF(Données!B20<>\"\",Données!B20,\"\")","v":""}]
[null,null,{"$f":"IF(Données!B21<>\"\",Données!B21,\"\")","v":""}]
[null,null,{"$f":"IF(Données!B22<>\"\",Données!B22,\"\")","v":""}]
[null,null,{"$f":"IF(Données!B23<>\"\",Données!B23,\"\")","v":""}]
[null,null,{"$f":"IF(Données!B24<>\"\",Données!B24,\"\")","v":""}]
[null,null,{"$f":"IF(Données!B25<>\"\",Données!B25,\"\")","v":""}]
[null,null,{"$f":"IF(Données!B26<>\"\",Données!B26,\"\")","v":""}]
[null,null,{"$f":"IF(Données!B27<>\"\",Données!B27,\"\")","v":""}]
[null,null,{"$f":"IF(Données!B28<>\"\",Données!B28,\"\")","v":""}]
[]
[]
[null,null,{"$f":"IF(Données!A41<>\"\",Données!A41,\"\")","v":""}]
[null,null,{"$f":"IF(Données!A42<>\"\",Données!A42,\"\")","v":""}]
[null,null,{"$f":"IF(Données!A43<>\"\",Données!A43,\"\")","v":""}]
[null,null,{"$f":"IF(Données!A44<>\"\",Données!A44,\"\")","v":""}]
[null,null,{"$f":"IF(Données!A45<>\"\",Données!A45,\"\")","v":""}]
[null,null,{"$f":"IF(Données!A46<>\"\",Données!A46,\"\")","v":""}]
[null,null,{"$f":"IF(Données!A47<>\"\",Données!A47,\"\")","v":""}]

{"sheet":"Etudes","index":1,"n_rows":6,"n_cols":8,"rows_kept":6}
[]
["N° Etude","Libellé","Etat","Responsable","Lien","Date début","Durée allouée","Date fin"]
[null,"Maintenance PAC","Terminé","Valentin",null,"2020-01-02",3,{"$f":"WORKDAY.INTL(F3-1,G3,1,Données!D3:W30)","v":"2020-01-06"}]
[null,"MAJ normes","BC","Cyril",null,"2020-01-02",7,{"$f":"WORKDAY.INTL(F4-1,G4,1,Données!D4:W31)","v":"2020-01-10"}]
[null,"Maintenance Frigo","A confirmer","Valentin",null,"2020-01-09",2,{"$f":"WORKDAY.INTL(F5-1,G5,1,Données!D5:W32)","v":"2020-01-10"}]
[null,"Rédaction CR","BC","Cyril",null,"2020-01-11",1,{"$f":"WORKDAY.INTL(F6-1,G6,1,Données!D6:W33)","v":"2020-01-13"}]

{"sheet":"Données","index":2,"n_rows":15,"n_cols":23,"rows_kept":15,"merged":[[0,2,0,12]]}
["Responsable:","Code couleurs","JOURS FERIES ET NON-TRAVAILLES"]
["Valentin","A confirmer",null,2020,2021,2022,2023,2024,2025,2026,2028,2029,2030,2031,2032,2033,2034,2035,2036,2037,2038,2039,2040]
["Cyril","BC","Jour de l’An",{"$f":"DATE(D2,1,1)","v":"2020-01-01"},{"$f":"DATE(E2,1,1)","v":"2021-01-01"},{"$f":"DATE(F2,1,1)","v":"2022-01-01"},{"$f":"DATE(G2,1,1)","v":"2023-01-01"},"2024-01-01","2025-01-01","2026-01-01","2028-01-01","2029-01-01",{"$f":"DATE(M2,1,1)","v":"2030-01-01"},{"$f":"DATE(N2,1,1)","v":"2031-01-01"},"2032-01-01","2033-01-01","2034-01-01","2035-01-01","2036-01-01","2037-01-01","2038-01-01","2039-01-01","2040-01-01"]
["Philippe","Terminé","Pâques",{"$f":"ROUND(DATE(D2,4,MOD(234-11*MOD(D2,19),30))/7,0)*7-6","v":"2020-04-12"},{"$f":"ROUND(DATE(E2,4,MOD(234-11*MOD(E2,19),30))/7,0)*7-6","v":"2021-04-04"},"2022-04-17",{"$f":"ROUND(DATE(G2,4,MOD(234-11*MOD(G2,19),30))/7,0)*7-6","v":"2023-04-09"},"2024-03-31","2025-04-20","2026-04-05","2028-04-16","2029-04-01","2030-04-21",{"$f":"ROUND(DATE(N2,4,MOD(234-11*MOD(N2,19),30))/7,0)*7-6","v":"2031-04-13"},"2032-03-28","2033-04-17","2034-04-09","2035-03-25","2036-04-13","2037-04-05","2038-04-25","2039-04-10","2040-04-01"]
["Arnaud",null,"Lundi de Pâques",{"$f":"D4+1","v":"2020-04-13"},{"$f":"E4+1","v":"2021-04-05"},"2022-04-18",{"$f":"G4+1","v":"2023-04-10"},"2024-04-01","2025-04-21","2026-04-06","2028-04-17","2029-04-02","2030-04-22",{"$f":"N4+1","v":"2031-04-14"},"2032-03-29","2033-04-18","2034-04-10","2035-03-26","2036-04-14","2037-04-06","2038-04-26","2039-04-11","2040-04-02"]
[null,null,"Fête du travail",{"$f":"DATE(D2,5,1)","v":"2020-05-01"},{"$f":"DATE(E2,5,1)","v":"2021-05-01"},"2022-05-01",{"$f":"DATE(G2,5,1)","v":"2023-05-01"},"2024-05-01","2025-05-01","2026-05-01","2028-05-01","2029-05-01","2030-05-01",{"$f":"DATE(N2,5,1)","v":"2031-05-01"},"2032-05-01","2033-05-01","2034-05-01","2035-05-01","2036-05-01","2037-05-01","2038-05-01","2039-05-01","2040-05-01"]
[null,null,"Victoire 1945",{"$f":"DATE(D2,5,8)","v":"2020-05-08"},{"$f":"DATE(E2,5,8)","v":"2021-05-08"},"2022-05-08",{"$f":"DATE(G2,5,8)","v":"2023-05-08"},"2024-05-08","2025-05-08","2026-05-08","2028-05-08","2029-05-08","2030-05-08",{"$f":"DATE(N2,5,8)","v":"2031-05-08"},"2032-05-08","2033-05-08","2034-05-08","2035-05-08","2036-05-08","2037-05-08","2038-05-08","2039-05-08","2040-05-08"]
[null,null,"Ascension",{"$f":"D4+39","v":"2020-05-21"},{"$f":"E4+39","v":"2021-05-13"},"2022-05-26",{"$f":"G4+39","v":"2023-05-18"},"2024-05-09","2025-05-29","2026-05-14","2028-05-25","2029-05-10","2030-05-30",{"$f":"N4+39","v":"2031-05-22"},"2032-05-06","2033-05-26","2034-05-18","2035-05-03","2036-05-22","2037-05-14","2038-06-03","2039-05-19","2040-05-10"]
[null,null,"Pentecôte",{"$f":"D4+49","v":"2020-05-31"},{"$f":"E4+49","v":"2021-05-23"},"2022-06-05",{"$f":"G4+49","v":"2023-05-28"},"2024-05-19","2025-06-08","2026-05-24","2028-06-04","2029-05-20","2030-06-09",{"$f":"N4+49","v":"2031-06-01"},"2032-05-16","2033-06-05","2034-05-28","2035-05-13","2036-06-01","2037-05-24","2038-06-13","2039-05-29","2040-05-20"]
[null,null,"Lundi de Pentecôte",{"$f":"D4+50","v":"2020-06-01"},{"$f":"E4+50","v":"2021-05-24"},"2022-06-06",{"$f":"G4+50","v":"2023-05-29"},"2024-05-20","2025-06-09","2026-05-25","2028-06-05","2029-05-21","2030-06-10",{"$f":"N4+50","v":"2031-06-02"},"2032-05-17","2033-06-06","2034-05-29","2035-05-14","2036-06-02","2037-05-25","2038-06-14","2039-05-30","2040-05-21"]
[null,null,"Fête Nationale",{"$f":"DATE(D2,7,14)","v":"2020-07-14"},{"$f":"DATE(E2,7,14)","v":"2021-07-14"},"2022-07-14",{"$f":"DATE(G2,7,14)","v":"2023-07-14"},"2024-07-14","2025-07-14","2026-07-14","2028-07-14","2029-07-14","2030-07-14",{"$f":"DATE(N2,7,14)","v":"2031-07-14"},"2032-07-14","2033-07-14","2034-07-14","2035-07-14","2036-07-14","2037-07-14","2038-07-14","2039-07-14","2040-07-14"]
[null,null,"Assomption",{"$f":"DATE(D2,8,15)","v":"2020-08-15"},{"$f":"DATE(E2,8,15)","v":"2021-08-15"},"2022-08-15",{"$f":"DATE(G2,8,15)","v":"2023-08-15"},"2024-08-15","2025-08-15","2026-08-15","2028-08-15","2029-08-15","2030-08-15",{"$f":"DATE(N2,8,15)","v":"2031-08-15"},"2032-08-15","2033-08-15","2034-08-15","2035-08-15","2036-08-15","2037-08-15","2038-08-15","2039-08-15","2040-08-15"]
[null,null,"Toussaint",{"$f":"DATE(D2,11,1)","v":"2020-11-01"},{"$f":"DATE(E2,11,1)","v":"2021-11-01"},"2022-11-01",{"$f":"DATE(G2,11,1)","v":"2023-11-01"},"2024-11-01","2025-11-01","2026-11-01","2028-11-01","2029-11-01","2030-11-01",{"$f":"DATE(N2,11,1)","v":"2031-11-01"},"2032-11-01","2033-11-01","2034-11-01","2035-11-01","2036-11-01","2037-11-01","2038-11-01","2039-11-01","2040-11-01"]
[null,null,"Armistice 1918",{"$f":"DATE(D2,11,11)","v":"2020-11-11"},{"$f":"DATE(E2,11,11)","v":"2021-11-11"},"2022-11-11",{"$f":"DATE(G2,11,11)","v":"2023-11-11"},"2024-11-11","2025-11-11","2026-11-11","2028-11-11","2029-11-11","2030-11-11",{"$f":"DATE(N2,11,11)","v":"2031-11-11"},"2032-11-11","2033-11-11","2034-11-11","2035-11-11","2036-11-11","2037-11-11","2038-11-11","2039-11-11","2040-11-11"]
[null,null,"Noël",{"$f":"DATE(D2,12,25)","v":"2020-12-25"},{"$f":"DATE(E2,12,25)","v":"2021-12-25"},"2022-12-25",{"$f":"DATE(G2,12,25)","v":"2023-12-25"},"2024-12-25","2025-12-25","2026-12-25","2028-12-25","2029-12-25","2030-12-25",{"$f":"DATE(N2,12,25)","v":"2031-12-25"},"2032-12-25","2033-12-25","2034-12-25","2035-12-25","2036-12-25","2037-12-25","2038-12-25","2039-12-25","2040-12-25"]