{"text_format":"3","workbook":"xlsx","n_sheets":3,"sheets":["Activités","Calendrier","Données"],"not_rendered":{"macros":1},"read":"whole","date_system":"1900"}

{"sheet":"Activités","index":0,"n_rows":13,"n_cols":7,"rows_kept":13}
[]
["Code activité","Libellé","Etat","Responsable","Date début","Durée allouée","Date fin"]
[1,"Excel","Terminé","Valentin","2020-01-02",4,{"$f":"WORKDAY.INTL(E3-1,F3,1)","v":"2020-01-07"}]
[1,"VBA","En cours","Arnaud","2020-01-03",2,{"$f":"WORKDAY.INTL(E4-1,F4,1)","v":"2020-01-06"}]
[2,"Java","A confirmer","Valentin","2020-01-08",1,"2020-01-08"]
[{"$nulls":6},{"$error":"#NUM!"}]
[{"$nulls":6},{"$error":"#NUM!"}]
[{"$nulls":6},{"$error":"#NUM!"}]
[{"$nulls":6},{"$error":"#NUM!"}]
[{"$nulls":6},{"$error":"#NUM!"}]
[{"$nulls":6},{"$error":"#NUM!"}]
[{"$nulls":6},{"$error":"#NUM!"}]
[{"$nulls":6},{"$error":"#NUM!"}]

{"sheet":"Calendrier","index":1,"n_rows":41,"n_cols":3751,"rows_kept":41}
[{"$nulls":3},{"$f":"YEAR(D5)","v":2020},{"$f":"YEAR(E5)","v":2020},2020,2020,2020,2020,2020,2020,2020,2020,2020,2020,2020,2020,2020,2020,2020,2020,2020,2020,2020,2020,2020,2020,2020,2020,2020,2020,2020,2020,2020,2020,2020,2020,2020,2020,2020,2020,2020,2020,2020,2020,2020,2020,2020,2020,2020,2020,2020,2020,2020,2020,2020,2020,2020,2020,2020,2020,2020,2020,2020,2020,2020,2020,2020,{"$f":"YEAR(BQ5)","v":2020},2020,2020,2020,2020,2020,2020,2020,2020,2020,2020,2020,2020,2020,2020,2020,2020,2020,2020,2020,2020,2020,2020,2020,2020,2020,2020,2020,2020,2020,2020,2020,2020,2020,2020,2020,2020,2020,2020,2020,2020,2020,2020,2020,2020,2020,2020,2020,2020,2020,2020,2020,2020,2020,2020,2020,2020,2020,2020,2020,2020,2020,2020,2020,{"$f":"YEAR(EC5)","v":2020},2020,2020,2020,2020,2020,2020,2020,2020,2020,2020,2020,2020,2020,2020,2020,2020,2020,2020,2020,2020,2020,2020,2020,2020,2020,2020,2020,2020,2020,2020,2020,2020,2020,2020,2020,2020,2020,2020,2020,2020,2020,2020,2020,2020,2020,2020,2020,2020,2020,2020,2020,2020,2020,2020,2020,2020,2020,2020,2020,2020,2020,2020,2020,{"$f":"YEAR(GO5)","v":2020},2020,2020,2020,2020,2020,2020,2020,2020,2020,2020,2020,2020,2020,2020,2020,2020,2020,2020,2020,2020,2020,2020,2020,2020,2020,2020,2020,2020,2020,2020,2020,2020,2020,2020,2020,2020,2020,2020,2020,2020,2020,2020,2020,2020,2020,2020,2020,2020,2020,2020,2020,2020,2020,2020,2020,2020,2020,2020,2020,2020,2020,2020,2020,{"$f":"YEAR(JA5)","v":2020},2020,2020,2020,2020,2020,2020,2020,2020,2020,2020,2020,2020,2020,2020,2020,2020,2020,2020,2020,2020,2020,2020,2020,2020,2020,2020,2020,2020,2020,2020,2020,2020,2020,2020,2020,2020,2020,2020,2020,2020,2020,2020,2020,2020,2020,2020,2020,2020,2020,2020,2020,2020,2020,2020,2020,2020,2020,2020,2020,2020,2020,2020,2020,{"$f":"YEAR(LM5)","v":2020},2020,2020,2020,2020,2020,2020,2020,2020,2020,2020,2020,2020,2020,2020,2020,2020,2020,2020,2020,2020,2020,2020,2020,2020,2020,2020,2020,2020,2020,2020,2020,2020,2020,2020,2020,2020,2020,2020,2020,2020,2020,2020,2020,2020,2021,2021,2021,2021,2021,2021,2021,2021,2021,2021,2021,2021,2021,2021,2021,2021,2021,2021,2021,{"$f":"YEAR(NY5)","v":2021},2021,2021,2021,2021,2021,2021,2021,2021,2021,2021,2021,2021,2021,2021,2021,2021,2021,2021,2021,2021,2021,2021,2021,2021,2021,2021,2021,2021,2021,2021,2021,2021,2021,2021,2021,2021,2021,2021,2021,2021,2021,2021,2021,2021,2021,2021,2021,2021,2021,2021,2021,2021,2021,2021,2021,2021,2021,2021,2021,2021,2021,2021,2021,{"$f":"YEAR(QK5)","v":2021},2021,2021,2021,2021,2021,2021,2021,2021,2021,2021,2021,2021,2021,2021,2021,2021,2021,2021,2021,2021,2021,2021,2021,2021,2021,2021,2021,2021,2021,2021,2021,2021,2021,2021,2021,2021,2021,2021,2021,2021,2021,2021,2021,2021,2021,2021,2021,2021,2021,2021,2021,2021,2021,2021,2021,2021,2021,2021,2021,2021,2021,2021,2021,{"$f":"YEAR(SW5)","v":2021},2021,2021,2021,2021,2021,2021,2021,2021,2021,2021,2021,2021,2021,2021,2021,2021,2021,2021,2021,2021,2021,2021,2021,2021,2021,2021,2021,2021,2021,2021,2021,2021,2021,2021,2021,2021,2021,2021,2021,2021,2021,2021,2021,2021,2021,2021,2021,2021,2021,2021,2021,2021,2021,2021,2021,2021,2021,2021,2021,2021,2021,2021,2021,{"$f":"YEAR(VI5)","v":2021},2021,2021,2021,2021,2021,2021,2021,2021,2021,2021,2021,2021,2021,2021,2021,2021,2021,2021,2021,2021,2021,2021,2021,2021,2021,2021,2021,2021,2021,2021,2021,2021,2021,2021,2021,2021,2021,2021,2021,2021,2021,2021,2021,2021,2021,2021,2021,2021,2021,2021,2021,2021,2021,2021,2021,2021,2021,2021,2021,2021,2021,2021,2021,{"$f":"YEAR(XU5)","v":2021},2021,2021,2021,2021,2021,2021,2021,2021,2021,2021,2021,2021,2021,2021,2021,2021,2021,2021,2021,2021,2021,2021,2021,2021,2021,2021,2021,2021,2021,2021,2021,2021,2021,2021,2021,2021,2021,2021,2021,2021,2021,2021,2021,2021,2021,2021,2021,2021,2021,2021,2021,2021,2021,2021,2021,2021,2021,2021,2021,2021,2021,2021,2021,{"$f":"YEAR(AAG5)","v":2021},2021,2021,2021,2021,2021,2021,2021,2021,2021,2021,2021,2021,2021,2021,2021,2021,2021,2021,2021,2021,2021,2021,2021,2021,2021,2022,2022,2022,2022,2022,2022,2022,2022,2022,2022,2022,2022,2022,2022,2022,2022,2022,2022,2022,2022,2022,2022,2022,2022,2022,2022,2022,2022,2022,2022,2022,2022,2022,2022,2022,2022,2022,2022,{"$f":"YEAR(ACS5)","v":2022},2022,2022,2022,2022,2022,2022,2022,2022,2022,2022,2022,2022,2022,2022,2022,2022,2022,2022,2022,2022,2022,2022,2022,2022,2022,2022,2022,2022,2022,2022,2022,2022,2022,2022,2022,2022,2022,2022,2022,2022,2022,2022,2022,2022,2022,2022,2022,2022,2022,2022,2022,2022,2022,2022,2022,2022,2022,2022,2022,2022,2022,2022,2022,{"$f":"YEAR(AFE5)","v":2022},2022,2022,2022,2022,2022,2022,2022,2022,2022,2022,2022,2022,2022,2022,2022,2022,2022,2022,2022,2022,2022,2022,2022,2022,2022,2022,2022,2022,2022,2022,2022,2022,2022,2022,2022,2022,2022,2022,2022,2022,2022,2022,2022,2022,2022,2022,2022,2022,2022,2022,2022,2022,2022,2022,2022,2022,2022,2022,2022,2022,2022,2022,2022,{"$f":"YEAR(AHQ5)","v":2022},2022,2022,2022,2022,2022,2022,2022,2022,2022,2022,2022,2022,2022,2022,2022,2022,2022,2022,2022,2022,2022,2022,2022,2022,2022,2022,2022,2022,2022,2022,2022,2022,2022,2022,2022,2022,2022,2022,2022,2022,2022,2022,2022,2022,2022,2022,2022,2022,2022,2022,2022,2022,2022,2022,2022,2022,2022,2022,2022,2022,2022,2022,2022,{"$f":"YEAR(AKC5)","v":2022},2022,2022,2022,2022,2022,2022,2022,2022,2022,2022,2022,2022,2022,2022,2022,2022,2022,2022,2022,2022,2022,2022,2022,2022,2022,2022,2022,2022,2022,2022,2022,2022,2022,2022,2022,2022,2022,2022,2022,2022,2022,2022,2022,2022,2022,2022,2022,2022,2022,2022,2022,2022,2022,2022,2022,2022,2022,2022,2022,2022,2022,2022,2022,{"$f":"YEAR(AMO5)","v":2022},2022,2022,2022,2022,2022,2022,2022,2022,2022,2022,2022,2022,2022,2022,2022,2022,2022,2022,2022,2022,2022,2022,2022,2022,2022,2022,2022,2022,2022,2022,2022,2022,2022,2022,2022,2022,2022,2022,2022,2022,2022,2022,2022,2022,2022,2022,2022,2022,2022,2022,2022,2022,2022,2022,2022,2022,2022,2022,2022,2022,2022,2022,2022,{"$f":"YEAR(APA5)","v":2022},2022,2022,2022,2022,2022,2022,2023,2023,2023,2023,2023,2023,2023,2023,2023,2023,2023,2023,2023,2023,2023,2023,2023,2023,2023,2023,2023,2023,2023,2023,2023,2023,2023,2023,2023,2023,2023,2023,2023,2023,2023,2023,2023,2023,2023,2023,2023,2023,2023,2023,2023,2023,2023,2023,2023,2023,2023,2023,2023,2023,2023,2023,2023,{"$f":"YEAR(ARM5)","v":2023},2023,2023,2023,2023,2023,2023,2023,2023,2023,2023,2023,2023,2023,2023,2023,2023,2023,2023,2023,2023,2023,2023,2023,2023,2023,2023,2023,2023,2023,2023,2023,2023,2023,2023,2023,2023,2023,2023,2023,2023,2023,2023,2023,2023,2023,2023,2023,2023,2023,2023,2023,2023,2023,2023,2023,2023,2023,2023,2023,2023,2023,2023,2023,{"$f":"YEAR(ATY5)","v":2023},2023,2023,2023,2023,2023,2023,2023,2023,2023,2023,2023,2023,2023,2023,2023,2023,2023,2023,2023,2023,2023,2023,2023,2023,2023,2023,2023,2023,2023,2023,2023,2023,2023,2023,2023,2023,2023,2023,2023,2023,2023,2023,2023,2023,2023,2023,2023,2023,2023,2023,2023,2023,2023,2023,2023,2023,2023,2023,2023,2023,2023,2023,2023,{"$f":"YEAR(AWK5)","v":2023},2023,2023,2023,2023,2023,2023,2023,2023,2023,2023,2023,2023,2023,2023,2023,2023,2023,2023,2023,2023,2023,2023,2023,2023,2023,2023,2023,2023,2023,2023,2023,2023,2023,2023,2023,2023,2023,2023,2023,2023,2023,2023,2023,2023,2023,2023,2023,2023,2023,2023,2023,2023,2023,2023,2023,2023,2023,2023,2023,2023,2023,2023,2023,{"$f":"YEAR(AYW5)","v":2023},2023,2023,2023,2023,2023,2023,2023,2023,2023,2023,2023,2023,2023,2023,2023,2023,2023,2023,2023,2023,2023,2023,2023,2023,2023,2023,2023,2023,2023,2023,2023,2023,2023,2023,2023,2023,2023,2023,2023,2023,2023,2023,2023,2023,2023,2023,2023,2023,2023,2023,2023,2023,2023,2023,2023,2023,2023,2023,2023,2023,2023,2023,2023,{"$f":"YEAR(BBI5)","v":2023},2023,2023,2023,2023,2023,2023,2023,2023,2023,2023,2023,2023,2023,2023,2023,2023,2023,2023,2023,2023,2023,2023,2023,2023,2023,2023,2023,2023,2023,2023,2023,2023,2023,2023,2023,2023,2023,2023,2023,2023,2023,2023,2023,2023,2023,2023,2023,2023,2023,2023,2023,2024,2024,2024,2024,2024,2024,2024,2024,2024,2024,2024,2024,{"$f":"YEAR(BDU5)","v":2024},2024,2024,2024,2024,2024,2024,2024,2024,2024,2024,2024,2024,2024,2024,2024,2024,2024,2024,2024,2024,2024,2024,2024,2024,2024,2024,2024,2024,2024,2024,2024,2024,2024,2024,2024,2024,2024,2024,2024,2024,2024,2024,2024,2024,2024,2024,2024,2024,2024,2024,2024,2024,2024,2024,2024,2024,2024,2024,2024,2024,2024,2024,2024,{"$f":"YEAR(BGG5)","v":2024},2024,2024,2024,2024,2024,2024,2024,2024,2024,2024,2024,2024,2024,2024,2024,2024,2024,2024,2024,2024,2024,2024,2024,2024,2024,2024,2024,2024,2024,2024,2024,2024,2024,2024,2024,2024,2024,2024,2024,2024,2024,2024,2024,2024,2024,2024,2024,2024,2024,2024,2024,2024,2024,2024,2024,2024,2024,2024,2024,2024,2024,2024,2024,{"$f":"YEAR(BIS5)","v":2024},2024,2024,2024,2024,2024,2024,2024,2024,2024,2024,2024,2024,2024,2024,2024,2024,2024,2024,2024,2024,2024,2024,2024,2024,2024,2024,2024,2024,2024,2024,2024,2024,2024,2024,2024,2024,2024,2024,2024,2024,2024,2024,2024,2024,2024,2024,2024,2024,2024,2024,2024,2024,2024,2024,2024,2024,2024,2024,2024,2024,2024,2024,2024,{"$f":"YEAR(BLE5)","v":2024},2024,2024,2024,2024,2024,2024,2024,2024,2024,2024,2024,2024,2024,2024,2024,2024,2024,2024,2024,2024,2024,2024,2024,2024,2024,2024,2024,2024,2024,2024,2024,2024,2024,2024,2024,2024,2024,2024,2024,2024,2024,2024,2024,2024,2024,2024,2024,2024,2024,2024,2024,2024,2024,2024,2024,2024,2024,2024,2024,2024,2024,2024,2024,{"$f":"YEAR(BNQ5)","v":2024},2024,2024,2024,2024,2024,2024,2024,2024,2024,2024,2024,2024,2024,2024,2024,2024,2024,2024,2024,2024,2024,2024,2024,2024,2024,2024,2024,2024,2024,2024,2024,2024,2024,2024,2024,2024,2024,2024,2024,2024,2024,2024,2024,2024,2024,2024,2024,2024,2024,2024,2024,2024,2024,2024,2024,2024,2024,2024,2024,2024,2024,2024,2024,{"$f":"YEAR(BQC5)","v":2024},2024,2024,2024,2024,2024,2024,2024,2024,2024,2024,2024,2024,2024,2024,2024,2024,2024,2024,2024,2024,2024,2024,2024,2024,2024,2024,2024,2024,2024,2024,2024,2024,2024,2025,2025,2025,2025,2025,2025,2025,2025,2025,2025,2025,2025,2025,2025,2025,2025,2025,2025,2025,2025,2025,2025,2025,2025,2025,2025,2025,2025,2025,2025,{"$f":"YEAR(BSO5)","v":2025},2025,2025,2025,2025,2025,2025,2025,2025,2025,2025,2025,2025,2025,2025,2025,2025,2025,2025,2025,2025,2025,2025,2025,2025,2025,2025,2025,2025,2025,2025,2025,2025,2025,2025,2025,2025,2025,2025,2025,2025,2025,2025,2025,2025,2025,2025,2025,2025,2025,2025,2025,2025,2025,2025,2025,2025,2025,2025,2025,2025,2025,2025,2025,{"$f":"YEAR(BVA5)","v":2025},2025,2025,2025,2025,2025,2025,2025,2025,2025,2025,2025,2025,2025,2025,2025,2025,2025,2025,2025,2025,2025,2025,2025,2025,2025,2025,2025,2025,2025,2025,2025,2025,2025,2025,2025,2025,2025,2025,2025,2025,2025,2025,2025,2025,2025,2025,2025,2025,2025,2025,2025,2025,2025,2025,2025,2025,2025,2025,2025,2025,2025,2025,2025,{"$f":"YEAR(BXM5)","v":2025},2025,2025,2025,2025,2025,2025,2025,2025,2025,2025,2025,2025,2025,2025,2025,2025,2025,2025,2025,2025,2025,2025,2025,2025,2025,2025,2025,2025,2025,2025,2025,2025,2025,2025,2025,2025,2025,2025,2025,2025,2025,2025,2025,2025,2025,2025,2025,2025,2025,2025,2025,2025,2025,2025,2025,2025,2025,2025,2025,2025,2025,2025,2025,{"$f":"YEAR(BZY5)","v":2025},2025,2025,2025,2025,2025,2025,2025,2025,2025,2025,2025,2025,2025,2025,2025,2025,2025,2025,2025,2025,2025,2025,2025,2025,2025,2025,2025,2025,2025,2025,2025,2025,2025,2025,2025,2025,2025,2025,2025,2025,2025,2025,2025,2025,2025,2025,2025,2025,2025,2025,2025,2025,2025,2025,2025,2025,2025,2025,2025,2025,2025,2025,2025,{"$f":"YEAR(CCK5)","v":2025},2025,2025,2025,2025,2025,2025,2025,2025,2025,2025,2025,2025,2025,2025,2025,2025,2025,2025,2025,2025,2025,2025,2025,2025,2025,2025,2025,2025,2025,2025,2025,2025,2025,2025,2025,2025,2025,2025,2025,2025,2025,2025,2025,2025,2025,2025,2025,2025,2025,2025,2025,2025,2025,2025,2025,2025,2025,2025,2025,2025,2025,2025,2025,{"$f":"YEAR(CEW5)","v":2025},2025,2025,2025,2025,2025,2025,2025,2025,2025,2025,2025,2025,2025,2025,2026,2026,2026,2026,2026,2026,2026,2026,2026,2026,2026,2026,2026,2026,2026,2026,2026,2026,2026,2026,2026,2026,2026,2026,2026,2026,2026,2026,2026,2026,2026,2026,2026,2026,2026,2026,2026,2026,2026,2026,2026,2026,2026,2026,2026,2026,2026,2026,2026,{"$f":"YEAR(CHI5)","v":2026},2026,2026,2026,2026,2026,2026,2026,2026,2026,2026,2026,2026,2026,2026,2026,2026,2026,2026,2026,2026,2026,2026,2026,2026,2026,2026,2026,2026,2026,2026,2026,2026,2026,2026,2026,2026,2026,2026,2026,2026,2026,2026,2026,2026,2026,2026,2026,2026,2026,2026,2026,2026,2026,2026,2026,2026,2026,2026,2026,2026,2026,2026,2026,{"$f":"YEAR(CJU5)","v":2026},2026,2026,2026,2026,2026,2026,2026,2026,2026,2026,2026,2026,2026,2026,2026,2026,2026,2026,2026,2026,2026,2026,2026,2026,2026,2026,2026,2026,2026,2026,2026,2026,2026,2026,2026,2026,2026,2026,2026,2026,2026,2026,2026,2026,2026,2026,2026,2026,2026,2026,2026,2026,2026,2026,2026,2026,2026,2026,2026,2026,2026,2026,2026,{"$f":"YEAR(CMG5)","v":2026},2026,2026,2026,2026,2026,2026,2026,2026,2026,2026,2026,2026,2026,2026,2026,2026,2026,2026,2026,2026,2026,2026,2026,2026,2026,2026,2026,2026,2026,2026,2026,2026,2026,2026,2026,2026,2026,2026,2026,2026,2026,2026,2026,2026,2026,2026,2026,2026,2026,2026,2026,2026,2026,2026,2026,2026,2026,2026,2026,2026,2026,2026,2026,{"$f":"YEAR(COS5)","v":2026},2026,2026,2026,2026,2026,2026,2026,2026,2026,2026,2026,2026,2026,2026,2026,2026,2026,2026,2026,2026,2026,2026,2026,2026,2026,2026,2026,2026,2026,2026,2026,2026,2026,2026,2026,2026,2026,2026,2026,2026,2026,2026,2026,2026,2026,2026,2026,2026,2026,2026,2026,2026,2026,2026,2026,2026,2026,2026,2026,2026,2026,2026,2026,{"$f":"YEAR(CRE5)","v":2026},2026,2026,2026,2026,2026,2026,2026,2026,2026,2026,2026,2026,2026,2026,2026,2026,2026,2026,2026,2026,2026,2026,2026,2026,2026,2026,2026,2026,2026,2026,2026,2026,2026,2026,2026,2026,2026,2026,2026,2026,2026,2026,2026,2026,2026,2026,2026,2026,2026,2026,2026,2026,2026,2026,2026,2026,2026,2026,2026,2027,2027,2027,2027,{"$f":"YEAR(CTQ5)","v":2027},2027,2027,2027,2027,2027,2027,2027,2027,2027,2027,2027,2027,2027,2027,2027,2027,2027,2027,2027,2027,2027,2027,2027,2027,2027,2027,2027,2027,2027,2027,2027,2027,2027,2027,2027,2027,2027,2027,2027,2027,2027,2027,2027,2027,2027,2027,2027,2027,2027,2027,2027,2027,2027,2027,2027,2027,2027,2027,2027,2027,2027,2027,2027,{"$f":"YEAR(CWC5)","v":2027},2027,2027,2027,2027,2027,2027,2027,2027,2027,2027,2027,2027,2027,2027,2027,2027,2027,2027,2027,2027,2027,2027,2027,2027,2027,2027,2027,2027,2027,2027,2027,2027,2027,2027,2027,2027,2027,2027,2027,2027,2027,2027,2027,2027,2027,2027,2027,2027,2027,2027,2027,2027,2027,2027,2027,2027,2027,2027,2027,2027,2027,2027,2027,{"$f":"YEAR(CYO5)","v":2027},2027,2027,2027,2027,2027,2027,2027,2027,2027,2027,2027,2027,2027,2027,2027,2027,2027,2027,2027,2027,2027,2027,2027,2027,2027,2027,2027,2027,2027,2027,2027,2027,2027,2027,2027,2027,2027,2027,2027,2027,2027,2027,2027,2027,2027,2027,2027,2027,2027,2027,2027,2027,2027,2027,2027,2027,2027,2027,2027,2027,2027,2027,2027,{"$f":"YEAR(DBA5)","v":2027},2027,2027,2027,2027,2027,2027,2027,2027,2027,2027,2027,2027,2027,2027,2027,2027,2027,2027,2027,2027,2027,2027,2027,2027,2027,2027,2027,2027,2027,2027,2027,2027,2027,2027,2027,2027,2027,2027,2027,2027,2027,2027,2027,2027,2027,2027,2027,2027,2027,2027,2027,2027,2027,2027,2027,2027,2027,2027,2027,2027,2027,2027,2027,{"$f":"YEAR(DDM5)","v":2027},2027,2027,2027,2027,2027,2027,2027,2027,2027,2027,2027,2027,2027,2027,2027,2027,2027,2027,2027,2027,2027,2027,2027,2027,2027,2027,2027,2027,2027,2027,2027,2027,2027,2027,2027,2027,2027,2027,2027,2027,2027,2027,2027,2027,2027,2027,2027,2027,2027,2027,2027,2027,2027,2027,2027,2027,2027,2027,2027,2027,2027,2027,2027,{"$f":"YEAR(DFY5)","v":2027},2027,2027,2027,2027,2027,2027,2027,2027,2027,2027,2027,2027,2027,2027,2027,2027,2027,2027,2027,2027,2027,2027,2027,2027,2027,2027,2027,2027,2027,2027,2027,2027,2027,2027,2027,2027,2027,2027,2027,2027,2028,2028,2028,2028,2028,2028,2028,2028,2028,2028,2028,2028,2028,2028,2028,2028,2028,2028,2028,2028,2028,2028,2028,{"$f":"YEAR(DIK5)","v":2028},2028,2028,2028,2028,2028,2028,2028,2028,2028,2028,2028,2028,2028,2028,2028,2028,2028,2028,2028,2028,2028,2028,2028,2028,2028,2028,2028,2028,2028,2028,2028,2028,2028,2028,2028,2028,2028,2028,2028,2028,2028,2028,2028,2028,2028,2028,2028,2028,2028,2028,2028,2028,2028,2028,2028,2028,2028,2028,2028,2028,2028,2028,2028,{"$f":"YEAR(DKW5)","v":2028},2028,2028,2028,2028,2028,2028,2028,2028,2028,2028,2028,2028,2028,2028,2028,2028,2028,2028,2028,2028,2028,2028,2028,2028,2028,2028,2028,2028,2028,2028,2028,2028,2028,2028,2028,2028,2028,2028,2028,2028,2028,2028,2028,2028,2028,2028,2028,2028,2028,2028,2028,2028,2028,2028,2028,2028,2028,2028,2028,2028,2028,2028,2028,{"$f":"YEAR(DNI5)","v":2028},2028,2028,2028,2028,2028,2028,2028,2028,2028,2028,2028,2028,2028,2028,2028,2028,2028,2028,2028,2028,2028,2028,2028,2028,2028,2028,2028,2028,2028,2028,2028,2028,2028,2028,2028,2028,2028,2028,2028,2028,2028,2028,2028,2028,2028,2028,2028,2028,2028,2028,2028,2028,2028,2028,2028,2028,2028,2028,2028,2028,2028,2028,2028,{"$f":"YEAR(DPU5)","v":2028},2028,2028,2028,2028,2028,2028,2028,2028,2028,2028,2028,2028,2028,2028,2028,2028,2028,2028,2028,2028,2028,2028,2028,2028,2028,2028,2028,2028,2028,2028,2028,2028,2028,2028,2028,2028,2028,2028,2028,2028,2028,2028,2028,2028,2028,2028,2028,2028,2028,2028,2028,2028,2028,2028,2028,2028,2028,2028,2028,2028,2028,2028,2028,{"$f":"YEAR(DSG5)","v":2028},2028,2028,2028,2028,2028,2028,2028,2028,2028,2028,2028,2028,2028,2028,2028,2028,2028,2028,2028,2028,2028,2028,2028,2028,2028,2028,2028,2028,2028,2028,2028,2028,2028,2028,2028,2028,2028,2028,2028,2028,2028,2028,2028,2028,2028,2028,2028,2028,2028,2028,2028,2028,2028,2028,2028,2028,2028,2028,2028,2028,2028,2028,2028,{"$f":"YEAR(DUS5)","v":2028},2028,2028,2028,2028,2028,2028,2028,2028,2028,2028,2028,2028,2028,2028,2028,2028,2028,2028,2028,2028,2028,2028,2029,2029,2029,2029,2029,2029,2029,2029,2029,2029,2029,2029,2029,2029,2029,2029,2029,2029,2029,2029,2029,2029,2029,2029,2029,2029,2029,2029,2029,2029,2029,2029,2029,2029,2029,2029,2029,2029,2029,2029,2029,{"$f":"YEAR(DXE5)","v":2029},2029,2029,2029,2029,2029,2029,2029,2029,2029,2029,2029,2029,2029,2029,2029,2029,2029,2029,2029,2029,2029,2029,2029,2029,2029,2029,2029,2029,2029,2029,2029,2029,2029,2029,2029,2029,2029,2029,2029,2029,2029,2029,2029,2029,2029,2029,2029,2029,2029,2029,2029,2029,2029,2029,2029,2029,2029,2029,2029,2029,2029,2029,2029,{"$f":"YEAR(DZQ5)","v":2029},2029,2029,2029,2029,2029,2029,2029,2029,2029,2029,2029,2029,2029,2029,2029,2029,2029,2029,2029,2029,2029,2029,2029,2029,2029,2029,2029,2029,2029,2029,2029,2029,2029,2029,2029,2029,2029,2029,2029,2029,2029,2029,2029,2029,2029,2029,2029,2029,2029,2029,2029,2029,2029,2029,2029,2029,2029,2029,2029,2029,2029,2029,2029,{"$f":"YEAR(ECC5)","v":2029},2029,2029,2029,2029,2029,2029,2029,2029,2029,2029,2029,2029,2029,2029,2029,2029,2029,2029,2029,2029,2029,2029,2029,2029,2029,2029,2029,2029,2029,2029,2029,2029,2029,2029,2029,2029,2029,2029,2029,2029,2029,2029,2029,2029,2029,2029,2029,2029,2029,2029,2029,2029,2029,2029,2029,2029,2029,2029,2029,2029,2029,2029,2029,{"$f":"YEAR(EEO5)","v":2029},2029,2029,2029,2029,2029,2029,2029,2029,2029,2029,2029,2029,2029,2029,2029,2029,2029,2029,2029,2029,2029,2029,2029,2029,2029,2029,2029,2029,2029,2029,2029,2029,2029,2029,2029,2029,2029,2029,2029,2029,2029,2029,2029,2029,2029,2029,2029,2029,2029,2029,2029,2029,2029,2029,2029,2029,2029,2029,2029,2029,2029,2029,2029,{"$f":"YEAR(EHA5)","v":2029},2029,2029,2029,2029,2029,2029,2029,2029,2029,2029,2029,2029,2029,2029,2029,2029,2029,2029,2029,2029,2029,2029,2029,2029,2029,2029,2029,2029,2029,2029,2029,2029,2029,2029,2029,2029,2029,2029,2029,2029,2029,2029,2029,2029,2029,2029,2029,2029,2029,2029,2029,2029,2029,2029,2029,2029,2029,2029,2029,2029,2029,2029,2029,{"$f":"YEAR(EJM5)","v":2029},2029,2029,2029,2030,2030,2030,2030,2030,2030,2030,2030,2030,2030,2030,2030,2030,2030,2030,2030,2030,2030,2030,2030,2030,2030,2030,2030,2030,2030,2030,2030,2030,2030,2030,2030,2030,2030,2030,2030,2030,2030,2030,2030,2030,2030,2030,2030,2030,2030,2030,2030,2030,2030,2030,2030,2030,2030,2030,2030,2030,2030,2030,2030,{"$f":"YEAR(ELY5)","v":2030},2030,2030,2030,2030,2030,2030,2030,2030,2030,2030,2030,2030,2030,2030,2030,2030,2030,2030,2030,2030,2030,2030,2030,2030,2030,2030,2030,2030,2030,2030,2030,2030,2030,2030]
[{"$nulls":3},{"$f":"CHOOSE(MONTH(D5),\"janvier\",\"février\",\"mars\",\"avril\",\"mai\",\"juin\",\"juillet\",\"aout\",\"septembre\",\"octobre\",\"novembre\",\"décembre\")","v":"janvier"},{"$f":"CHOOSE(MONTH(E5),\"janvier\",\"février\",\"mars\",\"avril\",\"mai\",\"juin\",\"juillet\",\"aout\",\"septembre\",\"octobre\",\"novembre\",\"décembre\")","v":"janvier"},"janvier","janvier","janvier","janvier","janvier","janvier","janvier","janvier","janvier","janvier","janvier","janvier","janvier","janvier","janvier","janvier","janvier","janvier","janvier","janvier","janvier","janvier","janvier","janvier","janvier","janvier","janvier","janvier","janvier","février","février","février","février","février","février","février","février","février","février","février","février","février","février","février","février","février","février","février","février","février","février","février","février","février","février","février","février","février","mars","mars","mars","mars","mars",{"$f":"CHOOSE(MONTH(BQ5),\"janvier\",\"février\",\"mars\",\"avril\",\"mai\",\"juin\",\"juillet\",\"aout\",\"septembre\",\"octobre\",\"novembre\",\"décembre\")","v":"mars"},"mars","mars","mars","mars","mars","mars","mars","mars","mars","mars","mars","mars","mars","mars","mars","mars","mars","mars","mars","mars","mars","mars","mars","mars","mars","avril","avril","avril","avril","avril","avril","avril","avril","avril","avril","avril","avril","avril","avril","avril","avril","avril","avril","avril","avril","avril","avril","avril","avril","avril","avril","avril","avril","avril","avril","mai","mai","mai","mai","mai","mai","mai","mai",{"$f":"CHOOSE(MONTH(EC5),\"janvier\",\"février\",\"mars\",\"avril\",\"mai\",\"juin\",\"juillet\",\"aout\",\"septembre\",\"octobre\",\"novembre\",\"décembre\")","v":"mai"},"mai","mai","mai","mai","mai","mai","mai","mai","mai","mai","mai","mai","mai","mai","mai","mai","mai","mai","mai","mai","mai","mai","juin","juin","juin","juin","juin","juin","juin","juin","juin","juin","juin","juin","juin","juin","juin","juin","juin","juin","juin","juin","juin","juin","juin","juin","juin","juin","juin","juin","juin","juin","juillet","juillet","juillet","juillet","juillet","juillet","juillet","juillet","juillet","juillet","juillet",{"$f":"CHOOSE(MONTH(GO5),\"janvier\",\"février\",\"mars\",\"avril\",\"mai\",\"juin\",\"juillet\",\"aout\",\"septembre\",\"octobre\",\"novembre\",\"décembre\")","v":"juillet"},"juillet","juillet","juillet","juillet","juillet","juillet","juillet","juillet","juillet","juillet","juillet","juillet","juillet","juillet","juillet","juillet","juillet","juillet","juillet","aout","aout","aout","aout","aout","aout","aout","aout","aout","aout","aout","aout","aout","aout","aout","aout","aout","aout","aout","aout","aout","aout","aout","aout","aout","aout","aout","aout","aout","aout","aout","septembre","septembre","septembre","septembre","septembre","septembre","septembre","septembre","septembre","septembre","septembre","septembre","septembre",{"$f":"CHOOSE(MONTH(JA5),\"janvier\",\"février\",\"mars\",\"avril\",\"mai\",\"juin\",\"juillet\",\"aout\",\"septembre\",\"octobre\",\"novembre\",\"décembre\")","v":"septembre"},"septembre","septembre","septembre","septembre","septembre","septembre","septembre","septembre","septembre","septembre","septembre","septembre","septembre","septembre","septembre","septembre","octobre","octobre","octobre","octobre","octobre","octobre","octobre","octobre","octobre","octobre","octobre","octobre","octobre","octobre","octobre","octobre","octobre","octobre","octobre","octobre","octobre","octobre","octobre","octobre","octobre","octobre","octobre","octobre","octobre","octobre","octobre","novembre","novembre","novembre","novembre","novembre","novembre","novembre","novembre","novembre","novembre","novembre","novembre","novembre","novembre","novembre","novembre",{"$f":"CHOOSE(MONTH(LM5),\"janvier\",\"février\",\"mars\",\"avril\",\"mai\",\"juin\",\"juillet\",\"aout\",\"septembre\",\"octobre\",\"novembre\",\"décembre\")","v":"novembre"},"novembre","novembre","novembre","novembre","novembre","novembre","novembre","novembre","novembre","novembre","novembre","novembre","novembre","décembre","décembre","décembre","décembre","décembre","décembre","décembre","décembre","décembre","décembre","décembre","décembre","décembre","décembre","décembre","décembre","décembre","décembre","décembre","décembre","décembre","décembre","décembre","décembre","décembre","décembre","décembre","décembre","décembre","décembre","décembre","janvier","janvier","janvier","janvier","janvier","janvier","janvier","janvier","janvier","janvier","janvier","janvier","janvier","janvier","janvier","janvier","janvier","janvier","janvier",{"$f":"CHOOSE(MONTH(NY5),\"janvier\",\"février\",\"mars\",\"avril\",\"mai\",\"juin\",\"juillet\",\"aout\",\"septembre\",\"octobre\",\"novembre\",\"décembre\")","v":"janvier"},"janvier","janvier","janvier","janvier","janvier","janvier","janvier","janvier","janvier","janvier","janvier","février","février","février","février","février","février","février","février","février","février","février","février","février","février","février","février","février","février","février","février","février","février","février","février","février","février","février","février","mars","mars","mars","mars","mars","mars","mars","mars","mars","mars","mars","mars","mars","mars","mars","mars","mars","mars","mars","mars","mars","mars","mars","mars",{"$f":"CHOOSE(MONTH(QK5),\"janvier\",\"février\",\"mars\",\"avril\",\"mai\",\"juin\",\"juillet\",\"aout\",\"septembre\",\"octobre\",\"novembre\",\"décembre\")","v":"mars"},"mars","mars","mars","mars","mars","mars","avril","avril","avril","avril","avril","avril","avril","avril","avril","avril","avril","avril","avril","avril","avril","avril","avril","avril","avril","avril","avril","avril","avril","avril","avril","avril","avril","avril","avril","avril","mai","mai","mai","mai","mai","mai","mai","mai","mai","mai","mai","mai","mai","mai","mai","mai","mai","mai","mai","mai","mai","mai","mai","mai","mai","mai","mai",{"$f":"CHOOSE(MONTH(SW5),\"janvier\",\"février\",\"mars\",\"avril\",\"mai\",\"juin\",\"juillet\",\"aout\",\"septembre\",\"octobre\",\"novembre\",\"décembre\")","v":"mai"},"mai","mai","mai","juin","juin","juin","juin","juin","juin","juin","juin","juin","juin","juin","juin","juin","juin","juin","juin","juin","juin","juin","juin","juin","juin","juin","juin","juin","juin","juin","juin","juin","juin","juillet","juillet","juillet","juillet","juillet","juillet","juillet","juillet","juillet","juillet","juillet","juillet","juillet","juillet","juillet","juillet","juillet","juillet","juillet","juillet","juillet","juillet","juillet","juillet","juillet","juillet","juillet","juillet","juillet","juillet",{"$f":"CHOOSE(MONTH(VI5),\"janvier\",\"février\",\"mars\",\"avril\",\"mai\",\"juin\",\"juillet\",\"aout\",\"septembre\",\"octobre\",\"novembre\",\"décembre\")","v":"juillet"},"aout","aout","aout","aout","aout","aout","aout","aout","aout","aout","aout","aout","aout","aout","aout","aout","aout","aout","aout","aout","aout","aout","aout","aout","aout","aout","aout","aout","aout","aout","aout","septembre","septembre","septembre","septembre","septembre","septembre","septembre","septembre","septembre","septembre","septembre","septembre","septembre","septembre","septembre","septembre","septembre","septembre","septembre","septembre","septembre","septembre","septembre","septembre","septembre","septembre","septembre","septembre","septembre","septembre","octobre","octobre",{"$f":"CHOOSE(MONTH(XU5),\"janvier\",\"février\",\"mars\",\"avril\",\"mai\",\"juin\",\"juillet\",\"aout\",\"septembre\",\"octobre\",\"novembre\",\"décembre\")","v":"octobre"},"octobre","octobre","octobre","octobre","octobre","octobre","octobre","octobre","octobre","octobre","octobre","octobre","octobre","octobre","octobre","octobre","octobre","octobre","octobre","octobre","octobre","octobre","octobre","octobre","octobre","octobre","octobre","octobre","novembre","novembre","novembre","novembre","novembre","novembre","novembre","novembre","novembre","novembre","novembre","novembre","novembre","novembre","novembre","novembre","novembre","novembre","novembre","novembre","novembre","novembre","novembre","novembre","novembre","novembre","novembre","novembre","novembre","novembre","décembre","décembre","décembre","décembre","décembre",{"$f":"CHOOSE(MONTH(AAG5),\"janvier\",\"février\",\"mars\",\"avril\",\"mai\",\"juin\",\"juillet\",\"aout\",\"septembre\",\"octobre\",\"novembre\",\"décembre\")","v":"décembre"},"décembre","décembre","décembre","décembre","décembre","décembre","décembre","décembre","décembre","décembre","décembre","décembre","décembre","décembre","décembre","décembre","décembre","décembre","décembre","décembre","décembre","décembre","décembre","décembre","décembre","janvier","janvier","janvier","janvier","janvier","janvier","janvier","janvier","janvier","janvier","janvier","janvier","janvier","janvier","janvier","janvier","janvier","janvier","janvier","janvier","janvier","janvier","janvier","janvier","janvier","janvier","janvier","janvier","janvier","janvier","janvier","février","février","février","février","février","février","février",{"$f":"CHOOSE(MONTH(ACS5),\"janvier\",\"février\",\"mars\",\"avril\",\"mai\",\"juin\",\"juillet\",\"aout\",\"septembre\",\"octobre\",\"novembre\",\"décembre\")","v":"février"},"février","février","février","février","février","février","février","février","février","février","février","février","février","février","février","février","février","février","février","février","mars","mars","mars","mars","mars","mars","mars","mars","mars","mars","mars","mars","mars","mars","mars","mars","mars","mars","mars","mars","mars","mars","mars","mars","mars","mars","mars","mars","mars","mars","mars","avril","avril","avril","avril","avril","avril","avril","avril","avril","avril","avril","avril",{"$f":"CHOOSE(MONTH(AFE5),\"janvier\",\"février\",\"mars\",\"avril\",\"mai\",\"juin\",\"juillet\",\"aout\",\"septembre\",\"octobre\",\"novembre\",\"décembre\")","v":"avril"},"avril","avril","avril","avril","avril","avril","avril","avril","avril","avril","avril","avril","avril","avril","avril","avril","avril","mai","mai","mai","mai","mai","mai","mai","mai","mai","mai","mai","mai","mai","mai","mai","mai","mai","mai","mai","mai","mai","mai","mai","mai","mai","mai","mai","mai","mai","mai","mai","juin","juin","juin","juin","juin","juin","juin","juin","juin","juin","juin","juin","juin","juin","juin",{"$f":"CHOOSE(MONTH(AHQ5),\"janvier\",\"février\",\"mars\",\"avril\",\"mai\",\"juin\",\"juillet\",\"aout\",\"septembre\",\"octobre\",\"novembre\",\"décembre\")","v":"juin"},"juin","juin","juin","juin","juin","juin","juin","juin","juin","juin","juin","juin","juin","juin","juillet","juillet","juillet","juillet","juillet","juillet","juillet","juillet","juillet","juillet","juillet","juillet","juillet","juillet","juillet","juillet","juillet","juillet","juillet","juillet","juillet","juillet","juillet","juillet","juillet","juillet","juillet","juillet","juillet","juillet","juillet","aout","aout","aout","aout","aout","aout","aout","aout","aout","aout","aout","aout","aout","aout","aout","aout","aout","aout",{"$f":"CHOOSE(MONTH(AKC5),\"janvier\",\"février\",\"mars\",\"avril\",\"mai\",\"juin\",\"juillet\",\"aout\",\"septembre\",\"octobre\",\"novembre\",\"décembre\")","v":"aout"},"aout","aout","aout","aout","aout","aout","aout","aout","aout","aout","aout","aout","septembre","septembre","septembre","septembre","septembre","septembre","septembre","septembre","septembre","septembre","septembre","septembre","septembre","septembre","septembre","septembre","septembre","septembre","septembre","septembre","septembre","septembre","septembre","septembre","septembre","septembre","septembre","septembre","septembre","septembre","octobre","octobre","octobre","octobre","octobre","octobre","octobre","octobre","octobre","octobre","octobre","octobre","octobre","octobre","octobre","octobre","octobre","octobre","octobre","octobre","octobre",{"$f":"CHOOSE(MONTH(AMO5),\"janvier\",\"février\",\"mars\",\"avril\",\"mai\",\"juin\",\"juillet\",\"aout\",\"septembre\",\"octobre\",\"novembre\",\"décembre\")","v":"octobre"},"octobre","octobre","octobre","octobre","octobre","octobre","octobre","octobre","octobre","novembre","novembre","novembre","novembre","novembre","novembre","novembre","novembre","novembre","novembre","novembre","novembre","novembre","novembre","novembre","novembre","novembre","novembre","novembre","novembre","novembre","novembre","novembre","novembre","novembre","novembre","novembre","novembre","novembre","novembre","décembre","décembre","décembre","décembre","décembre","décembre","décembre","décembre","décembre","décembre","décembre","décembre","décembre","décembre","décembre","décembre","décembre","décembre","décembre","décembre","décembre","décembre","décembre","décembre",{"$f":"CHOOSE(MONTH(APA5),\"janvier\",\"février\",\"mars\",\"avril\",\"mai\",\"juin\",\"juillet\",\"aout\",\"septembre\",\"octobre\",\"novembre\",\"décembre\")","v":"décembre"},"décembre","décembre","décembre","décembre","décembre","décembre","janvier","janvier","janvier","janvier","janvier","janvier","janvier","janvier","janvier","janvier","janvier","janvier","janvier","janvier","janvier","janvier","janvier","janvier","janvier","janvier","janvier","janvier","janvier","janvier","janvier","janvier","janvier","janvier","janvier","janvier","janvier","février","février","février","février","février","février","février","février","février","février","février","février","février","février","février","février","février","février","février","février","février","février","février","février","février","février",{"$f":"CHOOSE(MONTH(ARM5),\"janvier\",\"février\",\"mars\",\"avril\",\"mai\",\"juin\",\"juillet\",\"aout\",\"septembre\",\"octobre\",\"novembre\",\"décembre\")","v":"février"},"février","mars","mars","mars","mars","mars","mars","mars","mars","mars","mars","mars","mars","mars","mars","mars","mars","mars","mars","mars","mars","mars","mars","mars","mars","mars","mars","mars","mars","mars","mars","mars","avril","avril","avril","avril","avril","avril","avril","avril","avril","avril","avril","avril","avril","avril","avril","avril","avril","avril","avril","avril","avril","avril","avril","avril","avril","avril","avril","avril","avril","avril","mai",{"$f":"CHOOSE(MONTH(ATY5),\"janvier\",\"février\",\"mars\",\"avril\",\"mai\",\"juin\",\"juillet\",\"aout\",\"septembre\",\"octobre\",\"novembre\",\"décembre\")","v":"mai"},"mai","mai","mai","mai","mai","mai","mai","mai","mai","mai","mai","mai","mai","mai","mai","mai","mai","mai","mai","mai","mai","mai","mai","mai","mai","mai","mai","mai","mai","juin","juin","juin","juin","juin","juin","juin","juin","juin","juin","juin","juin","juin","juin","juin","juin","juin","juin","juin","juin","juin","juin","juin","juin","juin","juin","juin","juin","juin","juin","juillet","juillet","juillet","juillet",{"$f":"CHOOSE(MONTH(AWK5),\"janvier\",\"février\",\"mars\",\"avril\",\"mai\",\"juin\",\"juillet\",\"aout\",\"septembre\",\"octobre\",\"novembre\",\"décembre\")","v":"juillet"},"juillet","juillet","juillet","juillet","juillet","juillet","juillet","juillet","juillet","juillet","juillet","juillet","juillet","juillet","juillet","juillet","juillet","juillet","juillet","juillet","juillet","juillet","juillet","juillet","juillet","juillet","aout","aout","aout","aout","aout","aout","aout","aout","aout","aout","aout","aout","aout","aout","aout","aout","aout","aout","aout","aout","aout","aout","aout","aout","aout","aout","aout","aout","aout","aout","aout","septembre","septembre","septembre","septembre","septembre","septembre",{"$f":"CHOOSE(MONTH(AYW5),\"janvier\",\"février\",\"mars\",\"avril\",\"mai\",\"juin\",\"juillet\",\"aout\",\"septembre\",\"octobre\",\"novembre\",\"décembre\")","v":"septembre"},"septembre","septembre","septembre","septembre","septembre","septembre","septembre","septembre","septembre","septembre","septembre","septembre","septembre","septembre","septembre","septembre","septembre","septembre","septembre","septembre","septembre","septembre","septembre","octobre","octobre","octobre","octobre","octobre","octobre","octobre","octobre","octobre","octobre","octobre","octobre","octobre","octobre","octobre","octobre","octobre","octobre","octobre","octobre","octobre","octobre","octobre","octobre","octobre","octobre","octobre","octobre","octobre","octobre","octobre","novembre","novembre","novembre","novembre","novembre","novembre","novembre","novembre","novembre",{"$f":"CHOOSE(MONTH(BBI5),\"janvier\",\"février\",\"mars\",\"avril\",\"mai\",\"juin\",\"juillet\",\"aout\",\"septembre\",\"octobre\",\"novembre\",\"décembre\")","v":"novembre"},"novembre","novembre","novembre","novembre","novembre","novembre","novembre","novembre","novembre","novembre","novembre","novembre","novembre","novembre","novembre","novembre","novembre","novembre","novembre","novembre","décembre","décembre","décembre","décembre","décembre","décembre","décembre","décembre","décembre","décembre","décembre","décembre","décembre","décembre","décembre","décembre","décembre","décembre","décembre","décembre","décembre","décembre","décembre","décembre","décembre","décembre","décembre","décembre","décembre","décembre","décembre","janvier","janvier","janvier","janvier","janvier","janvier","janvier","janvier","janvier","janvier","janvier","janvier",{"$f":"CHOOSE(MONTH(BDU5),\"janvier\",\"février\",\"mars\",\"avril\",\"mai\",\"juin\",\"juillet\",\"aout\",\"septembre\",\"octobre\",\"novembre\",\"décembre\")","v":"janvier"},"janvier","janvier","janvier","janvier","janvier","janvier","janvier","janvier","janvier","janvier","janvier","janvier","janvier","janvier","janvier","janvier","janvier","janvier","février","février","février","février","février","février","février","février","février","février","février","février","février","février","février","février","février","février","février","février","février","février","février","février","février","février","février","février","février","mars","mars","mars","mars","mars","mars","mars","mars","mars","mars","mars","mars","mars","mars","mars","mars",{"$f":"CHOOSE(MONTH(BGG5),\"janvier\",\"février\",\"mars\",\"avril\",\"mai\",\"juin\",\"juillet\",\"aout\",\"septembre\",\"octobre\",\"novembre\",\"décembre\")","v":"mars"},"mars","mars","mars","mars","mars","mars","mars","mars","mars","mars","mars","mars","mars","mars","avril","avril","avril","avril","avril","avril","avril","avril","avril","avril","avril","avril","avril","avril","avril","avril","avril","avril","avril","avril","avril","avril","avril","avril","avril","avril","avril","avril","avril","avril","mai","mai","mai","mai","mai","mai","mai","mai","mai","mai","mai","mai","mai","mai","mai","mai","mai","mai","mai",{"$f":"CHOOSE(MONTH(BIS5),\"janvier\",\"février\",\"mars\",\"avril\",\"mai\",\"juin\",\"juillet\",\"aout\",\"septembre\",\"octobre\",\"novembre\",\"décembre\")","v":"mai"},"mai","mai","mai","mai","mai","mai","mai","mai","mai","mai","mai","juin","juin","juin","juin","juin","juin","juin","juin","juin","juin","juin","juin","juin","juin","juin","juin","juin","juin","juin","juin","juin","juin","juin","juin","juin","juin","juin","juin","juin","juin","juillet","juillet","juillet","juillet","juillet","juillet","juillet","juillet","juillet","juillet","juillet","juillet","juillet","juillet","juillet","juillet","juillet","juillet","juillet","juillet","juillet","juillet",{"$f":"CHOOSE(MONTH(BLE5),\"janvier\",\"février\",\"mars\",\"avril\",\"mai\",\"juin\",\"juillet\",\"aout\",\"septembre\",\"octobre\",\"novembre\",\"décembre\")","v":"juillet"},"juillet","juillet","juillet","juillet","juillet","juillet","juillet","juillet","aout","aout","aout","aout","aout","aout","aout","aout","aout","aout","aout","aout","aout","aout","aout","aout","aout","aout","aout","aout","aout","aout","aout","aout","aout","aout","aout","aout","aout","aout","aout","septembre","septembre","septembre","septembre","septembre","septembre","septembre","septembre","septembre","septembre","septembre","septembre","septembre","septembre","septembre","septembre","septembre","septembre","septembre","septembre","septembre","septembre","septembre","septembre",{"$f":"CHOOSE(MONTH(BNQ5),\"janvier\",\"février\",\"mars\",\"avril\",\"mai\",\"juin\",\"juillet\",\"aout\",\"septembre\",\"octobre\",\"novembre\",\"décembre\")","v":"septembre"},"septembre","septembre","septembre","septembre","septembre","octobre","octobre","octobre","octobre","octobre","octobre","octobre","octobre","octobre","octobre","octobre","octobre","octobre","octobre","octobre","octobre","octobre","octobre","octobre","octobre","octobre","octobre","octobre","octobre","octobre","octobre","octobre","octobre","octobre","octobre","octobre","novembre","novembre","novembre","novembre","novembre","novembre","novembre","novembre","novembre","novembre","novembre","novembre","novembre","novembre","novembre","novembre","novembre","novembre","novembre","novembre","novembre","novembre","novembre","novembre","novembre","novembre","novembre",{"$f":"CHOOSE(MONTH(BQC5),\"janvier\",\"février\",\"mars\",\"avril\",\"mai\",\"juin\",\"juillet\",\"aout\",\"septembre\",\"octobre\",\"novembre\",\"décembre\")","v":"novembre"},"novembre","novembre","décembre","décembre","décembre","décembre","décembre","décembre","décembre","décembre","décembre","décembre","décembre","décembre","décembre","décembre","décembre","décembre","décembre","décembre","décembre","décembre","décembre","décembre","décembre","décembre","décembre","décembre","décembre","décembre","décembre","décembre","décembre","janvier","janvier","janvier","janvier","janvier","janvier","janvier","janvier","janvier","janvier","janvier","janvier","janvier","janvier","janvier","janvier","janvier","janvier","janvier","janvier","janvier","janvier","janvier","janvier","janvier","janvier","janvier","janvier","janvier","janvier",{"$f":"CHOOSE(MONTH(BSO5),\"janvier\",\"février\",\"mars\",\"avril\",\"mai\",\"juin\",\"juillet\",\"aout\",\"septembre\",\"octobre\",\"novembre\",\"décembre\")","v":"janvier"},"février","février","février","février","février","février","février","février","février","février","février","février","février","février","février","février","février","février","février","février","février","février","février","février","février","février","février","février","mars","mars","mars","mars","mars","mars","mars","mars","mars","mars","mars","mars","mars","mars","mars","mars","mars","mars","mars","mars","mars","mars","mars","mars","mars","mars","mars","mars","mars","mars","mars","avril","avril","avril","avril",{"$f":"CHOOSE(MONTH(BVA5),\"janvier\",\"février\",\"mars\",\"avril\",\"mai\",\"juin\",\"juillet\",\"aout\",\"septembre\",\"octobre\",\"novembre\",\"décembre\")","v":"avril"},"avril","avril","avril","avril","avril","avril","avril","avril","avril","avril","avril","avril","avril","avril","avril","avril","avril","avril","avril","avril","avril","avril","avril","avril","avril","mai","mai","mai","mai","mai","mai","mai","mai","mai","mai","mai","mai","mai","mai","mai","mai","mai","mai","mai","mai","mai","mai","mai","mai","mai","mai","mai","mai","mai","mai","mai","juin","juin","juin","juin","juin","juin","juin",{"$f":"CHOOSE(MONTH(BXM5),\"janvier\",\"février\",\"mars\",\"avril\",\"mai\",\"juin\",\"juillet\",\"aout\",\"septembre\",\"octobre\",\"novembre\",\"décembre\")","v":"juin"},"juin","juin","juin","juin","juin","juin","juin","juin","juin","juin","juin","juin","juin","juin","juin","juin","juin","juin","juin","juin","juin","juin","juillet","juillet","juillet","juillet","juillet","juillet","juillet","juillet","juillet","juillet","juillet","juillet","juillet","juillet","juillet","juillet","juillet","juillet","juillet","juillet","juillet","juillet","juillet","juillet","juillet","juillet","juillet","juillet","juillet","juillet","juillet","aout","aout","aout","aout","aout","aout","aout","aout","aout","aout",{"$f":"CHOOSE(MONTH(BZY5),\"janvier\",\"février\",\"mars\",\"avril\",\"mai\",\"juin\",\"juillet\",\"aout\",\"septembre\",\"octobre\",\"novembre\",\"décembre\")","v":"aout"},"aout","aout","aout","aout","aout","aout","aout","aout","aout","aout","aout","aout","aout","aout","aout","aout","aout","aout","aout","aout","septembre","septembre","septembre","septembre","septembre","septembre","septembre","septembre","septembre","septembre","septembre","septembre","septembre","septembre","septembre","septembre","septembre","septembre","septembre","septembre","septembre","septembre","septembre","septembre","septembre","septembre","septembre","septembre","septembre","septembre","octobre","octobre","octobre","octobre","octobre","octobre","octobre","octobre","octobre","octobre","octobre","octobre","octobre",{"$f":"CHOOSE(MONTH(CCK5),\"janvier\",\"février\",\"mars\",\"avril\",\"mai\",\"juin\",\"juillet\",\"aout\",\"septembre\",\"octobre\",\"novembre\",\"décembre\")","v":"octobre"},"octobre","octobre","octobre","octobre","octobre","octobre","octobre","octobre","octobre","octobre","octobre","octobre","octobre","octobre","octobre","octobre","octobre","novembre","novembre","novembre","novembre","novembre","novembre","novembre","novembre","novembre","novembre","novembre","novembre","novembre","novembre","novembre","novembre","novembre","novembre","novembre","novembre","novembre","novembre","novembre","novembre","novembre","novembre","novembre","novembre","novembre","novembre","décembre","décembre","décembre","décembre","décembre","décembre","décembre","décembre","décembre","décembre","décembre","décembre","décembre","décembre","décembre","décembre",{"$f":"CHOOSE(MONTH(CEW5),\"janvier\",\"février\",\"mars\",\"avril\",\"mai\",\"juin\",\"juillet\",\"aout\",\"septembre\",\"octobre\",\"novembre\",\"décembre\")","v":"décembre"},"décembre","décembre","décembre","décembre","décembre","décembre","décembre","décembre","décembre","décembre","décembre","décembre","décembre","décembre","janvier","janvier","janvier","janvier","janvier","janvier","janvier","janvier","janvier","janvier","janvier","janvier","janvier","janvier","janvier","janvier","janvier","janvier","janvier","janvier","janvier","janvier","janvier","janvier","janvier","janvier","janvier","janvier","janvier","janvier","janvier","février","février","février","février","février","février","février","février","février","février","février","février","février","février","février","février","février","février",{"$f":"CHOOSE(MONTH(CHI5),\"janvier\",\"février\",\"mars\",\"avril\",\"mai\",\"juin\",\"juillet\",\"aout\",\"septembre\",\"octobre\",\"novembre\",\"décembre\")","v":"février"},"février","février","février","février","février","février","février","février","février","mars","mars","mars","mars","mars","mars","mars","mars","mars","mars","mars","mars","mars","mars","mars","mars","mars","mars","mars","mars","mars","mars","mars","mars","mars","mars","mars","mars","mars","mars","mars","avril","avril","avril","avril","avril","avril","avril","avril","avril","avril","avril","avril","avril","avril","avril","avril","avril","avril","avril","avril","avril","avril","avril",{"$f":"CHOOSE(MONTH(CJU5),\"janvier\",\"février\",\"mars\",\"avril\",\"mai\",\"juin\",\"juillet\",\"aout\",\"septembre\",\"octobre\",\"novembre\",\"décembre\")","v":"avril"},"avril","avril","avril","avril","avril","avril","mai","mai","mai","mai","mai","mai","mai","mai","mai","mai","mai","mai","mai","mai","mai","mai","mai","mai","mai","mai","mai","mai","mai","mai","mai","mai","mai","mai","mai","mai","mai","juin","juin","juin","juin","juin","juin","juin","juin","juin","juin","juin","juin","juin","juin","juin","juin","juin","juin","juin","juin","juin","juin","juin","juin","juin","juin",{"$f":"CHOOSE(MONTH(CMG5),\"janvier\",\"février\",\"mars\",\"avril\",\"mai\",\"juin\",\"juillet\",\"aout\",\"septembre\",\"octobre\",\"novembre\",\"décembre\")","v":"juin"},"juin","juin","juin","juillet","juillet","juillet","juillet","juillet","juillet","juillet","juillet","juillet","juillet","juillet","juillet","juillet","juillet","juillet","juillet","juillet","juillet","juillet","juillet","juillet","juillet","juillet","juillet","juillet","juillet","juillet","juillet","juillet","juillet","juillet","aout","aout","aout","aout","aout","aout","aout","aout","aout","aout","aout","aout","aout","aout","aout","aout","aout","aout","aout","aout","aout","aout","aout","aout","aout","aout","aout","aout","aout",{"$f":"CHOOSE(MONTH(COS5),\"janvier\",\"février\",\"mars\",\"avril\",\"mai\",\"juin\",\"juillet\",\"aout\",\"septembre\",\"octobre\",\"novembre\",\"décembre\")","v":"aout"},"aout","septembre","septembre","septembre","septembre","septembre","septembre","septembre","septembre","septembre","septembre","septembre","septembre","septembre","septembre","septembre","septembre","septembre","septembre","septembre","septembre","septembre","septembre","septembre","septembre","septembre","septembre","septembre","septembre","septembre","septembre","octobre","octobre","octobre","octobre","octobre","octobre","octobre","octobre","octobre","octobre","octobre","octobre","octobre","octobre","octobre","octobre","octobre","octobre","octobre","octobre","octobre","octobre","octobre","octobre","octobre","octobre","octobre","octobre","octobre","octobre","octobre","novembre",{"$f":"CHOOSE(MONTH(CRE5),\"janvier\",\"février\",\"mars\",\"avril\",\"mai\",\"juin\",\"juillet\",\"aout\",\"septembre\",\"octobre\",\"novembre\",\"décembre\")","v":"novembre"},"novembre","novembre","novembre","novembre","novembre","novembre","novembre","novembre","novembre","novembre","novembre","novembre","novembre","novembre","novembre","novembre","novembre","novembre","novembre","novembre","novembre","novembre","novembre","novembre","novembre","novembre","novembre","novembre","décembre","décembre","décembre","décembre","décembre","décembre","décembre","décembre","décembre","décembre","décembre","décembre","décembre","décembre","décembre","décembre","décembre","décembre","décembre","décembre","décembre","décembre","décembre","décembre","décembre","décembre","décembre","décembre","décembre","décembre","décembre","janvier","janvier","janvier","janvier",{"$f":"CHOOSE(MONTH(CTQ5),\"janvier\",\"février\",\"mars\",\"avril\",\"mai\",\"juin\",\"juillet\",\"aout\",\"septembre\",\"octobre\",\"novembre\",\"décembre\")","v":"janvier"},"janvier","janvier","janvier","janvier","janvier","janvier","janvier","janvier","janvier","janvier","janvier","janvier","janvier","janvier","janvier","janvier","janvier","janvier","janvier","janvier","janvier","janvier","janvier","janvier","janvier","janvier","février","février","février","février","février","février","février","février","février","février","février","février","février","février","février","février","février","février","février","février","février","février","février","février","février","février","février","février","mars","mars","mars","mars","mars","mars","mars","mars","mars",{"$f":"CHOOSE(MONTH(CWC5),\"janvier\",\"février\",\"mars\",\"avril\",\"mai\",\"juin\",\"juillet\",\"aout\",\"septembre\",\"octobre\",\"novembre\",\"décembre\")","v":"mars"},"mars","mars","mars","mars","mars","mars","mars","mars","mars","mars","mars","mars","mars","mars","mars","mars","mars","mars","mars","mars","mars","avril","avril","avril","avril","avril","avril","avril","avril","avril","avril","avril","avril","avril","avril","avril","avril","avril","avril","avril","avril","avril","avril","avril","avril","avril","avril","avril","avril","avril","avril","mai","mai","mai","mai","mai","mai","mai","mai","mai","mai","mai","mai",{"$f":"CHOOSE(MONTH(CYO5),\"janvier\",\"février\",\"mars\",\"avril\",\"mai\",\"juin\",\"juillet\",\"aout\",\"septembre\",\"octobre\",\"novembre\",\"décembre\")","v":"mai"},"mai","mai","mai","mai","mai","mai","mai","mai","mai","mai","mai","mai","mai","mai","mai","mai","mai","mai","juin","juin","juin","juin","juin","juin","juin","juin","juin","juin","juin","juin","juin","juin","juin","juin","juin","juin","juin","juin","juin","juin","juin","juin","juin","juin","juin","juin","juin","juin","juillet","juillet","juillet","juillet","juillet","juillet","juillet","juillet","juillet","juillet","juillet","juillet","juillet","juillet","juillet",{"$f":"CHOOSE(MONTH(DBA5),\"janvier\",\"février\",\"mars\",\"avril\",\"mai\",\"juin\",\"juillet\",\"aout\",\"septembre\",\"octobre\",\"novembre\",\"décembre\")","v":"juillet"},"juillet","juillet","juillet","juillet","juillet","juillet","juillet","juillet","juillet","juillet","juillet","juillet","juillet","juillet","juillet","aout","aout","aout","aout","aout","aout","aout","aout","aout","aout","aout","aout","aout","aout","aout","aout","aout","aout","aout","aout","aout","aout","aout","aout","aout","aout","aout","aout","aout","aout","aout","septembre","septembre","septembre","septembre","septembre","septembre","septembre","septembre","septembre","septembre","septembre","septembre","septembre","septembre","septembre","septembre","septembre",{"$f":"CHOOSE(MONTH(DDM5),\"janvier\",\"février\",\"mars\",\"avril\",\"mai\",\"juin\",\"juillet\",\"aout\",\"septembre\",\"octobre\",\"novembre\",\"décembre\")","v":"septembre"},"septembre","septembre","septembre","septembre","septembre","septembre","septembre","septembre","septembre","septembre","septembre","septembre","octobre","octobre","octobre","octobre","octobre","octobre","octobre","octobre","octobre","octobre","octobre","octobre","octobre","octobre","octobre","octobre","octobre","octobre","octobre","octobre","octobre","octobre","octobre","octobre","octobre","octobre","octobre","octobre","octobre","octobre","octobre","novembre","novembre","novembre","novembre","novembre","novembre","novembre","novembre","novembre","novembre","novembre","novembre","novembre","novembre","novembre","novembre","novembre","novembre","novembre","novembre",{"$f":"CHOOSE(MONTH(DFY5),\"janvier\",\"février\",\"mars\",\"avril\",\"mai\",\"juin\",\"juillet\",\"aout\",\"septembre\",\"octobre\",\"novembre\",\"décembre\")","v":"novembre"},"novembre","novembre","novembre","novembre","novembre","novembre","novembre","novembre","novembre","décembre","décembre","décembre","décembre","décembre","décembre","décembre","décembre","décembre","décembre","décembre","décembre","décembre","décembre","décembre","décembre","décembre","décembre","décembre","décembre","décembre","décembre","décembre","décembre","décembre","décembre","décembre","décembre","décembre","décembre","décembre","janvier","janvier","janvier","janvier","janvier","janvier","janvier","janvier","janvier","janvier","janvier","janvier","janvier","janvier","janvier","janvier","janvier","janvier","janvier","janvier","janvier","janvier","janvier",{"$f":"CHOOSE(MONTH(DIK5),\"janvier\",\"février\",\"mars\",\"avril\",\"mai\",\"juin\",\"juillet\",\"aout\",\"septembre\",\"octobre\",\"novembre\",\"décembre\")","v":"janvier"},"janvier","janvier","janvier","janvier","janvier","janvier","janvier","février","février","février","février","février","février","février","février","février","février","février","février","février","février","février","février","février","février","février","février","février","février","février","février","février","février","février","février","février","mars","mars","mars","mars","mars","mars","mars","mars","mars","mars","mars","mars","mars","mars","mars","mars","mars","mars","mars","mars","mars","mars","mars","mars","mars","mars","mars",{"$f":"CHOOSE(MONTH(DKW5),\"janvier\",\"février\",\"mars\",\"avril\",\"mai\",\"juin\",\"juillet\",\"aout\",\"septembre\",\"octobre\",\"novembre\",\"décembre\")","v":"mars"},"mars","mars","mars","avril","avril","avril","avril","avril","avril","avril","avril","avril","avril","avril","avril","avril","avril","avril","avril","avril","avril","avril","avril","avril","avril","avril","avril","avril","avril","avril","avril","avril","avril","mai","mai","mai","mai","mai","mai","mai","mai","mai","mai","mai","mai","mai","mai","mai","mai","mai","mai","mai","mai","mai","mai","mai","mai","mai","mai","mai","mai","mai","mai",{"$f":"CHOOSE(MONTH(DNI5),\"janvier\",\"février\",\"mars\",\"avril\",\"mai\",\"juin\",\"juillet\",\"aout\",\"septembre\",\"octobre\",\"novembre\",\"décembre\")","v":"mai"},"juin","juin","juin","juin","juin","juin","juin","juin","juin","juin","juin","juin","juin","juin","juin","juin","juin","juin","juin","juin","juin","juin","juin","juin","juin","juin","juin","juin","juin","juin","juillet","juillet","juillet","juillet","juillet","juillet","juillet","juillet","juillet","juillet","juillet","juillet","juillet","juillet","juillet","juillet","juillet","juillet","juillet","juillet","juillet","juillet","juillet","juillet","juillet","juillet","juillet","juillet","juillet","juillet","juillet","aout","aout",{"$f":"CHOOSE(MONTH(DPU5),\"janvier\",\"février\",\"mars\",\"avril\",\"mai\",\"juin\",\"juillet\",\"aout\",\"septembre\",\"octobre\",\"novembre\",\"décembre\")","v":"aout"},"aout","aout","aout","aout","aout","aout","aout","aout","aout","aout","aout","aout","aout","aout","aout","aout","aout","aout","aout","aout","aout","aout","aout","aout","aout","aout","aout","aout","septembre","septembre","septembre","septembre","septembre","septembre","septembre","septembre","septembre","septembre","septembre","septembre","septembre","septembre","septembre","septembre","septembre","septembre","septembre","septembre","septembre","septembre","septembre","septembre","septembre","septembre","septembre","septembre","septembre","septembre","octobre","octobre","octobre","octobre","octobre",{"$f":"CHOOSE(MONTH(DSG5),\"janvier\",\"février\",\"mars\",\"avril\",\"mai\",\"juin\",\"juillet\",\"aout\",\"septembre\",\"octobre\",\"novembre\",\"décembre\")","v":"octobre"},"octobre","octobre","octobre","octobre","octobre","octobre","octobre","octobre","octobre","octobre","octobre","octobre","octobre","octobre","octobre","octobre","octobre","octobre","octobre","octobre","octobre","octobre","octobre","octobre","octobre","novembre","novembre","novembre","novembre","novembre","novembre","novembre","novembre","novembre","novembre","novembre","novembre","novembre","novembre","novembre","novembre","novembre","novembre","novembre","novembre","novembre","novembre","novembre","novembre","novembre","novembre","novembre","novembre","novembre","novembre","décembre","décembre","décembre","décembre","décembre","décembre","décembre","décembre",{"$f":"CHOOSE(MONTH(DUS5),\"janvier\",\"février\",\"mars\",\"avril\",\"mai\",\"juin\",\"juillet\",\"aout\",\"septembre\",\"octobre\",\"novembre\",\"décembre\")","v":"décembre"},"décembre","décembre","décembre","décembre","décembre","décembre","décembre","décembre","décembre","décembre","décembre","décembre","décembre","décembre","décembre","décembre","décembre","décembre","décembre","décembre","décembre","décembre","janvier","janvier","janvier","janvier","janvier","janvier","janvier","janvier","janvier","janvier","janvier","janvier","janvier","janvier","janvier","janvier","janvier","janvier","janvier","janvier","janvier","janvier","janvier","janvier","janvier","janvier","janvier","janvier","janvier","janvier","janvier","février","février","février","février","février","février","février","février","février","février",{"$f":"CHOOSE(MONTH(DXE5),\"janvier\",\"février\",\"mars\",\"avril\",\"mai\",\"juin\",\"juillet\",\"aout\",\"septembre\",\"octobre\",\"novembre\",\"décembre\")","v":"février"},"février","février","février","février","février","février","février","février","février","février","février","février","février","février","février","février","février","mars","mars","mars","mars","mars","mars","mars","mars","mars","mars","mars","mars","mars","mars","mars","mars","mars","mars","mars","mars","mars","mars","mars","mars","mars","mars","mars","mars","mars","mars","mars","avril","avril","avril","avril","avril","avril","avril","avril","avril","avril","avril","avril","avril","avril","avril",{"$f":"CHOOSE(MONTH(DZQ5),\"janvier\",\"février\",\"mars\",\"avril\",\"mai\",\"juin\",\"juillet\",\"aout\",\"septembre\",\"octobre\",\"novembre\",\"décembre\")","v":"avril"},"avril","avril","avril","avril","avril","avril","avril","avril","avril","avril","avril","avril","avril","avril","mai","mai","mai","mai","mai","mai","mai","mai","mai","mai","mai","mai","mai","mai","mai","mai","mai","mai","mai","mai","mai","mai","mai","mai","mai","mai","mai","mai","mai","mai","mai","juin","juin","juin","juin","juin","juin","juin","juin","juin","juin","juin","juin","juin","juin","juin","juin","juin","juin",{"$f":"CHOOSE(MONTH(ECC5),\"janvier\",\"février\",\"mars\",\"avril\",\"mai\",\"juin\",\"juillet\",\"aout\",\"septembre\",\"octobre\",\"novembre\",\"décembre\")","v":"juin"},"juin","juin","juin","juin","juin","juin","juin","juin","juin","juin","juin","juillet","juillet","juillet","juillet","juillet","juillet","juillet","juillet","juillet","juillet","juillet","juillet","juillet","juillet","juillet","juillet","juillet","juillet","juillet","juillet","juillet","juillet","juillet","juillet","juillet","juillet","juillet","juillet","juillet","juillet","juillet","aout","aout","aout","aout","aout","aout","aout","aout","aout","aout","aout","aout","aout","aout","aout","aout","aout","aout","aout","aout","aout",{"$f":"CHOOSE(MONTH(EEO5),\"janvier\",\"février\",\"mars\",\"avril\",\"mai\",\"juin\",\"juillet\",\"aout\",\"septembre\",\"octobre\",\"novembre\",\"décembre\")","v":"aout"},"aout","aout","aout","aout","aout","aout","aout","aout","aout","septembre","septembre","septembre","septembre","septembre","septembre","septembre","septembre","septembre","septembre","septembre","septembre","septembre","septembre","septembre","septembre","septembre","septembre","septembre","septembre","septembre","septembre","septembre","septembre","septembre","septembre","septembre","septembre","septembre","septembre","octobre","octobre","octobre","octobre","octobre","octobre","octobre","octobre","octobre","octobre","octobre","octobre","octobre","octobre","octobre","octobre","octobre","octobre","octobre","octobre","octobre","octobre","octobre","octobre",{"$f":"CHOOSE(MONTH(EHA5),\"janvier\",\"février\",\"mars\",\"avril\",\"mai\",\"juin\",\"juillet\",\"aout\",\"septembre\",\"octobre\",\"novembre\",\"décembre\")","v":"octobre"},"octobre","octobre","octobre","octobre","octobre","octobre","novembre","novembre","novembre","novembre","novembre","novembre","novembre","novembre","novembre","novembre","novembre","novembre","novembre","novembre","novembre","novembre","novembre","novembre","novembre","novembre","novembre","novembre","novembre","novembre","novembre","novembre","novembre","novembre","novembre","novembre","décembre","décembre","décembre","décembre","décembre","décembre","décembre","décembre","décembre","décembre","décembre","décembre","décembre","décembre","décembre","décembre","décembre","décembre","décembre","décembre","décembre","décembre","décembre","décembre","décembre","décembre","décembre",{"$f":"CHOOSE(MONTH(EJM5),\"janvier\",\"février\",\"mars\",\"avril\",\"mai\",\"juin\",\"juillet\",\"aout\",\"septembre\",\"octobre\",\"novembre\",\"décembre\")","v":"décembre"},"décembre","décembre","décembre","janvier","janvier","janvier","janvier","janvier","janvier","janvier","janvier","janvier","janvier","janvier","janvier","janvier","janvier","janvier","janvier","janvier","janvier","janvier","janvier","janvier","janvier","janvier","janvier","janvier","janvier","janvier","janvier","janvier","janvier","janvier","février","février","février","février","février","février","février","février","février","février","février","février","février","février","février","février","février","février","février","février","février","février","février","février","février","février","février","février","mars",{"$f":"CHOOSE(MONTH(ELY5),\"janvier\",\"février\",\"mars\",\"avril\",\"mai\",\"juin\",\"juillet\",\"aout\",\"septembre\",\"octobre\",\"novembre\",\"décembre\")","v":"mars"},"mars","mars","mars","mars","mars","mars","mars","mars","mars","mars","mars","mars","mars","mars","mars","mars","mars","mars","mars","mars","mars","mars","mars","mars","mars","mars","mars","mars","mars","avril","avril","avril","avril","avril"]
[{"$nulls":3},{"$f":"CONCATENATE(\"S\",WEEKNUM(D5,2))","v":"S1"},{"$f":"CONCATENATE(\"S\",WEEKNUM(E5,2))","v":"S1"},"S1","S1","S1","S2","S2","S2","S2","S2","S2","S2","S3","S3","S3","S3","S3","S3","S3","S4","S4","S4","S4","S4","S4","S4","S5","S5","S5","S5","S5","S5","S5","S6","S6","S6","S6","S6","S6","S6","S7","S7","S7","S7","S7","S7","S7","S8","S8","S8","S8","S8","S8","S8","S9","S9","S9","S9","S9","S9","S9","S10","S10","S10","S10",{"$f":"CONCATENATE(\"S\",WEEKNUM(BQ5,2))","v":"S10"},"S10","S10","S11","S11","S11","S11","S11","S11","S11","S12","S12","S12","S12","S12","S12","S12","S13","S13","S13","S13","S13","S13","S13","S14","S14","S14","S14","S14","S14","S14","S15","S15","S15","S15","S15","S15","S15","S16","S16","S16","S16","S16","S16","S16","S17","S17","S17","S17","S17","S17","S17","S18","S18","S18","S18","S18","S18","S18","S19","S19","S19","S19","S19",{"$f":"CONCATENATE(\"S\",WEEKNUM(EC5,2))","v":"S19"},"S19","S20","S20","S20","S20","S20","S20","S20","S21","S21","S21","S21","S21","S21","S21","S22","S22","S22","S22","S22","S22","S22","S23","S23","S23","S23","S23","S23","S23","S24","S24","S24","S24","S24","S24","S24","S25","S25","S25","S25","S25","S25","S25","S26","S26","S26","S26","S26","S26","S26","S27","S27","S27","S27","S27","S27","S27","S28","S28","S28","S28","S28","S28",{"$f":"CONCATENATE(\"S\",WEEKNUM(GO5,2))","v":"S28"},"S29","S29","S29","S29","S29","S29","S29","S30","S30","S30","S30","S30","S30","S30","S31","S31","S31","S31","S31","S31","S31","S32","S32","S32","S32","S32","S32","S32","S33","S33","S33","S33","S33","S33","S33","S34","S34","S34","S34","S34","S34","S34","S35","S35","S35","S35","S35","S35","S35","S36","S36","S36","S36","S36","S36","S36","S37","S37","S37","S37","S37","S37","S37",{"$f":"CONCATENATE(\"S\",WEEKNUM(JA5,2))","v":"S38"},"S38","S38","S38","S38","S38","S38","S39","S39","S39","S39","S39","S39","S39","S40","S40","S40","S40","S40","S40","S40","S41","S41","S41","S41","S41","S41","S41","S42","S42","S42","S42","S42","S42","S42","S43","S43","S43","S43","S43","S43","S43","S44","S44","S44","S44","S44","S44","S44","S45","S45","S45","S45","S45","S45","S45","S46","S46","S46","S46","S46","S46","S46","S47",{"$f":"CONCATENATE(\"S\",WEEKNUM(LM5,2))","v":"S47"},"S47","S47","S47","S47","S47","S48","S48","S48","S48","S48","S48","S48","S49","S49","S49","S49","S49","S49","S49","S50","S50","S50","S50","S50","S50","S50","S51","S51","S51","S51","S51","S51","S51","S52","S52","S52","S52","S52","S52","S52","S53","S53","S53","S53","S1","S1","S1","S2","S2","S2","S2","S2","S2","S2","S3","S3","S3","S3","S3","S3","S3","S4","S4",{"$f":"CONCATENATE(\"S\",WEEKNUM(NY5,2))","v":"S4"},"S4","S4","S4","S4","S5","S5","S5","S5","S5","S5","S5","S6","S6","S6","S6","S6","S6","S6","S7","S7","S7","S7","S7","S7","S7","S8","S8","S8","S8","S8","S8","S8","S9","S9","S9","S9","S9","S9","S9","S10","S10","S10","S10","S10","S10","S10","S11","S11","S11","S11","S11","S11","S11","S12","S12","S12","S12","S12","S12","S12","S13","S13","S13",{"$f":"CONCATENATE(\"S\",WEEKNUM(QK5,2))","v":"S13"},"S13","S13","S13","S14","S14","S14","S14","S14","S14","S14","S15","S15","S15","S15","S15","S15","S15","S16","S16","S16","S16","S16","S16","S16","S17","S17","S17","S17","S17","S17","S17","S18","S18","S18","S18","S18","S18","S18","S19","S19","S19","S19","S19","S19","S19","S20","S20","S20","S20","S20","S20","S20","S21","S21","S21","S21","S21","S21","S21","S22","S22","S22","S22",{"$f":"CONCATENATE(\"S\",WEEKNUM(SW5,2))","v":"S22"},"S22","S22","S23","S23","S23","S23","S23","S23","S23","S24","S24","S24","S24","S24","S24","S24","S25","S25","S25","S25","S25","S25","S25","S26","S26","S26","S26","S26","S26","S26","S27","S27","S27","S27","S27","S27","S27","S28","S28","S28","S28","S28","S28","S28","S29","S29","S29","S29","S29","S29","S29","S30","S30","S30","S30","S30","S30","S30","S31","S31","S31","S31","S31",{"$f":"CONCATENATE(\"S\",WEEKNUM(VI5,2))","v":"S31"},"S31","S32","S32","S32","S32","S32","S32","S32","S33","S33","S33","S33","S33","S33","S33","S34","S34","S34","S34","S34","S34","S34","S35","S35","S35","S35","S35","S35","S35","S36","S36","S36","S36","S36","S36","S36","S37","S37","S37","S37","S37","S37","S37","S38","S38","S38","S38","S38","S38","S38","S39","S39","S39","S39","S39","S39","S39","S40","S40","S40","S40","S40","S40",{"$f":"CONCATENATE(\"S\",WEEKNUM(XU5,2))","v":"S40"},"S41","S41","S41","S41","S41","S41","S41","S42","S42","S42","S42","S42","S42","S42","S43","S43","S43","S43","S43","S43","S43","S44","S44","S44","S44","S44","S44","S44","S45","S45","S45","S45","S45","S45","S45","S46","S46","S46","S46","S46","S46","S46","S47","S47","S47","S47","S47","S47","S47","S48","S48","S48","S48","S48","S48","S48","S49","S49","S49","S49","S49","S49","S49",{"$f":"CONCATENATE(\"S\",WEEKNUM(AAG5,2))","v":"S50"},"S50","S50","S50","S50","S50","S50","S51","S51","S51","S51","S51","S51","S51","S52","S52","S52","S52","S52","S52","S52","S53","S53","S53","S53","S53","S1","S1","S2","S2","S2","S2","S2","S2","S2","S3","S3","S3","S3","S3","S3","S3","S4","S4","S4","S4","S4","S4","S4","S5","S5","S5","S5","S5","S5","S5","S6","S6","S6","S6","S6","S6","S6","S7",{"$f":"CONCATENATE(\"S\",WEEKNUM(ACS5,2))","v":"S7"},"S7","S7","S7","S7","S7","S8","S8","S8","S8","S8","S8","S8","S9","S9","S9","S9","S9","S9","S9","S10","S10","S10","S10","S10","S10","S10","S11","S11","S11","S11","S11","S11","S11","S12","S12","S12","S12","S12","S12","S12","S13","S13","S13","S13","S13","S13","S13","S14","S14","S14","S14","S14","S14","S14","S15","S15","S15","S15","S15","S15","S15","S16","S16",{"$f":"CONCATENATE(\"S\",WEEKNUM(AFE5,2))","v":"S16"},"S16","S16","S16","S16","S17","S17","S17","S17","S17","S17","S17","S18","S18","S18","S18","S18","S18","S18","S19","S19","S19","S19","S19","S19","S19","S20","S20","S20","S20","S20","S20","S20","S21","S21","S21","S21","S21","S21","S21","S22","S22","S22","S22","S22","S22","S22","S23","S23","S23","S23","S23","S23","S23","S24","S24","S24","S24","S24","S24","S24","S25","S25","S25",{"$f":"CONCATENATE(\"S\",WEEKNUM(AHQ5,2))","v":"S25"},"S25","S25","S25","S26","S26","S26","S26","S26","S26","S26","S27","S27","S27","S27","S27","S27","S27","S28","S28","S28","S28","S28","S28","S28","S29","S29","S29","S29","S29","S29","S29","S30","S30","S30","S30","S30","S30","S30","S31","S31","S31","S31","S31","S31","S31","S32","S32","S32","S32","S32","S32","S32","S33","S33","S33","S33","S33","S33","S33","S34","S34","S34","S34",{"$f":"CONCATENATE(\"S\",WEEKNUM(AKC5,2))","v":"S34"},"S34","S34","S35","S35","S35","S35","S35","S35","S35","S36","S36","S36","S36","S36","S36","S36","S37","S37","S37","S37","S37","S37","S37","S38","S38","S38","S38","S38","S38","S38","S39","S39","S39","S39","S39","S39","S39","S40","S40","S40","S40","S40","S40","S40","S41","S41","S41","S41","S41","S41","S41","S42","S42","S42","S42","S42","S42","S42","S43","S43","S43","S43","S43",{"$f":"CONCATENATE(\"S\",WEEKNUM(AMO5,2))","v":"S43"},"S43","S44","S44","S44","S44","S44","S44","S44","S45","S45","S45","S45","S45","S45","S45","S46","S46","S46","S46","S46","S46","S46","S47","S47","S47","S47","S47","S47","S47","S48","S48","S48","S48","S48","S48","S48","S49","S49","S49","S49","S49","S49","S49","S50","S50","S50","S50","S50","S50","S50","S51","S51","S51","S51","S51","S51","S51","S52","S52","S52","S52","S52","S52",{"$f":"CONCATENATE(\"S\",WEEKNUM(APA5,2))","v":"S52"},"S53","S53","S53","S53","S53","S53","S1","S2","S2","S2","S2","S2","S2","S2","S3","S3","S3","S3","S3","S3","S3","S4","S4","S4","S4","S4","S4","S4","S5","S5","S5","S5","S5","S5","S5","S6","S6","S6","S6","S6","S6","S6","S7","S7","S7","S7","S7","S7","S7","S8","S8","S8","S8","S8","S8","S8","S9","S9","S9","S9","S9","S9","S9",{"$f":"CONCATENATE(\"S\",WEEKNUM(ARM5,2))","v":"S10"},"S10","S10","S10","S10","S10","S10","S11","S11","S11","S11","S11","S11","S11","S12","S12","S12","S12","S12","S12","S12","S13","S13","S13","S13","S13","S13","S13","S14","S14","S14","S14","S14","S14","S14","S15","S15","S15","S15","S15","S15","S15","S16","S16","S16","S16","S16","S16","S16","S17","S17","S17","S17","S17","S17","S17","S18","S18","S18","S18","S18","S18","S18","S19",{"$f":"CONCATENATE(\"S\",WEEKNUM(ATY5,2))","v":"S19"},"S19","S19","S19","S19","S19","S20","S20","S20","S20","S20","S20","S20","S21","S21","S21","S21","S21","S21","S21","S22","S22","S22","S22","S22","S22","S22","S23","S23","S23","S23","S23","S23","S23","S24","S24","S24","S24","S24","S24","S24","S25","S25","S25","S25","S25","S25","S25","S26","S26","S26","S26","S26","S26","S26","S27","S27","S27","S27","S27","S27","S27","S28","S28",{"$f":"CONCATENATE(\"S\",WEEKNUM(AWK5,2))","v":"S28"},"S28","S28","S28","S28","S29","S29","S29","S29","S29","S29","S29","S30","S30","S30","S30","S30","S30","S30","S31","S31","S31","S31","S31","S31","S31","S32","S32","S32","S32","S32","S32","S32","S33","S33","S33","S33","S33","S33","S33","S34","S34","S34","S34","S34","S34","S34","S35","S35","S35","S35","S35","S35","S35","S36","S36","S36","S36","S36","S36","S36","S37","S37","S37",{"$f":"CONCATENATE(\"S\",WEEKNUM(AYW5,2))","v":"S37"},"S37","S37","S37","S38","S38","S38","S38","S38","S38","S38","S39","S39","S39","S39","S39","S39","S39","S40","S40","S40","S40","S40","S40","S40","S41","S41","S41","S41","S41","S41","S41","S42","S42","S42","S42","S42","S42","S42","S43","S43","S43","S43","S43","S43","S43","S44","S44","S44","S44","S44","S44","S44","S45","S45","S45","S45","S45","S45","S45","S46","S46","S46","S46",{"$f":"CONCATENATE(\"S\",WEEKNUM(BBI5,2))","v":"S46"},"S46","S46","S47","S47","S47","S47","S47","S47","S47","S48","S48","S48","S48","S48","S48","S48","S49","S49","S49","S49","S49","S49","S49","S50","S50","S50","S50","S50","S50","S50","S51","S51","S51","S51","S51","S51","S51","S52","S52","S52","S52","S52","S52","S52","S53","S53","S53","S53","S53","S53","S53","S1","S1","S1","S1","S1","S1","S1","S2","S2","S2","S2","S2",{"$f":"CONCATENATE(\"S\",WEEKNUM(BDU5,2))","v":"S2"},"S2","S3","S3","S3","S3","S3","S3","S3","S4","S4","S4","S4","S4","S4","S4","S5","S5","S5","S5","S5","S5","S5","S6","S6","S6","S6","S6","S6","S6","S7","S7","S7","S7","S7","S7","S7","S8","S8","S8","S8","S8","S8","S8","S9","S9","S9","S9","S9","S9","S9","S10","S10","S10","S10","S10","S10","S10","S11","S11","S11","S11","S11","S11",{"$f":"CONCATENATE(\"S\",WEEKNUM(BGG5,2))","v":"S11"},"S12","S12","S12","S12","S12","S12","S12","S13","S13","S13","S13","S13","S13","S13","S14","S14","S14","S14","S14","S14","S14","S15","S15","S15","S15","S15","S15","S15","S16","S16","S16","S16","S16","S16","S16","S17","S17","S17","S17","S17","S17","S17","S18","S18","S18","S18","S18","S18","S18","S19","S19","S19","S19","S19","S19","S19","S20","S20","S20","S20","S20","S20","S20",{"$f":"CONCATENATE(\"S\",WEEKNUM(BIS5,2))","v":"S21"},"S21","S21","S21","S21","S21","S21","S22","S22","S22","S22","S22","S22","S22","S23","S23","S23","S23","S23","S23","S23","S24","S24","S24","S24","S24","S24","S24","S25","S25","S25","S25","S25","S25","S25","S26","S26","S26","S26","S26","S26","S26","S27","S27","S27","S27","S27","S27","S27","S28","S28","S28","S28","S28","S28","S28","S29","S29","S29","S29","S29","S29","S29","S30",{"$f":"CONCATENATE(\"S\",WEEKNUM(BLE5,2))","v":"S30"},"S30","S30","S30","S30","S30","S31","S31","S31","S31","S31","S31","S31","S32","S32","S32","S32","S32","S32","S32","S33","S33","S33","S33","S33","S33","S33","S34","S34","S34","S34","S34","S34","S34","S35","S35","S35","S35","S35","S35","S35","S36","S36","S36","S36","S36","S36","S36","S37","S37","S37","S37","S37","S37","S37","S38","S38","S38","S38","S38","S38","S38","S39","S39",{"$f":"CONCATENATE(\"S\",WEEKNUM(BNQ5,2))","v":"S39"},"S39","S39","S39","S39","S40","S40","S40","S40","S40","S40","S40","S41","S41","S41","S41","S41","S41","S41","S42","S42","S42","S42","S42","S42","S42","S43","S43","S43","S43","S43","S43","S43","S44","S44","S44","S44","S44","S44","S44","S45","S45","S45","S45","S45","S45","S45","S46","S46","S46","S46","S46","S46","S46","S47","S47","S47","S47","S47","S47","S47","S48","S48","S48",{"$f":"CONCATENATE(\"S\",WEEKNUM(BQC5,2))","v":"S48"},"S48","S48","S48","S49","S49","S49","S49","S49","S49","S49","S50","S50","S50","S50","S50","S50","S50","S51","S51","S51","S51","S51","S51","S51","S52","S52","S52","S52","S52","S52","S52","S53","S53","S1","S1","S1","S1","S1","S2","S2","S2","S2","S2","S2","S2","S3","S3","S3","S3","S3","S3","S3","S4","S4","S4","S4","S4","S4","S4","S5","S5","S5","S5",{"$f":"CONCATENATE(\"S\",WEEKNUM(BSO5,2))","v":"S5"},"S5","S5","S6","S6","S6","S6","S6","S6","S6","S7","S7","S7","S7","S7","S7","S7","S8","S8","S8","S8","S8","S8","S8","S9","S9","S9","S9","S9","S9","S9","S10","S10","S10","S10","S10","S10","S10","S11","S11","S11","S11","S11","S11","S11","S12","S12","S12","S12","S12","S12","S12","S13","S13","S13","S13","S13","S13","S13","S14","S14","S14","S14","S14",{"$f":"CONCATENATE(\"S\",WEEKNUM(BVA5,2))","v":"S14"},"S14","S15","S15","S15","S15","S15","S15","S15","S16","S16","S16","S16","S16","S16","S16","S17","S17","S17","S17","S17","S17","S17","S18","S18","S18","S18","S18","S18","S18","S19","S19","S19","S19","S19","S19","S19","S20","S20","S20","S20","S20","S20","S20","S21","S21","S21","S21","S21","S21","S21","S22","S22","S22","S22","S22","S22","S22","S23","S23","S23","S23","S23","S23",{"$f":"CONCATENATE(\"S\",WEEKNUM(BXM5,2))","v":"S23"},"S24","S24","S24","S24","S24","S24","S24","S25","S25","S25","S25","S25","S25","S25","S26","S26","S26","S26","S26","S26","S26","S27","S27","S27","S27","S27","S27","S27","S28","S28","S28","S28","S28","S28","S28","S29","S29","S29","S29","S29","S29","S29","S30","S30","S30","S30","S30","S30","S30","S31","S31","S31","S31","S31","S31","S31","S32","S32","S32","S32","S32","S32","S32",{"$f":"CONCATENATE(\"S\",WEEKNUM(BZY5,2))","v":"S33"},"S33","S33","S33","S33","S33","S33","S34","S34","S34","S34","S34","S34","S34","S35","S35","S35","S35","S35","S35","S35","S36","S36","S36","S36","S36","S36","S36","S37","S37","S37","S37","S37","S37","S37","S38","S38","S38","S38","S38","S38","S38","S39","S39","S39","S39","S39","S39","S39","S40","S40","S40","S40","S40","S40","S40","S41","S41","S41","S41","S41","S41","S41","S42",{"$f":"CONCATENATE(\"S\",WEEKNUM(CCK5,2))","v":"S42"},"S42","S42","S42","S42","S42","S43","S43","S43","S43","S43","S43","S43","S44","S44","S44","S44","S44","S44","S44","S45","S45","S45","S45","S45","S45","S45","S46","S46","S46","S46","S46","S46","S46","S47","S47","S47","S47","S47","S47","S47","S48","S48","S48","S48","S48","S48","S48","S49","S49","S49","S49","S49","S49","S49","S50","S50","S50","S50","S50","S50","S50","S51","S51",{"$f":"CONCATENATE(\"S\",WEEKNUM(CEW5,2))","v":"S51"},"S51","S51","S51","S51","S52","S52","S52","S52","S52","S52","S52","S53","S53","S53","S1","S1","S1","S1","S2","S2","S2","S2","S2","S2","S2","S3","S3","S3","S3","S3","S3","S3","S4","S4","S4","S4","S4","S4","S4","S5","S5","S5","S5","S5","S5","S5","S6","S6","S6","S6","S6","S6","S6","S7","S7","S7","S7","S7","S7","S7","S8","S8","S8",{"$f":"CONCATENATE(\"S\",WEEKNUM(CHI5,2))","v":"S8"},"S8","S8","S8","S9","S9","S9","S9","S9","S9","S9","S10","S10","S10","S10","S10","S10","S10","S11","S11","S11","S11","S11","S11","S11","S12","S12","S12","S12","S12","S12","S12","S13","S13","S13","S13","S13","S13","S13","S14","S14","S14","S14","S14","S14","S14","S15","S15","S15","S15","S15","S15","S15","S16","S16","S16","S16","S16","S16","S16","S17","S17","S17","S17",{"$f":"CONCATENATE(\"S\",WEEKNUM(CJU5,2))","v":"S17"},"S17","S17","S18","S18","S18","S18","S18","S18","S18","S19","S19","S19","S19","S19","S19","S19","S20","S20","S20","S20","S20","S20","S20","S21","S21","S21","S21","S21","S21","S21","S22","S22","S22","S22","S22","S22","S22","S23","S23","S23","S23","S23","S23","S23","S24","S24","S24","S24","S24","S24","S24","S25","S25","S25","S25","S25","S25","S25","S26","S26","S26","S26","S26",{"$f":"CONCATENATE(\"S\",WEEKNUM(CMG5,2))","v":"S26"},"S26","S27","S27","S27","S27","S27","S27","S27","S28","S28","S28","S28","S28","S28","S28","S29","S29","S29","S29","S29","S29","S29","S30","S30","S30","S30","S30","S30","S30","S31","S31","S31","S31","S31","S31","S31","S32","S32","S32","S32","S32","S32","S32","S33","S33","S33","S33","S33","S33","S33","S34","S34","S34","S34","S34","S34","S34","S35","S35","S35","S35","S35","S35",{"$f":"CONCATENATE(\"S\",WEEKNUM(COS5,2))","v":"S35"},"S36","S36","S36","S36","S36","S36","S36","S37","S37","S37","S37","S37","S37","S37","S38","S38","S38","S38","S38","S38","S38","S39","S39","S39","S39","S39","S39","S39","S40","S40","S40","S40","S40","S40","S40","S41","S41","S41","S41","S41","S41","S41","S42","S42","S42","S42","S42","S42","S42","S43","S43","S43","S43","S43","S43","S43","S44","S44","S44","S44","S44","S44","S44",{"$f":"CONCATENATE(\"S\",WEEKNUM(CRE5,2))","v":"S45"},"S45","S45","S45","S45","S45","S45","S46","S46","S46","S46","S46","S46","S46","S47","S47","S47","S47","S47","S47","S47","S48","S48","S48","S48","S48","S48","S48","S49","S49","S49","S49","S49","S49","S49","S50","S50","S50","S50","S50","S50","S50","S51","S51","S51","S51","S51","S51","S51","S52","S52","S52","S52","S52","S52","S52","S53","S53","S53","S53","S1","S1","S1","S2",{"$f":"CONCATENATE(\"S\",WEEKNUM(CTQ5,2))","v":"S2"},"S2","S2","S2","S2","S2","S3","S3","S3","S3","S3","S3","S3","S4","S4","S4","S4","S4","S4","S4","S5","S5","S5","S5","S5","S5","S5","S6","S6","S6","S6","S6","S6","S6","S7","S7","S7","S7","S7","S7","S7","S8","S8","S8","S8","S8","S8","S8","S9","S9","S9","S9","S9","S9","S9","S10","S10","S10","S10","S10","S10","S10","S11","S11",{"$f":"CONCATENATE(\"S\",WEEKNUM(CWC5,2))","v":"S11"},"S11","S11","S11","S11","S12","S12","S12","S12","S12","S12","S12","S13","S13","S13","S13","S13","S13","S13","S14","S14","S14","S14","S14","S14","S14","S15","S15","S15","S15","S15","S15","S15","S16","S16","S16","S16","S16","S16","S16","S17","S17","S17","S17","S17","S17","S17","S18","S18","S18","S18","S18","S18","S18","S19","S19","S19","S19","S19","S19","S19","S20","S20","S20",{"$f":"CONCATENATE(\"S\",WEEKNUM(CYO5,2))","v":"S20"},"S20","S20","S20","S21","S21","S21","S21","S21","S21","S21","S22","S22","S22","S22","S22","S22","S22","S23","S23","S23","S23","S23","S23","S23","S24","S24","S24","S24","S24","S24","S24","S25","S25","S25","S25","S25","S25","S25","S26","S26","S26","S26","S26","S26","S26","S27","S27","S27","S27","S27","S27","S27","S28","S28","S28","S28","S28","S28","S28","S29","S29","S29","S29",{"$f":"CONCATENATE(\"S\",WEEKNUM(DBA5,2))","v":"S29"},"S29","S29","S30","S30","S30","S30","S30","S30","S30","S31","S31","S31","S31","S31","S31","S31","S32","S32","S32","S32","S32","S32","S32","S33","S33","S33","S33","S33","S33","S33","S34","S34","S34","S34","S34","S34","S34","S35","S35","S35","S35","S35","S35","S35","S36","S36","S36","S36","S36","S36","S36","S37","S37","S37","S37","S37","S37","S37","S38","S38","S38","S38","S38",{"$f":"CONCATENATE(\"S\",WEEKNUM(DDM5,2))","v":"S38"},"S38","S39","S39","S39","S39","S39","S39","S39","S40","S40","S40","S40","S40","S40","S40","S41","S41","S41","S41","S41","S41","S41","S42","S42","S42","S42","S42","S42","S42","S43","S43","S43","S43","S43","S43","S43","S44","S44","S44","S44","S44","S44","S44","S45","S45","S45","S45","S45","S45","S45","S46","S46","S46","S46","S46","S46","S46","S47","S47","S47","S47","S47","S47",{"$f":"CONCATENATE(\"S\",WEEKNUM(DFY5,2))","v":"S47"},"S48","S48","S48","S48","S48","S48","S48","S49","S49","S49","S49","S49","S49","S49","S50","S50","S50","S50","S50","S50","S50","S51","S51","S51","S51","S51","S51","S51","S52","S52","S52","S52","S52","S52","S52","S53","S53","S53","S53","S53","S1","S1","S2","S2","S2","S2","S2","S2","S2","S3","S3","S3","S3","S3","S3","S3","S4","S4","S4","S4","S4","S4","S4",{"$f":"CONCATENATE(\"S\",WEEKNUM(DIK5,2))","v":"S5"},"S5","S5","S5","S5","S5","S5","S6","S6","S6","S6","S6","S6","S6","S7","S7","S7","S7","S7","S7","S7","S8","S8","S8","S8","S8","S8","S8","S9","S9","S9","S9","S9","S9","S9","S10","S10","S10","S10","S10","S10","S10","S11","S11","S11","S11","S11","S11","S11","S12","S12","S12","S12","S12","S12","S12","S13","S13","S13","S13","S13","S13","S13","S14",{"$f":"CONCATENATE(\"S\",WEEKNUM(DKW5,2))","v":"S14"},"S14","S14","S14","S14","S14","S15","S15","S15","S15","S15","S15","S15","S16","S16","S16","S16","S16","S16","S16","S17","S17","S17","S17","S17","S17","S17","S18","S18","S18","S18","S18","S18","S18","S19","S19","S19","S19","S19","S19","S19","S20","S20","S20","S20","S20","S20","S20","S21","S21","S21","S21","S21","S21","S21","S22","S22","S22","S22","S22","S22","S22","S23","S23",{"$f":"CONCATENATE(\"S\",WEEKNUM(DNI5,2))","v":"S23"},"S23","S23","S23","S23","S24","S24","S24","S24","S24","S24","S24","S25","S25","S25","S25","S25","S25","S25","S26","S26","S26","S26","S26","S26","S26","S27","S27","S27","S27","S27","S27","S27","S28","S28","S28","S28","S28","S28","S28","S29","S29","S29","S29","S29","S29","S29","S30","S30","S30","S30","S30","S30","S30","S31","S31","S31","S31","S31","S31","S31","S32","S32","S32",{"$f":"CONCATENATE(\"S\",WEEKNUM(DPU5,2))","v":"S32"},"S32","S32","S32","S33","S33","S33","S33","S33","S33","S33","S34","S34","S34","S34","S34","S34","S34","S35","S35","S35","S35","S35","S35","S35","S36","S36","S36","S36","S36","S36","S36","S37","S37","S37","S37","S37","S37","S37","S38","S38","S38","S38","S38","S38","S38","S39","S39","S39","S39","S39","S39","S39","S40","S40","S40","S40","S40","S40","S40","S41","S41","S41","S41",{"$f":"CONCATENATE(\"S\",WEEKNUM(DSG5,2))","v":"S41"},"S41","S41","S42","S42","S42","S42","S42","S42","S42","S43","S43","S43","S43","S43","S43","S43","S44","S44","S44","S44","S44","S44","S44","S45","S45","S45","S45","S45","S45","S45","S46","S46","S46","S46","S46","S46","S46","S47","S47","S47","S47","S47","S47","S47","S48","S48","S48","S48","S48","S48","S48","S49","S49","S49","S49","S49","S49","S49","S50","S50","S50","S50","S50",{"$f":"CONCATENATE(\"S\",WEEKNUM(DUS5,2))","v":"S50"},"S50","S51","S51","S51","S51","S51","S51","S51","S52","S52","S52","S52","S52","S52","S52","S53","S53","S53","S53","S53","S53","S53","S1","S1","S1","S1","S1","S1","S1","S2","S2","S2","S2","S2","S2","S2","S3","S3","S3","S3","S3","S3","S3","S4","S4","S4","S4","S4","S4","S4","S5","S5","S5","S5","S5","S5","S5","S6","S6","S6","S6","S6","S6",{"$f":"CONCATENATE(\"S\",WEEKNUM(DXE5,2))","v":"S6"},"S7","S7","S7","S7","S7","S7","S7","S8","S8","S8","S8","S8","S8","S8","S9","S9","S9","S9","S9","S9","S9","S10","S10","S10","S10","S10","S10","S10","S11","S11","S11","S11","S11","S11","S11","S12","S12","S12","S12","S12","S12","S12","S13","S13","S13","S13","S13","S13","S13","S14","S14","S14","S14","S14","S14","S14","S15","S15","S15","S15","S15","S15","S15",{"$f":"CONCATENATE(\"S\",WEEKNUM(DZQ5,2))","v":"S16"},"S16","S16","S16","S16","S16","S16","S17","S17","S17","S17","S17","S17","S17","S18","S18","S18","S18","S18","S18","S18","S19","S19","S19","S19","S19","S19","S19","S20","S20","S20","S20","S20","S20","S20","S21","S21","S21","S21","S21","S21","S21","S22","S22","S22","S22","S22","S22","S22","S23","S23","S23","S23","S23","S23","S23","S24","S24","S24","S24","S24","S24","S24","S25",{"$f":"CONCATENATE(\"S\",WEEKNUM(ECC5,2))","v":"S25"},"S25","S25","S25","S25","S25","S26","S26","S26","S26","S26","S26","S26","S27","S27","S27","S27","S27","S27","S27","S28","S28","S28","S28","S28","S28","S28","S29","S29","S29","S29","S29","S29","S29","S30","S30","S30","S30","S30","S30","S30","S31","S31","S31","S31","S31","S31","S31","S32","S32","S32","S32","S32","S32","S32","S33","S33","S33","S33","S33","S33","S33","S34","S34",{"$f":"CONCATENATE(\"S\",WEEKNUM(EEO5,2))","v":"S34"},"S34","S34","S34","S34","S35","S35","S35","S35","S35","S35","S35","S36","S36","S36","S36","S36","S36","S36","S37","S37","S37","S37","S37","S37","S37","S38","S38","S38","S38","S38","S38","S38","S39","S39","S39","S39","S39","S39","S39","S40","S40","S40","S40","S40","S40","S40","S41","S41","S41","S41","S41","S41","S41","S42","S42","S42","S42","S42","S42","S42","S43","S43","S43",{"$f":"CONCATENATE(\"S\",WEEKNUM(EHA5,2))","v":"S43"},"S43","S43","S43","S44","S44","S44","S44","S44","S44","S44","S45","S45","S45","S45","S45","S45","S45","S46","S46","S46","S46","S46","S46","S46","S47","S47","S47","S47","S47","S47","S47","S48","S48","S48","S48","S48","S48","S48","S49","S49","S49","S49","S49","S49","S49","S50","S50","S50","S50","S50","S50","S50","S51","S51","S51","S51","S51","S51","S51","S52","S52","S52","S52",{"$f":"CONCATENATE(\"S\",WEEKNUM(EJM5,2))","v":"S52"},"S52","S52","S53","S1","S1","S1","S1","S1","S1","S2","S2","S2","S2","S2","S2","S2","S3","S3","S3","S3","S3","S3","S3","S4","S4","S4","S4","S4","S4","S4","S5","S5","S5","S5","S5","S5","S5","S6","S6","S6","S6","S6","S6","S6","S7","S7","S7","S7","S7","S7","S7","S8","S8","S8","S8","S8","S8","S8","S9","S9","S9","S9","S9",{"$f":"CONCATENATE(\"S\",WEEKNUM(ELY5,2))","v":"S9"},"S9","S10","S10","S10","S10","S10","S10","S10","S11","S11","S11","S11","S11","S11","S11","S12","S12","S12","S12","S12","S12","S12","S13","S13","S13","S13","S13","S13","S13","S14","S14","S14","S14","S14"]
[{"$nulls":3},{"$f":"DAY(D5)","v":1},{"$f":"DAY(E5)","v":2},3,4,5,6,7,8,9,10,11,12,13,14,15,16,17,18,19,20,21,22,23,24,25,26,27,28,29,30,31,1,2,3,4,5,6,7,8,9,10,11,12,13,14,15,16,17,18,19,20,21,22,23,24,25,26,27,28,29,1,2,3,4,5,{"$f":"DAY(BQ5)","v":6},7,8,9,10,11,12,13,14,15,16,17,18,19,20,21,22,23,24,25,26,27,28,29,30,31,1,2,3,4,5,6,7,8,9,10,11,12,13,14,15,16,17,18,19,20,21,22,23,24,25,26,27,28,29,30,1,2,3,4,5,6,7,8,{"$f":"DAY(EC5)","v":9},10,11,12,13,14,15,16,17,18,19,20,21,22,23,24,25,26,27,28,29,30,31,1,2,3,4,5,6,7,8,9,10,11,12,13,14,15,16,17,18,19,20,21,22,23,24,25,26,27,28,29,30,1,2,3,4,5,6,7,8,9,10,11,{"$f":"DAY(GO5)","v":12},13,14,15,16,17,18,19,20,21,22,23,24,25,26,27,28,29,30,31,1,2,3,4,5,6,7,8,9,10,11,12,13,14,15,16,17,18,19,20,21,22,23,24,25,26,27,28,29,30,31,1,2,3,4,5,6,7,8,9,10,11,12,13,{"$f":"DAY(JA5)","v":14},15,16,17,18,19,20,21,22,23,24,25,26,27,28,29,30,1,2,3,4,5,6,7,8,9,10,11,12,13,14,15,16,17,18,19,20,21,22,23,24,25,26,27,28,29,30,31,1,2,3,4,5,6,7,8,9,10,11,12,13,14,15,16,{"$f":"DAY(LM5)","v":17},18,19,20,21,22,23,24,25,26,27,28,29,30,1,2,3,4,5,6,7,8,9,10,11,12,13,14,15,16,17,18,19,20,21,22,23,24,25,26,27,28,29,30,31,1,2,3,4,5,6,7,8,9,10,11,12,13,14,15,16,17,18,19,{"$f":"DAY(NY5)","v":20},21,22,23,24,25,26,27,28,29,30,31,1,2,3,4,5,6,7,8,9,10,11,12,13,14,15,16,17,18,19,20,21,22,23,24,25,26,27,28,1,2,3,4,5,6,7,8,9,10,11,12,13,14,15,16,17,18,19,20,21,22,23,24,{"$f":"DAY(QK5)","v":25},26,27,28,29,30,31,1,2,3,4,5,6,7,8,9,10,11,12,13,14,15,16,17,18,19,20,21,22,23,24,25,26,27,28,29,30,1,2,3,4,5,6,7,8,9,10,11,12,13,14,15,16,17,18,19,20,21,22,23,24,25,26,27,{"$f":"DAY(SW5)","v":28},29,30,31,1,2,3,4,5,6,7,8,9,10,11,12,13,14,15,16,17,18,19,20,21,22,23,24,25,26,27,28,29,30,1,2,3,4,5,6,7,8,9,10,11,12,13,14,15,16,17,18,19,20,21,22,23,24,25,26,27,28,29,30,{"$f":"DAY(VI5)","v":31},1,2,3,4,5,6,7,8,9,10,11,12,13,14,15,16,17,18,19,20,21,22,23,24,25,26,27,28,29,30,31,1,2,3,4,5,6,7,8,9,10,11,12,13,14,15,16,17,18,19,20,21,22,23,24,25,26,27,28,29,30,1,2,{"$f":"DAY(XU5)","v":3},4,5,6,7,8,9,10,11,12,13,14,15,16,17,18,19,20,21,22,23,24,25,26,27,28,29,30,31,1,2,3,4,5,6,7,8,9,10,11,12,13,14,15,16,17,18,19,20,21,22,23,24,25,26,27,28,29,30,1,2,3,4,5,{"$f":"DAY(AAG5)","v":6},7,8,9,10,11,12,13,14,15,16,17,18,19,20,21,22,23,24,25,26,27,28,29,30,31,1,2,3,4,5,6,7,8,9,10,11,12,13,14,15,16,17,18,19,20,21,22,23,24,25,26,27,28,29,30,31,1,2,3,4,5,6,7,{"$f":"DAY(ACS5)","v":8},9,10,11,12,13,14,15,16,17,18,19,20,21,22,23,24,25,26,27,28,1,2,3,4,5,6,7,8,9,10,11,12,13,14,15,16,17,18,19,20,21,22,23,24,25,26,27,28,29,30,31,1,2,3,4,5,6,7,8,9,10,11,12,{"$f":"DAY(AFE5)","v":13},14,15,16,17,18,19,20,21,22,23,24,25,26,27,28,29,30,1,2,3,4,5,6,7,8,9,10,11,12,13,14,15,16,17,18,19,20,21,22,23,24,25,26,27,28,29,30,31,1,2,3,4,5,6,7,8,9,10,11,12,13,14,15,{"$f":"DAY(AHQ5)","v":16},17,18,19,20,21,22,23,24,25,26,27,28,29,30,1,2,3,4,5,6,7,8,9,10,11,12,13,14,15,16,17,18,19,20,21,22,23,24,25,26,27,28,29,30,31,1,2,3,4,5,6,7,8,9,10,11,12,13,14,15,16,17,18,{"$f":"DAY(AKC5)","v":19},20,21,22,23,24,25,26,27,28,29,30,31,1,2,3,4,5,6,7,8,9,10,11,12,13,14,15,16,17,18,19,20,21,22,23,24,25,26,27,28,29,30,1,2,3,4,5,6,7,8,9,10,11,12,13,14,15,16,17,18,19,20,21,{"$f":"DAY(AMO5)","v":22},23,24,25,26,27,28,29,30,31,1,2,3,4,5,6,7,8,9,10,11,12,13,14,15,16,17,18,19,20,21,22,23,24,25,26,27,28,29,30,1,2,3,4,5,6,7,8,9,10,11,12,13,14,15,16,17,18,19,20,21,22,23,24,{"$f":"DAY(APA5)","v":25},26,27,28,29,30,31,1,2,3,4,5,6,7,8,9,10,11,12,13,14,15,16,17,18,19,20,21,22,23,24,25,26,27,28,29,30,31,1,2,3,4,5,6,7,8,9,10,11,12,13,14,15,16,17,18,19,20,21,22,23,24,25,26,{"$f":"DAY(ARM5)","v":27},28,1,2,3,4,5,6,7,8,9,10,11,12,13,14,15,16,17,18,19,20,21,22,23,24,25,26,27,28,29,30,31,1,2,3,4,5,6,7,8,9,10,11,12,13,14,15,16,17,18,19,20,21,22,23,24,25,26,27,28,29,30,1,{"$f":"DAY(ATY5)","v":2},3,4,5,6,7,8,9,10,11,12,13,14,15,16,17,18,19,20,21,22,23,24,25,26,27,28,29,30,31,1,2,3,4,5,6,7,8,9,10,11,12,13,14,15,16,17,18,19,20,21,22,23,24,25,26,27,28,29,30,1,2,3,4,{"$f":"DAY(AWK5)","v":5},6,7,8,9,10,11,12,13,14,15,16,17,18,19,20,21,22,23,24,25,26,27,28,29,30,31,1,2,3,4,5,6,7,8,9,10,11,12,13,14,15,16,17,18,19,20,21,22,23,24,25,26,27,28,29,30,31,1,2,3,4,5,6,{"$f":"DAY(AYW5)","v":7},8,9,10,11,12,13,14,15,16,17,18,19,20,21,22,23,24,25,26,27,28,29,30,1,2,3,4,5,6,7,8,9,10,11,12,13,14,15,16,17,18,19,20,21,22,23,24,25,26,27,28,29,30,31,1,2,3,4,5,6,7,8,9,{"$f":"DAY(BBI5)","v":10},11,12,13,14,15,16,17,18,19,20,21,22,23,24,25,26,27,28,29,30,1,2,3,4,5,6,7,8,9,10,11,12,13,14,15,16,17,18,19,20,21,22,23,24,25,26,27,28,29,30,31,1,2,3,4,5,6,7,8,9,10,11,12,{"$f":"DAY(BDU5)","v":13},14,15,16,17,18,19,20,21,22,23,24,25,26,27,28,29,30,31,1,2,3,4,5,6,7,8,9,10,11,12,13,14,15,16,17,18,19,20,21,22,23,24,25,26,27,28,29,1,2,3,4,5,6,7,8,9,10,11,12,13,14,15,16,{"$f":"DAY(BGG5)","v":17},18,19,20,21,22,23,24,25,26,27,28,29,30,31,1,2,3,4,5,6,7,8,9,10,11,12,13,14,15,16,17,18,19,20,21,22,23,24,25,26,27,28,29,30,1,2,3,4,5,6,7,8,9,10,11,12,13,14,15,16,17,18,19,{"$f":"DAY(BIS5)","v":20},21,22,23,24,25,26,27,28,29,30,31,1,2,3,4,5,6,7,8,9,10,11,12,13,14,15,16,17,18,19,20,21,22,23,24,25,26,27,28,29,30,1,2,3,4,5,6,7,8,9,10,11,12,13,14,15,16,17,18,19,20,21,22,{"$f":"DAY(BLE5)","v":23},24,25,26,27,28,29,30,31,1,2,3,4,5,6,7,8,9,10,11,12,13,14,15,16,17,18,19,20,21,22,23,24,25,26,27,28,29,30,31,1,2,3,4,5,6,7,8,9,10,11,12,13,14,15,16,17,18,19,20,21,22,23,24,{"$f":"DAY(BNQ5)","v":25},26,27,28,29,30,1,2,3,4,5,6,7,8,9,10,11,12,13,14,15,16,17,18,19,20,21,22,23,24,25,26,27,28,29,30,31,1,2,3,4,5,6,7,8,9,10,11,12,13,14,15,16,17,18,19,20,21,22,23,24,25,26,27,{"$f":"DAY(BQC5)","v":28},29,30,1,2,3,4,5,6,7,8,9,10,11,12,13,14,15,16,17,18,19,20,21,22,23,24,25,26,27,28,29,30,31,1,2,3,4,5,6,7,8,9,10,11,12,13,14,15,16,17,18,19,20,21,22,23,24,25,26,27,28,29,30,{"$f":"DAY(BSO5)","v":31},1,2,3,4,5,6,7,8,9,10,11,12,13,14,15,16,17,18,19,20,21,22,23,24,25,26,27,28,1,2,3,4,5,6,7,8,9,10,11,12,13,14,15,16,17,18,19,20,21,22,23,24,25,26,27,28,29,30,31,1,2,3,4,{"$f":"DAY(BVA5)","v":5},6,7,8,9,10,11,12,13,14,15,16,17,18,19,20,21,22,23,24,25,26,27,28,29,30,1,2,3,4,5,6,7,8,9,10,11,12,13,14,15,16,17,18,19,20,21,22,23,24,25,26,27,28,29,30,31,1,2,3,4,5,6,7,{"$f":"DAY(BXM5)","v":8},9,10,11,12,13,14,15,16,17,18,19,20,21,22,23,24,25,26,27,28,29,30,1,2,3,4,5,6,7,8,9,10,11,12,13,14,15,16,17,18,19,20,21,22,23,24,25,26,27,28,29,30,31,1,2,3,4,5,6,7,8,9,10,{"$f":"DAY(BZY5)","v":11},12,13,14,15,16,17,18,19,20,21,22,23,24,25,26,27,28,29,30,31,1,2,3,4,5,6,7,8,9,10,11,12,13,14,15,16,17,18,19,20,21,22,23,24,25,26,27,28,29,30,1,2,3,4,5,6,7,8,9,10,11,12,13,{"$f":"DAY(CCK5)","v":14},15,16,17,18,19,20,21,22,23,24,25,26,27,28,29,30,31,1,2,3,4,5,6,7,8,9,10,11,12,13,14,15,16,17,18,19,20,21,22,23,24,25,26,27,28,29,30,1,2,3,4,5,6,7,8,9,10,11,12,13,14,15,16,{"$f":"DAY(CEW5)","v":17},18,19,20,21,22,23,24,25,26,27,28,29,30,31,1,2,3,4,5,6,7,8,9,10,11,12,13,14,15,16,17,18,19,20,21,22,23,24,25,26,27,28,29,30,31,1,2,3,4,5,6,7,8,9,10,11,12,13,14,15,16,17,18,{"$f":"DAY(CHI5)","v":19},20,21,22,23,24,25,26,27,28,1,2,3,4,5,6,7,8,9,10,11,12,13,14,15,16,17,18,19,20,21,22,23,24,25,26,27,28,29,30,31,1,2,3,4,5,6,7,8,9,10,11,12,13,14,15,16,17,18,19,20,21,22,23,{"$f":"DAY(CJU5)","v":24},25,26,27,28,29,30,1,2,3,4,5,6,7,8,9,10,11,12,13,14,15,16,17,18,19,20,21,22,23,24,25,26,27,28,29,30,31,1,2,3,4,5,6,7,8,9,10,11,12,13,14,15,16,17,18,19,20,21,22,23,24,25,26,{"$f":"DAY(CMG5)","v":27},28,29,30,1,2,3,4,5,6,7,8,9,10,11,12,13,14,15,16,17,18,19,20,21,22,23,24,25,26,27,28,29,30,31,1,2,3,4,5,6,7,8,9,10,11,12,13,14,15,16,17,18,19,20,21,22,23,24,25,26,27,28,29,{"$f":"DAY(COS5)","v":30},31,1,2,3,4,5,6,7,8,9,10,11,12,13,14,15,16,17,18,19,20,21,22,23,24,25,26,27,28,29,30,1,2,3,4,5,6,7,8,9,10,11,12,13,14,15,16,17,18,19,20,21,22,23,24,25,26,27,28,29,30,31,1,{"$f":"DAY(CRE5)","v":2},3,4,5,6,7,8,9,10,11,12,13,14,15,16,17,18,19,20,21,22,23,24,25,26,27,28,29,30,1,2,3,4,5,6,7,8,9,10,11,12,13,14,15,16,17,18,19,20,21,22,23,24,25,26,27,28,29,30,31,1,2,3,4,{"$f":"DAY(CTQ5)","v":5},6,7,8,9,10,11,12,13,14,15,16,17,18,19,20,21,22,23,24,25,26,27,28,29,30,31,1,2,3,4,5,6,7,8,9,10,11,12,13,14,15,16,17,18,19,20,21,22,23,24,25,26,27,28,1,2,3,4,5,6,7,8,9,{"$f":"DAY(CWC5)","v":10},11,12,13,14,15,16,17,18,19,20,21,22,23,24,25,26,27,28,29,30,31,1,2,3,4,5,6,7,8,9,10,11,12,13,14,15,16,17,18,19,20,21,22,23,24,25,26,27,28,29,30,1,2,3,4,5,6,7,8,9,10,11,12,{"$f":"DAY(CYO5)","v":13},14,15,16,17,18,19,20,21,22,23,24,25,26,27,28,29,30,31,1,2,3,4,5,6,7,8,9,10,11,12,13,14,15,16,17,18,19,20,21,22,23,24,25,26,27,28,29,30,1,2,3,4,5,6,7,8,9,10,11,12,13,14,15,{"$f":"DAY(DBA5)","v":16},17,18,19,20,21,22,23,24,25,26,27,28,29,30,31,1,2,3,4,5,6,7,8,9,10,11,12,13,14,15,16,17,18,19,20,21,22,23,24,25,26,27,28,29,30,31,1,2,3,4,5,6,7,8,9,10,11,12,13,14,15,16,17,{"$f":"DAY(DDM5)","v":18},19,20,21,22,23,24,25,26,27,28,29,30,1,2,3,4,5,6,7,8,9,10,11,12,13,14,15,16,17,18,19,20,21,22,23,24,25,26,27,28,29,30,31,1,2,3,4,5,6,7,8,9,10,11,12,13,14,15,16,17,18,19,20,{"$f":"DAY(DFY5)","v":21},22,23,24,25,26,27,28,29,30,1,2,3,4,5,6,7,8,9,10,11,12,13,14,15,16,17,18,19,20,21,22,23,24,25,26,27,28,29,30,31,1,2,3,4,5,6,7,8,9,10,11,12,13,14,15,16,17,18,19,20,21,22,23,{"$f":"DAY(DIK5)","v":24},25,26,27,28,29,30,31,1,2,3,4,5,6,7,8,9,10,11,12,13,14,15,16,17,18,19,20,21,22,23,24,25,26,27,28,29,1,2,3,4,5,6,7,8,9,10,11,12,13,14,15,16,17,18,19,20,21,22,23,24,25,26,27,{"$f":"DAY(DKW5)","v":28},29,30,31,1,2,3,4,5,6,7,8,9,10,11,12,13,14,15,16,17,18,19,20,21,22,23,24,25,26,27,28,29,30,1,2,3,4,5,6,7,8,9,10,11,12,13,14,15,16,17,18,19,20,21,22,23,24,25,26,27,28,29,30,{"$f":"DAY(DNI5)","v":31},1,2,3,4,5,6,7,8,9,10,11,12,13,14,15,16,17,18,19,20,21,22,23,24,25,26,27,28,29,30,1,2,3,4,5,6,7,8,9,10,11,12,13,14,15,16,17,18,19,20,21,22,23,24,25,26,27,28,29,30,31,1,2,{"$f":"DAY(DPU5)","v":3},4,5,6,7,8,9,10,11,12,13,14,15,16,17,18,19,20,21,22,23,24,25,26,27,28,29,30,31,1,2,3,4,5,6,7,8,9,10,11,12,13,14,15,16,17,18,19,20,21,22,23,24,25,26,27,28,29,30,1,2,3,4,5,{"$f":"DAY(DSG5)","v":6},7,8,9,10,11,12,13,14,15,16,17,18,19,20,21,22,23,24,25,26,27,28,29,30,31,1,2,3,4,5,6,7,8,9,10,11,12,13,14,15,16,17,18,19,20,21,22,23,24,25,26,27,28,29,30,1,2,3,4,5,6,7,8,{"$f":"DAY(DUS5)","v":9},10,11,12,13,14,15,16,17,18,19,20,21,22,23,24,25,26,27,28,29,30,31,1,2,3,4,5,6,7,8,9,10,11,12,13,14,15,16,17,18,19,20,21,22,23,24,25,26,27,28,29,30,31,1,2,3,4,5,6,7,8,9,10,{"$f":"DAY(DXE5)","v":11},12,13,14,15,16,17,18,19,20,21,22,23,24,25,26,27,28,1,2,3,4,5,6,7,8,9,10,11,12,13,14,15,16,17,18,19,20,21,22,23,24,25,26,27,28,29,30,31,1,2,3,4,5,6,7,8,9,10,11,12,13,14,15,{"$f":"DAY(DZQ5)","v":16},17,18,19,20,21,22,23,24,25,26,27,28,29,30,1,2,3,4,5,6,7,8,9,10,11,12,13,14,15,16,17,18,19,20,21,22,23,24,25,26,27,28,29,30,31,1,2,3,4,5,6,7,8,9,10,11,12,13,14,15,16,17,18,{"$f":"DAY(ECC5)","v":19},20,21,22,23,24,25,26,27,28,29,30,1,2,3,4,5,6,7,8,9,10,11,12,13,14,15,16,17,18,19,20,21,22,23,24,25,26,27,28,29,30,31,1,2,3,4,5,6,7,8,9,10,11,12,13,14,15,16,17,18,19,20,21,{"$f":"DAY(EEO5)","v":22},23,24,25,26,27,28,29,30,31,1,2,3,4,5,6,7,8,9,10,11,12,13,14,15,16,17,18,19,20,21,22,23,24,25,26,27,28,29,30,1,2,3,4,5,6,7,8,9,10,11,12,13,14,15,16,17,18,19,20,21,22,23,24,{"$f":"DAY(EHA5)","v":25},26,27,28,29,30,31,1,2,3,4,5,6,7,8,9,10,11,12,13,14,15,16,17,18,19,20,21,22,23,24,25,26,27,28,29,30,1,2,3,4,5,6,7,8,9,10,11,12,13,14,15,16,17,18,19,20,21,22,23,24,25,26,27,{"$f":"DAY(EJM5)","v":28},29,30,31,1,2,3,4,5,6,7,8,9,10,11,12,13,14,15,16,17,18,19,20,21,22,23,24,25,26,27,28,29,30,31,1,2,3,4,5,6,7,8,9,10,11,12,13,14,15,16,17,18,19,20,21,22,23,24,25,26,27,28,1,{"$f":"DAY(ELY5)","v":2},3,4,5,6,7,8,9,10,11,12,13,14,15,16,17,18,19,20,21,22,23,24,25,26,27,28,29,30,31,1,2,3,4,5]
[{"$nulls":3},"2020-01-01","2020-01-02","2020-01-03","2020-01-04","2020-01-05","2020-01-06","2020-01-07","2020-01-08","2020-01-09","2020-01-10","2020-01-11","2020-01-12","2020-01-13","2020-01-14","2020-01-15","2020-01-16","2020-01-17","2020-01-18","2020-01-19","2020-01-20","2020-01-21","2020-01-22","2020-01-23","2020-01-24","2020-01-25","2020-01-26","2020-01-27","2020-01-28","2020-01-29","2020-01-30","2020-01-31","2020-02-01","2020-02-02","2020-02-03","2020-02-04","2020-02-05","2020-02-06","2020-02-07","2020-02-08","2020-02-09","2020-02-10","2020-02-11","2020-02-12","2020-02-13","2020-02-14","2020-02-15","2020-02-16","2020-02-17","2020-02-18","2020-02-19","2020-02-20","2020-02-21","2020-02-22","2020-02-23","2020-02-24","2020-02-25","2020-02-26","2020-02-27","2020-02-28","2020-02-29","2020-03-01","2020-03-02","2020-03-03","2020-03-04","2020-03-05","2020-03-06","2020-03-07","2020-03-08","2020-03-09","2020-03-10","2020-03-11","2020-03-12","2020-03-13","2020-03-14","2020-03-15","2020-03-16","2020-03-17","2020-03-18","2020-03-19","2020-03-20","2020-03-21","2020-03-22","2020-03-23","2020-03-24","2020-03-25","2020-03-26","2020-03-27","2020-03-28","2020-03-29","2020-03-30","2020-03-31","2020-04-01","2020-04-02","2020-04-03","2020-04-04","2020-04-05","2020-04-06","2020-04-07","2020-04-08","2020-04-09","2020-04-10","2020-04-11","2020-04-12","2020-04-13","2020-04-14","2020-04-15","2020-04-16","2020-04-17","2020-04-18","2020-04-19","2020-04-20","2020-04-21","2020-04-22","2020-04-23","2020-04-24","2020-04-25","2020-04-26","2020-04-27","2020-04-28","2020-04-29","2020-04-30","2020-05-01","2020-05-02","2020-05-03","2020-05-04","2020-05-05","2020-05-06","2020-05-07","2020-05-08","2020-05-09","2020-05-10","2020-05-11","2020-05-12","2020-05-13","2020-05-14","2020-05-15","2020-05-16","2020-05-17","2020-05-18","2020-05-19","2020-05-20","2020-05-21","2020-05-22","2020-05-23","2020-05-24","2020-05-25","2020-05-26","2020-05-27","2020-05-28","2020-05-29","2020-05-30","2020-05-31","2020-06-01","2020-06-02","2020-06-03","2020-06-04","2020-06-05","2020-06-06","2020-06-07","2020-06-08","2020-06-09","2020-06-10","2020-06-11","2020-06-12","2020-06-13","2020-06-14","2020-06-15","2020-06-16","2020-06-17","2020-06-18","2020-06-19","2020-06-20","2020-06-21","2020-06-22","2020-06-23","2020-06-24","2020-06-25","2020-06-26","2020-06-27","2020-06-28","2020-06-29","2020-06-30","2020-07-01","2020-07-02","2020-07-03","2020-07-04","2020-07-05","2020-07-06","2020-07-07","2020-07-08","2020-07-09","2020-07-10","2020-07-11","2020-07-12","2020-07-13","2020-07-14","2020-07-15","2020-07-16","2020-07-17","2020-07-18","2020-07-19","2020-07-20","2020-07-21","2020-07-22","2020-07-23","2020-07-24","2020-07-25","2020-07-26","2020-07-27","2020-07-28","2020-07-29","2020-07-30","2020-07-31","2020-08-01","2020-08-02","2020-08-03","2020-08-04","2020-08-05","2020-08-06","2020-08-07","2020-08-08","2020-08-09","2020-08-10","2020-08-11","2020-08-12","2020-08-13","2020-08-14","2020-08-15","2020-08-16","2020-08-17","2020-08-18","2020-08-19","2020-08-20","2020-08-21","2020-08-22","2020-08-23","2020-08-24","2020-08-25","2020-08-26","2020-08-27","2020-08-28","2020-08-29","2020-08-30","2020-08-31","2020-09-01","2020-09-02","2020-09-03","2020-09-04","2020-09-05","2020-09-06","2020-09-07","2020-09-08","2020-09-09","2020-09-10","2020-09-11","2020-09-12","2020-09-13","2020-09-14","2020-09-15","2020-09-16","2020-09-17","2020-09-18","2020-09-19","2020-09-20","2020-09-21","2020-09-22","2020-09-23","2020-09-24","2020-09-25","2020-09-26","2020-09-27","2020-09-28","2020-09-29","2020-09-30","2020-10-01","2020-10-02","2020-10-03","2020-10-04","2020-10-05","2020-10-06","2020-10-07","2020-10-08","2020-10-09","2020-10-10","2020-10-11","2020-10-12","2020-10-13","2020-10-14","2020-10-15","2020-10-16","2020-10-17","2020-10-18","2020-10-19","2020-10-20","2020-10-21","2020-10-22","2020-10-23","2020-10-24","2020-10-25","2020-10-26","2020-10-27","2020-10-28","2020-10-29","2020-10-30","2020-10-31","2020-11-01","2020-11-02","2020-11-03","2020-11-04","2020-11-05","2020-11-06","2020-11-07","2020-11-08","2020-11-09","2020-11-10","2020-11-11","2020-11-12","2020-11-13","2020-11-14","2020-11-15","2020-11-16","2020-11-17","2020-11-18","2020-11-19","2020-11-20","2020-11-21","2020-11-22","2020-11-23","2020-11-24","2020-11-25","2020-11-26","2020-11-27","2020-11-28","2020-11-29","2020-11-30","2020-12-01","2020-12-02","2020-12-03","2020-12-04","2020-12-05","2020-12-06","2020-12-07","2020-12-08","2020-12-09","2020-12-10","2020-12-11","2020-12-12","2020-12-13","2020-12-14","2020-12-15","2020-12-16","2020-12-17","2020-12-18","2020-12-19","2020-12-20","2020-12-21","2020-12-22","2020-12-23","2020-12-24","2020-12-25","2020-12-26","2020-12-27","2020-12-28","2020-12-29","2020-12-30","2020-12-31","2021-01-01","2021-01-02","2021-01-03","2021-01-04","2021-01-05","2021-01-06","2021-01-07","2021-01-08","2021-01-09","2021-01-10","2021-01-11","2021-01-12","2021-01-13","2021-01-14","2021-01-15","2021-01-16","2021-01-17","2021-01-18","2021-01-19","2021-01-20","2021-01-21","2021-01-22","2021-01-23","2021-01-24","2021-01-25","2021-01-26","2021-01-27","2021-01-28","2021-01-29","2021-01-30","2021-01-31","2021-02-01","2021-02-02","2021-02-03","2021-02-04","2021-02-05","2021-02-06","2021-02-07","2021-02-08","2021-02-09","2021-02-10","2021-02-11","2021-02-12","2021-02-13","2021-02-14","2021-02-15","2021-02-16","2021-02-17","2021-02-18","2021-02-19","2021-02-20","2021-02-21","2021-02-22","2021-02-23","2021-02-24","2021-02-25","2021-02-26","2021-02-27","2021-02-28","2021-03-01","2021-03-02","2021-03-03","2021-03-04","2021-03-05","2021-03-06","2021-03-07","2021-03-08","2021-03-09","2021-03-10","2021-03-11","2021-03-12","2021-03-13","2021-03-14","2021-03-15","2021-03-16","2021-03-17","2021-03-18","2021-03-19","2021-03-20","2021-03-21","2021-03-22","2021-03-23","2021-03-24","2021-03-25","2021-03-26","2021-03-27","2021-03-28","2021-03-29","2021-03-30","2021-03-31","2021-04-01","2021-04-02","2021-04-03","2021-04-04","2021-04-05","2021-04-06","2021-04-07","2021-04-08","2021-04-09","2021-04-10","2021-04-11","2021-04-12","2021-04-13","2021-04-14","2021-04-15","2021-04-16","2021-04-17","2021-04-18","2021-04-19","2021-04-20","2021-04-21","2021-04-22","2021-04-23","2021-04-24","2021-04-25","2021-04-26","2021-04-27","2021-04-28","2021-04-29","2021-04-30","2021-05-01","2021-05-02","2021-05-03","2021-05-04","2021-05-05","2021-05-06","2021-05-07","2021-05-08","2021-05-09","2021-05-10","2021-05-11","2021-05-12","2021-05-13","2021-05-14","2021-05-15","2021-05-16","2021-05-17","2021-05-18","2021-05-19","2021-05-20","2021-05-21","2021-05-22","2021-05-23","2021-05-24","2021-05-25","2021-05-26","2021-05-27","2021-05-28","2021-05-29","2021-05-30","2021-05-31","2021-06-01","2021-06-02","2021-06-03","2021-06-04","2021-06-05","2021-06-06","2021-06-07","2021-06-08","2021-06-09","2021-06-10","2021-06-11","2021-06-12","2021-06-13","2021-06-14","2021-06-15","2021-06-16","2021-06-17","2021-06-18","2021-06-19","2021-06-20","2021-06-21","2021-06-22","2021-06-23","2021-06-24","2021-06-25","2021-06-26","2021-06-27","2021-06-28","2021-06-29","2021-06-30","2021-07-01","2021-07-02","2021-07-03","2021-07-04","2021-07-05","2021-07-06","2021-07-07","2021-07-08","2021-07-09","2021-07-10","2021-07-11","2021-07-12","2021-07-13","2021-07-14","2021-07-15","2021-07-16","2021-07-17","2021-07-18","2021-07-19","2021-07-20","2021-07-21","2021-07-22","2021-07-23","2021-07-24","2021-07-25","2021-07-26","2021-07-27","2021-07-28","2021-07-29","2021-07-30","2021-07-31","2021-08-01","2021-08-02","2021-08-03","2021-08-04","2021-08-05","2021-08-06","2021-08-07","2021-08-08","2021-08-09","2021-08-10","2021-08-11","2021-08-12","2021-08-13","2021-08-14","2021-08-15","2021-08-16","2021-08-17","2021-08-18","2021-08-19","2021-08-20","2021-08-21","2021-08-22","2021-08-23","2021-08-24","2021-08-25","2021-08-26","2021-08-27","2021-08-28","2021-08-29","2021-08-30","2021-08-31","2021-09-01","2021-09-02","2021-09-03","2021-09-04","2021-09-05","2021-09-06","2021-09-07","2021-09-08","2021-09-09","2021-09-10","2021-09-11","2021-09-12","2021-09-13","2021-09-14","2021-09-15","2021-09-16","2021-09-17","2021-09-18","2021-09-19","2021-09-20","2021-09-21","2021-09-22","2021-09-23","2021-09-24","2021-09-25","2021-09-26","2021-09-27","2021-09-28","2021-09-29","2021-09-30","2021-10-01","2021-10-02","2021-10-03","2021-10-04","2021-10-05","2021-10-06","2021-10-07","2021-10-08","2021-10-09","2021-10-10","2021-10-11","2021-10-12","2021-10-13","2021-10-14","2021-10-15","2021-10-16","2021-10-17","2021-10-18","2021-10-19","2021-10-20","2021-10-21","2021-10-22","2021-10-23","2021-10-24","2021-10-25","2021-10-26","2021-10-27","2021-10-28","2021-10-29","2021-10-30","2021-10-31","2021-11-01","2021-11-02","2021-11-03","2021-11-04","2021-11-05","2021-11-06","2021-11-07","2021-11-08","2021-11-09","2021-11-10","2021-11-11","2021-11-12","2021-11-13","2021-11-14","2021-11-15","2021-11-16","2021-11-17","2021-11-18","2021-11-19","2021-11-20","2021-11-21","2021-11-22","2021-11-23","2021-11-24","2021-11-25","2021-11-26","2021-11-27","2021-11-28","2021-11-29","2021-11-30","2021-12-01","2021-12-02","2021-12-03","2021-12-04","2021-12-05","2021-12-06","2021-12-07","2021-12-08","2021-12-09","2021-12-10","2021-12-11","2021-12-12","2021-12-13","2021-12-14","2021-12-15","2021-12-16","2021-12-17","2021-12-18","2021-12-19","2021-12-20","2021-12-21","2021-12-22","2021-12-23","2021-12-24","2021-12-25","2021-12-26","2021-12-27","2021-12-28","2021-12-29","2021-12-30","2021-12-31","2022-01-01","2022-01-02","2022-01-03","2022-01-04","2022-01-05","2022-01-06","2022-01-07","2022-01-08","2022-01-09","2022-01-10","2022-01-11","2022-01-12","2022-01-13","2022-01-14","2022-01-15","2022-01-16","2022-01-17","2022-01-18","2022-01-19","2022-01-20","2022-01-21","2022-01-22","2022-01-23","2022-01-24","2022-01-25","2022-01-26","2022-01-27","2022-01-28","2022-01-29","2022-01-30","2022-01-31","2022-02-01","2022-02-02","2022-02-03","2022-02-04","2022-02-05","2022-02-06","2022-02-07","2022-02-08","2022-02-09","2022-02-10","2022-02-11","2022-02-12","2022-02-13","2022-02-14","2022-02-15","2022-02-16","2022-02-17","2022-02-18","2022-02-19","2022-02-20","2022-02-21","2022-02-22","2022-02-23","2022-02-24","2022-02-25","2022-02-26","2022-02-27","2022-02-28","2022-03-01","2022-03-02","2022-03-03","2022-03-04","2022-03-05","2022-03-06","2022-03-07","2022-03-08","2022-03-09","2022-03-10","2022-03-11","2022-03-12","2022-03-13","2022-03-14","2022-03-15","2022-03-16","2022-03-17","2022-03-18","2022-03-19","2022-03-20","2022-03-21","2022-03-22","2022-03-23","2022-03-24","2022-03-25","2022-03-26","2022-03-27","2022-03-28","2022-03-29","2022-03-30","2022-03-31","2022-04-01","2022-04-02","2022-04-03","2022-04-04","2022-04-05","2022-04-06","2022-04-07","2022-04-08","2022-04-09","2022-04-10","2022-04-11","2022-04-12","2022-04-13","2022-04-14","2022-04-15","2022-04-16","2022-04-17","2022-04-18","2022-04-19","2022-04-20","2022-04-21","2022-04-22","2022-04-23","2022-04-24","2022-04-25","2022-04-26","2022-04-27","2022-04-28","2022-04-29","2022-04-30","2022-05-01","2022-05-02","2022-05-03","2022-05-04","2022-05-05","2022-05-06","2022-05-07","2022-05-08","2022-05-09","2022-05-10","2022-05-11","2022-05-12","2022-05-13","2022-05-14","2022-05-15","2022-05-16","2022-05-17","2022-05-18","2022-05-19","2022-05-20","2022-05-21","2022-05-22","2022-05-23","2022-05-24","2022-05-25","2022-05-26","2022-05-27","2022-05-28","2022-05-29","2022-05-30","2022-05-31","2022-06-01","2022-06-02","2022-06-03","2022-06-04","2022-06-05","2022-06-06","2022-06-07","2022-06-08","2022-06-09","2022-06-10","2022-06-11","2022-06-12","2022-06-13","2022-06-14","2022-06-15","2022-06-16","2022-06-17","2022-06-18","2022-06-19","2022-06-20","2022-06-21","2022-06-22","2022-06-23","2022-06-24","2022-06-25","2022-06-26","2022-06-27","2022-06-28","2022-06-29","2022-06-30","2022-07-01","2022-07-02","2022-07-03","2022-07-04","2022-07-05","2022-07-06","2022-07-07","2022-07-08","2022-07-09","2022-07-10","2022-07-11","2022-07-12","2022-07-13","2022-07-14","2022-07-15","2022-07-16","2022-07-17","2022-07-18","2022-07-19","2022-07-20","2022-07-21","2022-07-22","2022-07-23","2022-07-24","2022-07-25","2022-07-26","2022-07-27","2022-07-28","2022-07-29","2022-07-30","2022-07-31","2022-08-01","2022-08-02","2022-08-03","2022-08-04","2022-08-05","2022-08-06","2022-08-07","2022-08-08","2022-08-09","2022-08-10","2022-08-11","2022-08-12","2022-08-13","2022-08-14","2022-08-15","2022-08-16","2022-08-17","2022-08-18","2022-08-19","2022-08-20","2022-08-21","2022-08-22","2022-08-23","2022-08-24","2022-08-25","2022-08-26","2022-08-27","2022-08-28","2022-08-29","2022-08-30","2022-08-31","2022-09-01","2022-09-02","2022-09-03","2022-09-04","2022-09-05","2022-09-06","2022-09-07","2022-09-08","2022-09-09","2022-09-10","2022-09-11","2022-09-12","2022-09-13","2022-09-14","2022-09-15","2022-09-16","2022-09-17","2022-09-18","2022-09-19","2022-09-20","2022-09-21","2022-09-22","2022-09-23","2022-09-24","2022-09-25","2022-09-26","2022-09-27","2022-09-28","2022-09-29","2022-09-30","2022-10-01","2022-10-02","2022-10-03","2022-10-04","2022-10-05","2022-10-06","2022-10-07","2022-10-08","2022-10-09","2022-10-10","2022-10-11","2022-10-12","2022-10-13","2022-10-14","2022-10-15","2022-10-16","2022-10-17","2022-10-18","2022-10-19","2022-10-20","2022-10-21","2022-10-22","2022-10-23","2022-10-24","2022-10-25","2022-10-26","2022-10-27","2022-10-28","2022-10-29","2022-10-30","2022-10-31","2022-11-01","2022-11-02","2022-11-03","2022-11-04","2022-11-05","2022-11-06","2022-11-07","2022-11-08","2022-11-09","2022-11-10","2022-11-11","2022-11-12","2022-11-13","2022-11-14","2022-11-15","2022-11-16","2022-11-17","2022-11-18","2022-11-19","2022-11-20","2022-11-21","2022-11-22","2022-11-23","2022-11-24","2022-11-25","2022-11-26","2022-11-27","2022-11-28","2022-11-29","2022-11-30","2022-12-01","2022-12-02","2022-12-03","2022-12-04","2022-12-05","2022-12-06","2022-12-07","2022-12-08","2022-12-09","2022-12-10","2022-12-11","2022-12-12","2022-12-13","2022-12-14","2022-12-15","2022-12-16","2022-12-17","2022-12-18","2022-12-19","2022-12-20","2022-12-21","2022-12-22","2022-12-23","2022-12-24","2022-12-25","2022-12-26","2022-12-27","2022-12-28","2022-12-29","2022-12-30","2022-12-31","2023-01-01","2023-01-02","2023-01-03","2023-01-04","2023-01-05","2023-01-06","2023-01-07","2023-01-08","2023-01-09","2023-01-10","2023-01-11","2023-01-12","2023-01-13","2023-01-14","2023-01-15","2023-01-16","2023-01-17","2023-01-18","2023-01-19","2023-01-20","2023-01-21","2023-01-22","2023-01-23","2023-01-24","2023-01-25","2023-01-26","2023-01-27","2023-01-28","2023-01-29","2023-01-30","2023-01-31","2023-02-01","2023-02-02","2023-02-03","2023-02-04","2023-02-05","2023-02-06","2023-02-07","2023-02-08","2023-02-09","2023-02-10","2023-02-11","2023-02-12","2023-02-13","2023-02-14","2023-02-15","2023-02-16","2023-02-17","2023-02-18","2023-02-19","2023-02-20","2023-02-21","2023-02-22","2023-02-23","2023-02-24","2023-02-25","2023-02-26","2023-02-27","2023-02-28","2023-03-01","2023-03-02","2023-03-03","2023-03-04","2023-03-05","2023-03-06","2023-03-07","2023-03-08","2023-03-09","2023-03-10","2023-03-11","2023-03-12","2023-03-13","2023-03-14","2023-03-15","2023-03-16","2023-03-17","2023-03-18","2023-03-19","2023-03-20","2023-03-21","2023-03-22","2023-03-23","2023-03-24","2023-03-25","2023-03-26","2023-03-27","2023-03-28","2023-03-29","2023-03-30","2023-03-31","2023-04-01","2023-04-02","2023-04-03","2023-04-04","2023-04-05","2023-04-06","2023-04-07","2023-04-08","2023-04-09","2023-04-10","2023-04-11","2023-04-12","2023-04-13","2023-04-14","2023-04-15","2023-04-16","2023-04-17","2023-04-18","2023-04-19","2023-04-20","2023-04-21","2023-04-22","2023-04-23","2023-04-24","2023-04-25","2023-04-26","2023-04-27","2023-04-28","2023-04-29","2023-04-30","2023-05-01","2023-05-02","2023-05-03","2023-05-04","2023-05-05","2023-05-06","2023-05-07","2023-05-08","2023-05-09","2023-05-10","2023-05-11","2023-05-12","2023-05-13","2023-05-14","2023-05-15","2023-05-16","2023-05-17","2023-05-18","2023-05-19","2023-05-20","2023-05-21","2023-05-22","2023-05-23","2023-05-24","2023-05-25","2023-05-26","2023-05-27","2023-05-28","2023-05-29","2023-05-30","2023-05-31","2023-06-01","2023-06-02","2023-06-03","2023-06-04","2023-06-05","2023-06-06","2023-06-07","2023-06-08","2023-06-09","2023-06-10","2023-06-11","2023-06-12","2023-06-13","2023-06-14","2023-06-15","2023-06-16","2023-06-17","2023-06-18","2023-06-19","2023-06-20","2023-06-21","2023-06-22","2023-06-23","2023-06-24","2023-06-25","2023-06-26","2023-06-27","2023-06-28","2023-06-29","2023-06-30","2023-07-01","2023-07-02","2023-07-03","2023-07-04","2023-07-05","2023-07-06","2023-07-07","2023-07-08","2023-07-09","2023-07-10","2023-07-11","2023-07-12","2023-07-13","2023-07-14","2023-07-15","2023-07-16","2023-07-17","2023-07-18","2023-07-19","2023-07-20","2023-07-21","2023-07-22","2023-07-23","2023-07-24","2023-07-25","2023-07-26","2023-07-27","2023-07-28","2023-07-29","2023-07-30","2023-07-31","2023-08-01","2023-08-02","2023-08-03","2023-08-04","2023-08-05","2023-08-06","2023-08-07","2023-08-08","2023-08-09","2023-08-10","2023-08-11","2023-08-12","2023-08-13","2023-08-14","2023-08-15","2023-08-16","2023-08-17","2023-08-18","2023-08-19","2023-08-20","2023-08-21","2023-08-22","2023-08-23","2023-08-24","2023-08-25","2023-08-26","2023-08-27","2023-08-28","2023-08-29","2023-08-30","2023-08-31","2023-09-01","2023-09-02","2023-09-03","2023-09-04","2023-09-05","2023-09-06","2023-09-07","2023-09-08","2023-09-09","2023-09-10","2023-09-11","2023-09-12","2023-09-13","2023-09-14","2023-09-15","2023-09-16","2023-09-17","2023-09-18","2023-09-19","2023-09-20","2023-09-21","2023-09-22","2023-09-23","2023-09-24","2023-09-25","2023-09-26","2023-09-27","2023-09-28","2023-09-29","2023-09-30","2023-10-01","2023-10-02","2023-10-03","2023-10-04","2023-10-05","2023-10-06","2023-10-07","2023-10-08","2023-10-09","2023-10-10","2023-10-11","2023-10-12","2023-10-13","2023-10-14","2023-10-15","2023-10-16","2023-10-17","2023-10-18","2023-10-19","2023-10-20","2023-10-21","2023-10-22","2023-10-23","2023-10-24","2023-10-25","2023-10-26","2023-10-27","2023-10-28","2023-10-29","2023-10-30","2023-10-31","2023-11-01","2023-11-02","2023-11-03","2023-11-04","2023-11-05","2023-11-06","2023-11-07","2023-11-08","2023-11-09","2023-11-10","2023-11-11","2023-11-12","2023-11-13","2023-11-14","2023-11-15","2023-11-16","2023-11-17","2023-11-18","2023-11-19","2023-11-20","2023-11-21","2023-11-22","2023-11-23","2023-11-24","2023-11-25","2023-11-26","2023-11-27","2023-11-28","2023-11-29","2023-11-30","2023-12-01","2023-12-02","2023-12-03","2023-12-04","2023-12-05","2023-12-06","2023-12-07","2023-12-08","2023-12-09","2023-12-10","2023-12-11","2023-12-12","2023-12-13","2023-12-14","2023-12-15","2023-12-16","2023-12-17","2023-12-18","2023-12-19","2023-12-20","2023-12-21","2023-12-22","2023-12-23","2023-12-24","2023-12-25","2023-12-26","2023-12-27","2023-12-28","2023-12-29","2023-12-30","2023-12-31","2024-01-01","2024-01-02","2024-01-03","2024-01-04","2024-01-05","2024-01-06","2024-01-07","2024-01-08","2024-01-09","2024-01-10","2024-01-11","2024-01-12","2024-01-13","2024-01-14","2024-01-15","2024-01-16","2024-01-17","2024-01-18","2024-01-19","2024-01-20","2024-01-21","2024-01-22","2024-01-23","2024-01-24","2024-01-25","2024-01-26","2024-01-27","2024-01-28","2024-01-29","2024-01-30","2024-01-31","2024-02-01","2024-02-02","2024-02-03","2024-02-04","2024-02-05","2024-02-06","2024-02-07","2024-02-08","2024-02-09","2024-02-10","2024-02-11","2024-02-12","2024-02-13","2024-02-14","2024-02-15","2024-02-16","2024-02-17","2024-02-18","2024-02-19","2024-02-20","2024-02-21","2024-02-22","2024-02-23","2024-02-24","2024-02-25","2024-02-26","2024-02-27","2024-02-28","2024-02-29","2024-03-01","2024-03-02","2024-03-03","2024-03-04","2024-03-05","2024-03-06","2024-03-07","2024-03-08","2024-03-09","2024-03-10","2024-03-11","2024-03-12","2024-03-13","2024-03-14","2024-03-15","2024-03-16","2024-03-17","2024-03-18","2024-03-19","2024-03-20","2024-03-21","2024-03-22","2024-03-23","2024-03-24","2024-03-25","2024-03-26","2024-03-27","2024-03-28","2024-03-29","2024-03-30","2024-03-31","2024-04-01","2024-04-02","2024-04-03","2024-04-04","2024-04-05","2024-04-06","2024-04-07","2024-04-08","2024-04-09","2024-04-10","2024-04-11","2024-04-12","2024-04-13","2024-04-14","2024-04-15","2024-04-16","2024-04-17","2024-04-18","2024-04-19","2024-04-20","2024-04-21","2024-04-22","2024-04-23","2024-04-24","2024-04-25","2024-04-26","2024-04-27","2024-04-28","2024-04-29","2024-04-30","2024-05-01","2024-05-02","2024-05-03","2024-05-04","2024-05-05","2024-05-06","2024-05-07","2024-05-08","2024-05-09","2024-05-10","2024-05-11","2024-05-12","2024-05-13","2024-05-14","2024-05-15","2024-05-16","2024-05-17","2024-05-18","2024-05-19","2024-05-20","2024-05-21","2024-05-22","2024-05-23","2024-05-24","2024-05-25","2024-05-26","2024-05-27","2024-05-28","2024-05-29","2024-05-30","2024-05-31","2024-06-01","2024-06-02","2024-06-03","2024-06-04","2024-06-05","2024-06-06","2024-06-07","2024-06-08","2024-06-09","2024-06-10","2024-06-11","2024-06-12","2024-06-13","2024-06-14","2024-06-15","2024-06-16","2024-06-17","2024-06-18","2024-06-19","2024-06-20","2024-06-21","2024-06-22","2024-06-23","2024-06-24","2024-06-25","2024-06-26","2024-06-27","2024-06-28","2024-06-29","2024-06-30","2024-07-01","2024-07-02","2024-07-03","2024-07-04","2024-07-05","2024-07-06","2024-07-07","2024-07-08","2024-07-09","2024-07-10","2024-07-11","2024-07-12","2024-07-13","2024-07-14","2024-07-15","2024-07-16","2024-07-17","2024-07-18","2024-07-19","2024-07-20","2024-07-21","2024-07-22","2024-07-23","2024-07-24","2024-07-25","2024-07-26","2024-07-27","2024-07-28","2024-07-29","2024-07-30","2024-07-31","2024-08-01","2024-08-02","2024-08-03","2024-08-04","2024-08-05","2024-08-06","2024-08-07","2024-08-08","2024-08-09","2024-08-10","2024-08-11","2024-08-12","2024-08-13","2024-08-14","2024-08-15","2024-08-16","2024-08-17","2024-08-18","2024-08-19","2024-08-20","2024-08-21","2024-08-22","2024-08-23","2024-08-24","2024-08-25","2024-08-26","2024-08-27","2024-08-28","2024-08-29","2024-08-30","2024-08-31","2024-09-01","2024-09-02","2024-09-03","2024-09-04","2024-09-05","2024-09-06","2024-09-07","2024-09-08","2024-09-09","2024-09-10","2024-09-11","2024-09-12","2024-09-13","2024-09-14","2024-09-15","2024-09-16","2024-09-17","2024-09-18","2024-09-19","2024-09-20","2024-09-21","2024-09-22","2024-09-23","2024-09-24","2024-09-25","2024-09-26","2024-09-27","2024-09-28","2024-09-29","2024-09-30","2024-10-01","2024-10-02","2024-10-03","2024-10-04","2024-10-05","2024-10-06","2024-10-07","2024-10-08","2024-10-09","2024-10-10","2024-10-11","2024-10-12","2024-10-13","2024-10-14","2024-10-15","2024-10-16","2024-10-17","2024-10-18","2024-10-19","2024-10-20","2024-10-21","2024-10-22","2024-10-23","2024-10-24","2024-10-25","2024-10-26","2024-10-27","2024-10-28","2024-10-29","2024-10-30","2024-10-31","2024-11-01","2024-11-02","2024-11-03","2024-11-04","2024-11-05","2024-11-06","2024-11-07","2024-11-08","2024-11-09","2024-11-10","2024-11-11","2024-11-12","2024-11-13","2024-11-14","2024-11-15","2024-11-16","2024-11-17","2024-11-18","2024-11-19","2024-11-20","2024-11-21","2024-11-22","2024-11-23","2024-11-24","2024-11-25","2024-11-26","2024-11-27","2024-11-28","2024-11-29","2024-11-30","2024-12-01","2024-12-02","2024-12-03","2024-12-04","2024-12-05","2024-12-06","2024-12-07","2024-12-08","2024-12-09","2024-12-10","2024-12-11","2024-12-12","2024-12-13","2024-12-14","2024-12-15","2024-12-16","2024-12-17","2024-12-18","2024-12-19","2024-12-20","2024-12-21","2024-12-22","2024-12-23","2024-12-24","2024-12-25","2024-12-26","2024-12-27","2024-12-28","2024-12-29","2024-12-30","2024-12-31","2025-01-01","2025-01-02","2025-01-03","2025-01-04","2025-01-05","2025-01-06","2025-01-07","2025-01-08","2025-01-09","2025-01-10","2025-01-11","2025-01-12","2025-01-13","2025-01-14","2025-01-15","2025-01-16","2025-01-17","2025-01-18","2025-01-19","2025-01-20","2025-01-21","2025-01-22","2025-01-23","2025-01-24","2025-01-25","2025-01-26","2025-01-27","2025-01-28","2025-01-29","2025-01-30","2025-01-31","2025-02-01","2025-02-02","2025-02-03","2025-02-04","2025-02-05","2025-02-06","2025-02-07","2025-02-08","2025-02-09","2025-02-10","2025-02-11","2025-02-12","2025-02-13","2025-02-14","2025-02-15","2025-02-16","2025-02-17","2025-02-18","2025-02-19","2025-02-20","2025-02-21","2025-02-22","2025-02-23","2025-02-24","2025-02-25","2025-02-26","2025-02-27","2025-02-28","2025-03-01","2025-03-02","2025-03-03","2025-03-04","2025-03-05","2025-03-06","2025-03-07","2025-03-08","2025-03-09","2025-03-10","2025-03-11","2025-03-12","2025-03-13","2025-03-14","2025-03-15","2025-03-16","2025-03-17","2025-03-18","2025-03-19","2025-03-20","2025-03-21","2025-03-22","2025-03-23","2025-03-24","2025-03-25","2025-03-26","2025-03-27","2025-03-28","2025-03-29","2025-03-30","2025-03-31","2025-04-01","2025-04-02","2025-04-03","2025-04-04","2025-04-05","2025-04-06","2025-04-07","2025-04-08","2025-04-09","2025-04-10","2025-04-11","2025-04-12","2025-04-13","2025-04-14","2025-04-15","2025-04-16","2025-04-17","2025-04-18","2025-04-19","2025-04-20","2025-04-21","2025-04-22","2025-04-23","2025-04-24","2025-04-25","2025-04-26","2025-04-27","2025-04-28","2025-04-29","2025-04-30","2025-05-01","2025-05-02","2025-05-03","2025-05-04","2025-05-05","2025-05-06","2025-05-07","2025-05-08","2025-05-09","2025-05-10","2025-05-11","2025-05-12","2025-05-13","2025-05-14","2025-05-15","2025-05-16","2025-05-17","2025-05-18","2025-05-19","2025-05-20","2025-05-21","2025-05-22","2025-05-23","2025-05-24","2025-05-25","2025-05-26","2025-05-27","2025-05-28","2025-05-29","2025-05-30","2025-05-31","2025-06-01","2025-06-02","2025-06-03","2025-06-04","2025-06-05","2025-06-06","2025-06-07","2025-06-08","2025-06-09","2025-06-10","2025-06-11","2025-06-12","2025-06-13","2025-06-14","2025-06-15","2025-06-16","2025-06-17","2025-06-18","2025-06-19","2025-06-20","2025-06-21","2025-06-22","2025-06-23","2025-06-24","2025-06-25","2025-06-26","2025-06-27","2025-06-28","2025-06-29","2025-06-30","2025-07-01","2025-07-02","2025-07-03","2025-07-04","2025-07-05","2025-07-06","2025-07-07","2025-07-08","2025-07-09","2025-07-10","2025-07-11","2025-07-12","2025-07-13","2025-07-14","2025-07-15","2025-07-16","2025-07-17","2025-07-18","2025-07-19","2025-07-20","2025-07-21","2025-07-22","2025-07-23","2025-07-24","2025-07-25","2025-07-26","2025-07-27","2025-07-28","2025-07-29","2025-07-30","2025-07-31","2025-08-01","2025-08-02","2025-08-03","2025-08-04","2025-08-05","2025-08-06","2025-08-07","2025-08-08","2025-08-09","2025-08-10","2025-08-11","2025-08-12","2025-08-13","2025-08-14","2025-08-15","2025-08-16","2025-08-17","2025-08-18","2025-08-19","2025-08-20","2025-08-21","2025-08-22","2025-08-23","2025-08-24","2025-08-25","2025-08-26","2025-08-27","2025-08-28","2025-08-29","2025-08-30","2025-08-31","2025-09-01","2025-09-02","2025-09-03","2025-09-04","2025-09-05","2025-09-06","2025-09-07","2025-09-08","2025-09-09","2025-09-10","2025-09-11","2025-09-12","2025-09-13","2025-09-14","2025-09-15","2025-09-16","2025-09-17","2025-09-18","2025-09-19","2025-09-20","2025-09-21","2025-09-22","2025-09-23","2025-09-24","2025-09-25","2025-09-26","2025-09-27","2025-09-28","2025-09-29","2025-09-30","2025-10-01","2025-10-02","2025-10-03","2025-10-04","2025-10-05","2025-10-06","2025-10-07","2025-10-08","2025-10-09","2025-10-10","2025-10-11","2025-10-12","2025-10-13","2025-10-14","2025-10-15","2025-10-16","2025-10-17","2025-10-18","2025-10-19","2025-10-20","2025-10-21","2025-10-22","2025-10-23","2025-10-24","2025-10-25","2025-10-26","2025-10-27","2025-10-28","2025-10-29","2025-10-30","2025-10-31","2025-11-01","2025-11-02","2025-11-03","2025-11-04","2025-11-05","2025-11-06","2025-11-07","2025-11-08","2025-11-09","2025-11-10","2025-11-11","2025-11-12","2025-11-13","2025-11-14","2025-11-15","2025-11-16","2025-11-17","2025-11-18","2025-11-19","2025-11-20","2025-11-21","2025-11-22","2025-11-23","2025-11-24","2025-11-25","2025-11-26","2025-11-27","2025-11-28","2025-11-29","2025-11-30","2025-12-01","2025-12-02","2025-12-03","2025-12-04","2025-12-05","2025-12-06","2025-12-07","2025-12-08","2025-12-09","2025-12-10","2025-12-11","2025-12-12","2025-12-13","2025-12-14","2025-12-15","2025-12-16","2025-12-17","2025-12-18","2025-12-19","2025-12-20","2025-12-21","2025-12-22","2025-12-23","2025-12-24","2025-12-25","2025-12-26","2025-12-27","2025-12-28","2025-12-29","2025-12-30","2025-12-31","2026-01-01","2026-01-02","2026-01-03","2026-01-04","2026-01-05","2026-01-06","2026-01-07","2026-01-08","2026-01-09","2026-01-10","2026-01-11","2026-01-12","2026-01-13","2026-01-14","2026-01-15","2026-01-16","2026-01-17","2026-01-18","2026-01-19","2026-01-20","2026-01-21","2026-01-22","2026-01-23","2026-01-24","2026-01-25","2026-01-26","2026-01-27","2026-01-28","2026-01-29","2026-01-30","2026-01-31","2026-02-01","2026-02-02","2026-02-03","2026-02-04","2026-02-05","2026-02-06","2026-02-07","2026-02-08","2026-02-09","2026-02-10","2026-02-11","2026-02-12","2026-02-13","2026-02-14","2026-02-15","2026-02-16","2026-02-17","2026-02-18","2026-02-19","2026-02-20","2026-02-21","2026-02-22","2026-02-23","2026-02-24","2026-02-25","2026-02-26","2026-02-27","2026-02-28","2026-03-01","2026-03-02","2026-03-03","2026-03-04","2026-03-05","2026-03-06","2026-03-07","2026-03-08","2026-03-09","2026-03-10","2026-03-11","2026-03-12","2026-03-13","2026-03-14","2026-03-15","2026-03-16","2026-03-17","2026-03-18","2026-03-19","2026-03-20","2026-03-21","2026-03-22","2026-03-23","2026-03-24","2026-03-25","2026-03-26","2026-03-27","2026-03-28","2026-03-29","2026-03-30","2026-03-31","2026-04-01","2026-04-02","2026-04-03","2026-04-04","2026-04-05","2026-04-06","2026-04-07","2026-04-08","2026-04-09","2026-04-10","2026-04-11","2026-04-12","2026-04-13","2026-04-14","2026-04-15","2026-04-16","2026-04-17","2026-04-18","2026-04-19","2026-04-20","2026-04-21","2026-04-22","2026-04-23","2026-04-24","2026-04-25","2026-04-26","2026-04-27","2026-04-28","2026-04-29","2026-04-30","2026-05-01","2026-05-02","2026-05-03","2026-05-04","2026-05-05","2026-05-06","2026-05-07","2026-05-08","2026-05-09","2026-05-10","2026-05-11","2026-05-12","2026-05-13","2026-05-14","2026-05-15","2026-05-16","2026-05-17","2026-05-18","2026-05-19","2026-05-20","2026-05-21","2026-05-22","2026-05-23","2026-05-24","2026-05-25","2026-05-26","2026-05-27","2026-05-28","2026-05-29","2026-05-30","2026-05-31","2026-06-01","2026-06-02","2026-06-03","2026-06-04","2026-06-05","2026-06-06","2026-06-07","2026-06-08","2026-06-09","2026-06-10","2026-06-11","2026-06-12","2026-06-13","2026-06-14","2026-06-15","2026-06-16","2026-06-17","2026-06-18","2026-06-19","2026-06-20","2026-06-21","2026-06-22","2026-06-23","2026-06-24","2026-06-25","2026-06-26","2026-06-27","2026-06-28","2026-06-29","2026-06-30","2026-07-01","2026-07-02","2026-07-03","2026-07-04","2026-07-05","2026-07-06","2026-07-07","2026-07-08","2026-07-09","2026-07-10","2026-07-11","2026-07-12","2026-07-13","2026-07-14","2026-07-15","2026-07-16","2026-07-17","2026-07-18","2026-07-19","2026-07-20","2026-07-21","2026-07-22","2026-07-23","2026-07-24","2026-07-25","2026-07-26","2026-07-27","2026-07-28","2026-07-29","2026-07-30","2026-07-31","2026-08-01","2026-08-02","2026-08-03","2026-08-04","2026-08-05","2026-08-06","2026-08-07","2026-08-08","2026-08-09","2026-08-10","2026-08-11","2026-08-12","2026-08-13","2026-08-14","2026-08-15","2026-08-16","2026-08-17","2026-08-18","2026-08-19","2026-08-20","2026-08-21","2026-08-22","2026-08-23","2026-08-24","2026-08-25","2026-08-26","2026-08-27","2026-08-28","2026-08-29","2026-08-30","2026-08-31","2026-09-01","2026-09-02","2026-09-03","2026-09-04","2026-09-05","2026-09-06","2026-09-07","2026-09-08","2026-09-09","2026-09-10","2026-09-11","2026-09-12","2026-09-13","2026-09-14","2026-09-15","2026-09-16","2026-09-17","2026-09-18","2026-09-19","2026-09-20","2026-09-21","2026-09-22","2026-09-23","2026-09-24","2026-09-25","2026-09-26","2026-09-27","2026-09-28","2026-09-29","2026-09-30","2026-10-01","2026-10-02","2026-10-03","2026-10-04","2026-10-05","2026-10-06","2026-10-07","2026-10-08","2026-10-09","2026-10-10","2026-10-11","2026-10-12","2026-10-13","2026-10-14","2026-10-15","2026-10-16","2026-10-17","2026-10-18","2026-10-19","2026-10-20","2026-10-21","2026-10-22","2026-10-23","2026-10-24","2026-10-25","2026-10-26","2026-10-27","2026-10-28","2026-10-29","2026-10-30","2026-10-31","2026-11-01","2026-11-02","2026-11-03","2026-11-04","2026-11-05","2026-11-06","2026-11-07","2026-11-08","2026-11-09","2026-11-10","2026-11-11","2026-11-12","2026-11-13","2026-11-14","2026-11-15","2026-11-16","2026-11-17","2026-11-18","2026-11-19","2026-11-20","2026-11-21","2026-11-22","2026-11-23","2026-11-24","2026-11-25","2026-11-26","2026-11-27","2026-11-28","2026-11-29","2026-11-30","2026-12-01","2026-12-02","2026-12-03","2026-12-04","2026-12-05","2026-12-06","2026-12-07","2026-12-08","2026-12-09","2026-12-10","2026-12-11","2026-12-12","2026-12-13","2026-12-14","2026-12-15","2026-12-16","2026-12-17","2026-12-18","2026-12-19","2026-12-20","2026-12-21","2026-12-22","2026-12-23","2026-12-24","2026-12-25","2026-12-26","2026-12-27","2026-12-28","2026-12-29","2026-12-30","2026-12-31","2027-01-01","2027-01-02","2027-01-03","2027-01-04","2027-01-05","2027-01-06","2027-01-07","2027-01-08","2027-01-09","2027-01-10","2027-01-11","2027-01-12","2027-01-13","2027-01-14","2027-01-15","2027-01-16","2027-01-17","2027-01-18","2027-01-19","2027-01-20","2027-01-21","2027-01-22","2027-01-23","2027-01-24","2027-01-25","2027-01-26","2027-01-27","2027-01-28","2027-01-29","2027-01-30","2027-01-31","2027-02-01","2027-02-02","2027-02-03","2027-02-04","2027-02-05","2027-02-06","2027-02-07","2027-02-08","2027-02-09","2027-02-10","2027-02-11","2027-02-12","2027-02-13","2027-02-14","2027-02-15","2027-02-16","2027-02-17","2027-02-18","2027-02-19","2027-02-20","2027-02-21","2027-02-22","2027-02-23","2027-02-24","2027-02-25","2027-02-26","2027-02-27","2027-02-28","2027-03-01","2027-03-02","2027-03-03","2027-03-04","2027-03-05","2027-03-06","2027-03-07","2027-03-08","2027-03-09","2027-03-10","2027-03-11","2027-03-12","2027-03-13","2027-03-14","2027-03-15","2027-03-16","2027-03-17","2027-03-18","2027-03-19","2027-03-20","2027-03-21","2027-03-22","2027-03-23","2027-03-24","2027-03-25","2027-03-26","2027-03-27","2027-03-28","2027-03-29","2027-03-30","2027-03-31","2027-04-01","2027-04-02","2027-04-03","2027-04-04","2027-04-05","2027-04-06","2027-04-07","2027-04-08","2027-04-09","2027-04-10","2027-04-11","2027-04-12","2027-04-13","2027-04-14","2027-04-15","2027-04-16","2027-04-17","2027-04-18","2027-04-19","2027-04-20","2027-04-21","2027-04-22","2027-04-23","2027-04-24","2027-04-25","2027-04-26","2027-04-27","2027-04-28","2027-04-29","2027-04-30","2027-05-01","2027-05-02","2027-05-03","2027-05-04","2027-05-05","2027-05-06","2027-05-07","2027-05-08","2027-05-09","2027-05-10","2027-05-11","2027-05-12","2027-05-13","2027-05-14","2027-05-15","2027-05-16","2027-05-17","2027-05-18","2027-05-19","2027-05-20","2027-05-21","2027-05-22","2027-05-23","2027-05-24","2027-05-25","2027-05-26","2027-05-27","2027-05-28","2027-05-29","2027-05-30","2027-05-31","2027-06-01","2027-06-02","2027-06-03","2027-06-04","2027-06-05","2027-06-06","2027-06-07","2027-06-08","2027-06-09","2027-06-10","2027-06-11","2027-06-12","2027-06-13","2027-06-14","2027-06-15","2027-06-16","2027-06-17","2027-06-18","2027-06-19","2027-06-20","2027-06-21","2027-06-22","2027-06-23","2027-06-24","2027-06-25","2027-06-26","2027-06-27","2027-06-28","2027-06-29","2027-06-30","2027-07-01","2027-07-02","2027-07-03","2027-07-04","2027-07-05","2027-07-06","2027-07-07","2027-07-08","2027-07-09","2027-07-10","2027-07-11","2027-07-12","2027-07-13","2027-07-14","2027-07-15","2027-07-16","2027-07-17","2027-07-18","2027-07-19","2027-07-20","2027-07-21","2027-07-22","2027-07-23","2027-07-24","2027-07-25","2027-07-26","2027-07-27","2027-07-28","2027-07-29","2027-07-30","2027-07-31","2027-08-01","2027-08-02","2027-08-03","2027-08-04","2027-08-05","2027-08-06","2027-08-07","2027-08-08","2027-08-09","2027-08-10","2027-08-11","2027-08-12","2027-08-13","2027-08-14","2027-08-15","2027-08-16","2027-08-17","2027-08-18","2027-08-19","2027-08-20","2027-08-21","2027-08-22","2027-08-23","2027-08-24","2027-08-25","2027-08-26","2027-08-27","2027-08-28","2027-08-29","2027-08-30","2027-08-31","2027-09-01","2027-09-02","2027-09-03","2027-09-04","2027-09-05","2027-09-06","2027-09-07","2027-09-08","2027-09-09","2027-09-10","2027-09-11","2027-09-12","2027-09-13","2027-09-14","2027-09-15","2027-09-16","2027-09-17","2027-09-18","2027-09-19","2027-09-20","2027-09-21","2027-09-22","2027-09-23","2027-09-24","2027-09-25","2027-09-26","2027-09-27","2027-09-28","2027-09-29","2027-09-30","2027-10-01","2027-10-02","2027-10-03","2027-10-04","2027-10-05","2027-10-06","2027-10-07","2027-10-08","2027-10-09","2027-10-10","2027-10-11","2027-10-12","2027-10-13","2027-10-14","2027-10-15","2027-10-16","2027-10-17","2027-10-18","2027-10-19","2027-10-20","2027-10-21","2027-10-22","2027-10-23","2027-10-24","2027-10-25","2027-10-26","2027-10-27","2027-10-28","2027-10-29","2027-10-30","2027-10-31","2027-11-01","2027-11-02","2027-11-03","2027-11-04","2027-11-05","2027-11-06","2027-11-07","2027-11-08","2027-11-09","2027-11-10","2027-11-11","2027-11-12","2027-11-13","2027-11-14","2027-11-15","2027-11-16","2027-11-17","2027-11-18","2027-11-19","2027-11-20","2027-11-21","2027-11-22","2027-11-23","2027-11-24","2027-11-25","2027-11-26","2027-11-27","2027-11-28","2027-11-29","2027-11-30","2027-12-01","2027-12-02","2027-12-03","2027-12-04","2027-12-05","2027-12-06","2027-12-07","2027-12-08","2027-12-09","2027-12-10","2027-12-11","2027-12-12","2027-12-13","2027-12-14","2027-12-15","2027-12-16","2027-12-17","2027-12-18","2027-12-19","2027-12-20","2027-12-21","2027-12-22","2027-12-23","2027-12-24","2027-12-25","2027-12-26","2027-12-27","2027-12-28","2027-12-29","2027-12-30","2027-12-31","2028-01-01","2028-01-02","2028-01-03","2028-01-04","2028-01-05","2028-01-06","2028-01-07","2028-01-08","2028-01-09","2028-01-10","2028-01-11","2028-01-12","2028-01-13","2028-01-14","2028-01-15","2028-01-16","2028-01-17","2028-01-18","2028-01-19","2028-01-20","2028-01-21","2028-01-22","2028-01-23","2028-01-24","2028-01-25","2028-01-26","2028-01-27","2028-01-28","2028-01-29","2028-01-30","2028-01-31","2028-02-01","2028-02-02","2028-02-03","2028-02-04","2028-02-05","2028-02-06","2028-02-07","2028-02-08","2028-02-09","2028-02-10","2028-02-11","2028-02-12","2028-02-13","2028-02-14","2028-02-15","2028-02-16","2028-02-17","2028-02-18","2028-02-19","2028-02-20","2028-02-21","2028-02-22","2028-02-23","2028-02-24","2028-02-25","2028-02-26","2028-02-27","2028-02-28","2028-02-29","2028-03-01","2028-03-02","2028-03-03","2028-03-04","2028-03-05","2028-03-06","2028-03-07","2028-03-08","2028-03-09","2028-03-10","2028-03-11","2028-03-12","2028-03-13","2028-03-14","2028-03-15","2028-03-16","2028-03-17","2028-03-18","2028-03-19","2028-03-20","2028-03-21","2028-03-22","2028-03-23","2028-03-24","2028-03-25","2028-03-26","2028-03-27","2028-03-28","2028-03-29","2028-03-30","2028-03-31","2028-04-01","2028-04-02","2028-04-03","2028-04-04","2028-04-05","2028-04-06","2028-04-07","2028-04-08","2028-04-09","2028-04-10","2028-04-11","2028-04-12","2028-04-13","2028-04-14","2028-04-15","2028-04-16","2028-04-17","2028-04-18","2028-04-19","2028-04-20","2028-04-21","2028-04-22","2028-04-23","2028-04-24","2028-04-25","2028-04-26","2028-04-27","2028-04-28","2028-04-29","2028-04-30","2028-05-01","2028-05-02","2028-05-03","2028-05-04","2028-05-05","2028-05-06","2028-05-07","2028-05-08","2028-05-09","2028-05-10","2028-05-11","2028-05-12","2028-05-13","2028-05-14","2028-05-15","2028-05-16","2028-05-17","2028-05-18","2028-05-19","2028-05-20","2028-05-21","2028-05-22","2028-05-23","2028-05-24","2028-05-25","2028-05-26","2028-05-27","2028-05-28","2028-05-29","2028-05-30","2028-05-31","2028-06-01","2028-06-02","2028-06-03","2028-06-04","2028-06-05","2028-06-06","2028-06-07","2028-06-08","2028-06-09","2028-06-10","2028-06-11","2028-06-12","2028-06-13","2028-06-14","2028-06-15","2028-06-16","2028-06-17","2028-06-18","2028-06-19","2028-06-20","2028-06-21","2028-06-22","2028-06-23","2028-06-24","2028-06-25","2028-06-26","2028-06-27","2028-06-28","2028-06-29","2028-06-30","2028-07-01","2028-07-02","2028-07-03","2028-07-04","2028-07-05","2028-07-06","2028-07-07","2028-07-08","2028-07-09","2028-07-10","2028-07-11","2028-07-12","2028-07-13","2028-07-14","2028-07-15","2028-07-16","2028-07-17","2028-07-18","2028-07-19","2028-07-20","2028-07-21","2028-07-22","2028-07-23","2028-07-24","2028-07-25","2028-07-26","2028-07-27","2028-07-28","2028-07-29","2028-07-30","2028-07-31","2028-08-01","2028-08-02","2028-08-03","2028-08-04","2028-08-05","2028-08-06","2028-08-07","2028-08-08","2028-08-09","2028-08-10","2028-08-11","2028-08-12","2028-08-13","2028-08-14","2028-08-15","2028-08-16","2028-08-17","2028-08-18","2028-08-19","2028-08-20","2028-08-21","2028-08-22","2028-08-23","2028-08-24","2028-08-25","2028-08-26","2028-08-27","2028-08-28","2028-08-29","2028-08-30","2028-08-31","2028-09-01","2028-09-02","2028-09-03","2028-09-04","2028-09-05","2028-09-06","2028-09-07","2028-09-08","2028-09-09","2028-09-10","2028-09-11","2028-09-12","2028-09-13","2028-09-14","2028-09-15","2028-09-16","2028-09-17","2028-09-18","2028-09-19","2028-09-20","2028-09-21","2028-09-22","2028-09-23","2028-09-24","2028-09-25","2028-09-26","2028-09-27","2028-09-28","2028-09-29","2028-09-30","2028-10-01","2028-10-02","2028-10-03","2028-10-04","2028-10-05","2028-10-06","2028-10-07","2028-10-08","2028-10-09","2028-10-10","2028-10-11","2028-10-12","2028-10-13","2028-10-14","2028-10-15","2028-10-16","2028-10-17","2028-10-18","2028-10-19","2028-10-20","2028-10-21","2028-10-22","2028-10-23","2028-10-24","2028-10-25","2028-10-26","2028-10-27","2028-10-28","2028-10-29","2028-10-30","2028-10-31","2028-11-01","2028-11-02","2028-11-03","2028-11-04","2028-11-05","2028-11-06","2028-11-07","2028-11-08","2028-11-09","2028-11-10","2028-11-11","2028-11-12","2028-11-13","2028-11-14","2028-11-15","2028-11-16","2028-11-17","2028-11-18","2028-11-19","2028-11-20","2028-11-21","2028-11-22","2028-11-23","2028-11-24","2028-11-25","2028-11-26","2028-11-27","2028-11-28","2028-11-29","2028-11-30","2028-12-01","2028-12-02","2028-12-03","2028-12-04","2028-12-05","2028-12-06","2028-12-07","2028-12-08","2028-12-09","2028-12-10","2028-12-11","2028-12-12","2028-12-13","2028-12-14","2028-12-15","2028-12-16","2028-12-17","2028-12-18","2028-12-19","2028-12-20","2028-12-21","2028-12-22","2028-12-23","2028-12-24","2028-12-25","2028-12-26","2028-12-27","2028-12-28","2028-12-29","2028-12-30","2028-12-31","2029-01-01","2029-01-02","2029-01-03","2029-01-04","2029-01-05","2029-01-06","2029-01-07","2029-01-08","2029-01-09","2029-01-10","2029-01-11","2029-01-12","2029-01-13","2029-01-14","2029-01-15","2029-01-16","2029-01-17","2029-01-18","2029-01-19","2029-01-20","2029-01-21","2029-01-22","2029-01-23","2029-01-24","2029-01-25","2029-01-26","2029-01-27","2029-01-28","2029-01-29","2029-01-30","2029-01-31","2029-02-01","2029-02-02","2029-02-03","2029-02-04","2029-02-05","2029-02-06","2029-02-07","2029-02-08","2029-02-09","2029-02-10","2029-02-11","2029-02-12","2029-02-13","2029-02-14","2029-02-15","2029-02-16","2029-02-17","2029-02-18","2029-02-19","2029-02-20","2029-02-21","2029-02-22","2029-02-23","2029-02-24","2029-02-25","2029-02-26","2029-02-27","2029-02-28","2029-03-01","2029-03-02","2029-03-03","2029-03-04","2029-03-05","2029-03-06","2029-03-07","2029-03-08","2029-03-09","2029-03-10","2029-03-11","2029-03-12","2029-03-13","2029-03-14","2029-03-15","2029-03-16","2029-03-17","2029-03-18","2029-03-19","2029-03-20","2029-03-21","2029-03-22","2029-03-23","2029-03-24","2029-03-25","2029-03-26","2029-03-27","2029-03-28","2029-03-29","2029-03-30","2029-03-31","2029-04-01","2029-04-02","2029-04-03","2029-04-04","2029-04-05","2029-04-06","2029-04-07","2029-04-08","2029-04-09","2029-04-10","2029-04-11","2029-04-12","2029-04-13","2029-04-14","2029-04-15","2029-04-16","2029-04-17","2029-04-18","2029-04-19","2029-04-20","2029-04-21","2029-04-22","2029-04-23","2029-04-24","2029-04-25","2029-04-26","2029-04-27","2029-04-28","2029-04-29","2029-04-30","2029-05-01","2029-05-02","2029-05-03","2029-05-04","2029-05-05","2029-05-06","2029-05-07","2029-05-08","2029-05-09","2029-05-10","2029-05-11","2029-05-12","2029-05-13","2029-05-14","2029-05-15","2029-05-16","2029-05-17","2029-05-18","2029-05-19","2029-05-20","2029-05-21","2029-05-22","2029-05-23","2029-05-24","2029-05-25","2029-05-26","2029-05-27","2029-05-28","2029-05-29","2029-05-30","2029-05-31","2029-06-01","2029-06-02","2029-06-03","2029-06-04","2029-06-05","2029-06-06","2029-06-07","2029-06-08","2029-06-09","2029-06-10","2029-06-11","2029-06-12","2029-06-13","2029-06-14","2029-06-15","2029-06-16","2029-06-17","2029-06-18","2029-06-19","2029-06-20","2029-06-21","2029-06-22","2029-06-23","2029-06-24","2029-06-25","2029-06-26","2029-06-27","2029-06-28","2029-06-29","2029-06-30","2029-07-01","2029-07-02","2029-07-03","2029-07-04","2029-07-05","2029-07-06","2029-07-07","2029-07-08","2029-07-09","2029-07-10","2029-07-11","2029-07-12","2029-07-13","2029-07-14","2029-07-15","2029-07-16","2029-07-17","2029-07-18","2029-07-19","2029-07-20","2029-07-21","2029-07-22","2029-07-23","2029-07-24","2029-07-25","2029-07-26","2029-07-27","2029-07-28","2029-07-29","2029-07-30","2029-07-31","2029-08-01","2029-08-02","2029-08-03","2029-08-04","2029-08-05","2029-08-06","2029-08-07","2029-08-08","2029-08-09","2029-08-10","2029-08-11","2029-08-12","2029-08-13","2029-08-14","2029-08-15","2029-08-16","2029-08-17","2029-08-18","2029-08-19","2029-08-20","2029-08-21","2029-08-22","2029-08-23","2029-08-24","2029-08-25","2029-08-26","2029-08-27","2029-08-28","2029-08-29","2029-08-30","2029-08-31","2029-09-01","2029-09-02","2029-09-03","2029-09-04","2029-09-05","2029-09-06","2029-09-07","2029-09-08","2029-09-09","2029-09-10","2029-09-11","2029-09-12","2029-09-13","2029-09-14","2029-09-15","2029-09-16","2029-09-17","2029-09-18","2029-09-19","2029-09-20","2029-09-21","2029-09-22","2029-09-23","2029-09-24","2029-09-25","2029-09-26","2029-09-27","2029-09-28","2029-09-29","2029-09-30","2029-10-01","2029-10-02","2029-10-03","2029-10-04","2029-10-05","2029-10-06","2029-10-07","2029-10-08","2029-10-09","2029-10-10","2029-10-11","2029-10-12","2029-10-13","2029-10-14","2029-10-15","2029-10-16","2029-10-17","2029-10-18","2029-10-19","2029-10-20","2029-10-21","2029-10-22","2029-10-23","2029-10-24","2029-10-25","2029-10-26","2029-10-27","2029-10-28","2029-10-29","2029-10-30","2029-10-31","2029-11-01","2029-11-02","2029-11-03","2029-11-04","2029-11-05","2029-11-06","2029-11-07","2029-11-08","2029-11-09","2029-11-10","2029-11-11","2029-11-12","2029-11-13","2029-11-14","2029-11-15","2029-11-16","2029-11-17","2029-11-18","2029-11-19","2029-11-20","2029-11-21","2029-11-22","2029-11-23","2029-11-24","2029-11-25","2029-11-26","2029-11-27","2029-11-28","2029-11-29","2029-11-30","2029-12-01","2029-12-02","2029-12-03","2029-12-04","2029-12-05","2029-12-06","2029-12-07","2029-12-08","2029-12-09","2029-12-10","2029-12-11","2029-12-12","2029-12-13","2029-12-14","2029-12-15","2029-12-16","2029-12-17","2029-12-18","2029-12-19","2029-12-20","2029-12-21","2029-12-22","2029-12-23","2029-12-24","2029-12-25","2029-12-26","2029-12-27","2029-12-28","2029-12-29","2029-12-30","2029-12-31","2030-01-01","2030-01-02","2030-01-03","2030-01-04","2030-01-05","2030-01-06","2030-01-07","2030-01-08","2030-01-09","2030-01-10","2030-01-11","2030-01-12","2030-01-13","2030-01-14","2030-01-15","2030-01-16","2030-01-17","2030-01-18","2030-01-19","2030-01-20","2030-01-21","2030-01-22","2030-01-23","2030-01-24","2030-01-25","2030-01-26","2030-01-27","2030-01-28","2030-01-29","2030-01-30","2030-01-31","2030-02-01","2030-02-02","2030-02-03","2030-02-04","2030-02-05","2030-02-06","2030-02-07","2030-02-08","2030-02-09","2030-02-10","2030-02-11","2030-02-12","2030-02-13","2030-02-14","2030-02-15","2030-02-16","2030-02-17","2030-02-18","2030-02-19","2030-02-20","2030-02-21","2030-02-22","2030-02-23","2030-02-24","2030-02-25","2030-02-26","2030-02-27","2030-02-28","2030-03-01","2030-03-02","2030-03-03","2030-03-04","2030-03-05","2030-03-06","2030-03-07","2030-03-08","2030-03-09","2030-03-10","2030-03-11","2030-03-12","2030-03-13","2030-03-14","2030-03-15","2030-03-16","2030-03-17","2030-03-18","2030-03-19","2030-03-20","2030-03-21","2030-03-22","2030-03-23","2030-03-24","2030-03-25","2030-03-26","2030-03-27","2030-03-28","2030-03-29","2030-03-30","2030-03-31","2030-04-01","2030-04-02","2030-04-03","2030-04-04","2030-04-05"]
[null,null,{"$f":"IF(Données!A2<>\"\",Données!A2,\"\")","v":"Valentin"}]
[null,null,{"$f":"IF(Données!A3<>\"\",Données!A3,\"\")","v":"Cyril"}]
[null,null,{"$f":"IF(Données!A4<>\"\",Données!A4,\"\")","v":"Philippe"}]
[null,null,{"$f":"IF(Données!A5<>\"\",Données!A5,\"\")","v":"Arnaud"}]
[null,null,{"$f":"IF(Données!A6<>\"\",Données!A6,\"\")","v":""}]
[null,null,{"$f":"IF(Données!A7<>\"\",Données!A7,\"\")","v":""}]
[null,null,{"$f":"IF(Données!A8<>\"\",Données!A8,\"\")","v":""}]
[null,null,{"$f":"IF(Données!A9<>\"\",Données!A9,\"\")","v":""}]
[null,null,{"$f":"IF(Données!A10<>\"\",Données!A10,\"\")","v":""}]
[null,null,{"$f":"IF(Données!A11<>\"\",Données!A11,\"\")","v":""}]
[null,null,{"$f":"IF(Données!A12<>\"\",Données!A12,\"\")","v":""}]
[null,null,{"$f":"IF(Données!A13<>\"\",Données!A13,\"\")","v":""}]
[null,null,{"$f":"IF(Données!A14<>\"\",Données!A14,\"\")","v":""}]
[null,null,{"$f":"IF(Données!A15<>\"\",Données!A15,\"\")","v":""}]
[null,null,{"$f":"IF(Données!A16<>\"\",Données!A16,\"\")","v":""}]
[null,null,{"$f":"IF(Données!A17<>\"\",Données!A17,\"\")","v":""}]
[null,null,{"$f":"IF(Données!A18<>\"\",Données!A18,\"\")","v":""}]
[null,null,{"$f":"IF(Données!A19<>\"\",Données!A19,\"\")","v":""}]
[null,null,{"$f":"IF(Données!A20<>\"\",Données!A20,\"\")","v":""}]
[null,null,{"$f":"IF(Données!A21<>\"\",Données!A21,\"\")","v":""}]
[null,null,{"$f":"IF(Données!A22<>\"\",Données!A22,\"\")","v":""}]
[]
[null,null,{"$f":"IF(Données!A34<>\"\",Données!A34,\"\")","v":""}]
[null,null,{"$f":"IF(Données!A35<>\"\",Données!A35,\"\")","v":""}]
[null,null,{"$f":"IF(Données!A36<>\"\",Données!A36,\"\")","v":""}]
[null,null,{"$f":"IF(Données!A37<>\"\",Données!A37,\"\")","v":""}]
[null,null,{"$f":"IF(Données!A38<>\"\",Données!A38,\"\")","v":""}]
[null,null,{"$f":"IF(Données!A39<>\"\",Données!A39,\"\")","v":""}]
[null,null,{"$f":"IF(Données!A40<>\"\",Données!A40,\"\")","v":""}]
[null,null,{"$f":"IF(Données!A41<>\"\",Données!A41,\"\")","v":""}]
[null,null,{"$f":"IF(Données!A42<>\"\",Données!A42,\"\")","v":""}]
[null,null,{"$f":"IF(Données!A43<>\"\",Données!A43,\"\")","v":""}]
[null,null,{"$f":"IF(Données!A44<>\"\",Données!A44,\"\")","v":""}]
[null,null,{"$f":"IF(Données!A45<>\"\",Données!A45,\"\")","v":""}]
[null,null,{"$f":"IF(Données!A46<>\"\",Données!A46,\"\")","v":""}]
[null,null,{"$f":"IF(Données!A47<>\"\",Données!A47,\"\")","v":""}]

{"sheet":"Données","index":2,"n_rows":5,"n_cols":1,"rows_kept":5,"merged":[[15,2,19,2]]}
["Equipe:"]
["Valentin"]
["Cyril"]
["Philippe"]
["Arnaud"]