{"text_format":"3","workbook":"xlsx","n_sheets":3,"sheets":["Companies","Unpaid_details","Access"],"not_rendered":{"macros":1,"defined_names":2},"read":"whole","date_system":"1900"}

{"sheet":"Companies","index":0,"n_rows":1218,"n_cols":13,"rows_kept":1218,"merged":[[0,0,1,0],[0,1,1,1],[0,2,0,12],[1,2,1,3],[1,4,1,5],[1,6,1,7],[1,8,1,9],[1,10,1,11]]}
["Cstmr No.","COSTUMERS","CONTACTS (Family Name and email)"]
[null,null,"Unpaid contact",null,"Invoicing contact 1",null,"Invoicing contact 2",null,"Accounting",null,"Other",null,"CONSULTANTS"]
[108,"Batm Advanced Communications Ltd",{"$nulls":9},"sigalit@batm.co.il","mamamamama"]
[2089,"EMERSON PROCESS MANAGEMENT bv",{"$nulls":9},"leo.zwinkels@emerson.com"]
[2155,"AR Metallizing NV",{"$nulls":7},"e.eerdekens@armetallizing.com"]
[2317,"Amcor Flexibles France SAS",{"$nulls":3},"stephanie.toussaint@amcor.com"]
[2364,"GMR MARKETING GMBH",{"$nulls":9},"yostermann@gmrmarketing.com"]
[2390,"FLUOR ENGINEERING N.V.",{"$nulls":3},"arno.van.slooten@fluor.com"]
[2404,"SCA Hygiene Slovakia sro (old Georgia-Pacific_Slovakia_sr.o)",{"$nulls":7},"freddy.jordens@sca.com"]
[2481,"TEERAG ASDAG",{"$nulls":3},"gerlinde.kloettler@porr.at"]
[4004,"MOTA-ENGIL SGPS S.A.",{"$nulls":3},"jose.a.pinto@mota-engil.pt ",null,"luis.miguel.sousa@mota-engil.pt"]
[8174,"MAGNA Powertrain GmbH & Co KG",{"$nulls":3},"bianca.macher@magna.com",null,"martina.vanik@magna.com"]
[8175,"MAGNA STEYR FAHRZEUGTECHNIK AG & CO KG",{"$nulls":3},"manfred.zatsch@magna.com",null,"hermine.kindermann@magna.com"]
[8530,"Mota-Engil, Engenharia e Construção, S.A.",{"$nulls":3},"jose.a.pinto@mota-engil.pt ",null,"luis.miguel.sousa@mota-engil.pt"]
[8854,"PACIFIC TEST COMPANY 1",{"$nulls":7},"josemiguelrst@gmail.com"]
[8876,"Thomas Cook Services Center",{"$nulls":7},"johan.bohyn@thomascook.be"]
[9546,"BEUMER Group A/S",{"$nulls":3},"kirsten.munk-stengaard@beumergroup.com"]
[10598,"Icopal Danmark A/S"]
[11408,"ERNST & YOUNG TAX CONSULTANTS",{"$nulls":3},"houssame.achouri@be.ey.com"]
[11705,"ALGECO GMBH",{"$nulls":7},"stefanie.mayerl@algeco.de"]
[17652,"UNILEVER POLSKA S.A."]
[18268,"Alstom Power Hydraulique"]
[18292,"Laboratoires Expanscience"]
[18298,"ISS Propreté"]
[18401,"EADS France S.A.S."]
[18862,"ARVAL SERVICE LEASE SA"]
[19064,"AVIS LOCATION DE VOITURE S.A."]
[19067,"Avon S.A.S. France"]
[19097,"BACCARAT"]
[19569,"CAILLAU"]
[20244,"CMA CGM"]
[20514,"CROWN EMBALLAGE FRANCE SAS"]
[20556,"SCHMIDT GROUP SAS(former SALM Société Alsacienne du meuble)"]
[20778,"DEVANLAY S.A."]
[20918,"Duclos International"]
[21067,"MONDADORI MAGAZINES FRANCE"]
[21186,"KLEPIERRE MANAGEMENT (ex.SEGECE)"]
[21301,"EVOBUS FRANCE SAS"]
[21659,"FROMAGERIES BEL"]
[22082,"Guy Degrenne SA"]
[22141,"Goss International"]
[22152,"HENKEL"]
[22166,"HERMES SELLIER SAS"]
[22237,"Hutchinson Centre administratif"]
[22827,"Amcor Flexibles Sarrebourg SAS"]
[23125,"Spherea Test & Services  (ex Cassidian Test & Services SAS)"]
[23496,"NOVO NORDISK PHARMACEUTIQUE SAS"]
[23602,"OSIATIS FRANCE"]
[24047,"RADIALL"]
[24305,"SG Cristaux & Detecteurs"]
[24320,"SAINT GOBAIN EUROCOUSTIC"]
[24325,"SAINT GOBAIN ISOVER"]
[24342,"SAINT GOBAIN SEKURIT FRANCE"]
[24355,"SAINT GOBAIN VETROTECH ATLANTIQUE"]
[24516,"Services Techniques Schlumberger SA"]
[24529,"ETUDES ET PRODUCTIONS SCHLUMBERGER SA"]
[24625,"CARLSON WAGONLIT TRAVEL SAS"]
[24693,"SEPTODONT SAS"]
[25028,"SOFRUCE SAS"]
[25098,"BOLTON SOLITAIRE SA"]
[25231,"Sovis / do not use / doublon de 48818"]
[25302,"SERVICES PETROLIERS SCHLUMBERGER SA"]
[26079,"URGO LABORATOIRES"]
[26106,"VALEO SA"]
[26108,"VALEO Matériaux de Friction"]
[26110,"VALEO EMBRAYAGES SASU"]
[26146,"AML Systems"]
[26180,"APTAR FRANCE SAS (VALOIS SAS)"]
[26226,"Societe Verriere De L'Atlantique"]
[26344,"SIERRA WIRELESS"]
[26415,"YVES ROCHER LABORATOIRES DE BIOLOGIE VEGETALE"]
[26454,"SKF France"]
[26966,"AREVA SA"]
[27533,"QUINTILES BENEFIT FRANCE SNC"]
[27690,"PATISSERIES GOURMANDES SA"]
[27692,"NEOLAIT SAS"]
[27769,"GROUPE ROYER"]
[28051,"MARESE"]
[28072,"SNEF"]
[28157,"EUROFLOAT"]
[28420,"GODART - WESTAFLEX"]
[28476,"Yanmar Construction Equipment Europe SAS"]
[28602,"AFFIVAL SAS"]
[28843,"JOHN CRANE FRANCE"]
[28864,"MPH GROUPE SAS"]
[29114,"SAVOIE REFRACTAIRES"]
[29174,"SOVEDYS"]
[29353,"Saint-Gobain Glass Solutions Grand Ouest (former MIROITERIES DE L OUEST PAYS DE LOIRE)"]
[29503,"EUROKA"]
[30405,"Hill-Rom SAS"]
[30748,"LABORATOIRES THEA"]
[30946,"MultiAir France (old Compresseurs Worthington Creyssensac)"]
[31374,"T-SYSTEMS FRANCE SAS"]
[31809,"CLS REMY COINTREAU"]
[31820,"AUSTRALIE"]
[32179,"BOUYGUES TRAVAUX PUBLICS"]
[32655,"IER"]
[32739,"PIONEER FRANCE SA"]
[32774,"SIEMENS SAS"]
[32922,"ORFI"]
[32932,"MC CAIN ALIMENTAIRE SAS"]
[33168,"DURISOTTI SAS"]
[33402,"Kermel SAS"]
[34735,"WATERS SAS"]
[36671,"TÜV RHEINLAND KRAFTFAHRT GMBH"]
[36902,"Plastic Omnium Auto Components GmbH"]
[37264,"GRC GLOBAL RIVER CRUISES GMBH"]
[40776,"APPLIED MATERIALS EUROPE B.V."]
[41280,"Rip Curl Europe SAS"]
[41335,"NEXANS FRANCE SAS"]
[41382,"CDISCOUNT"]
[41519,"LISI AEROSPACE"]
[41909,"VISOTEC ARLUX"]
[42222,"ITRON France"]
[42318,"APPLIED MATERIALS FRANCE SARL"]
[42564,"VALEO SYSTEMES D ESSUYAGE"]
[42690,"FUJIFILM FRANCE S.A.S."]
[42920,"POTEL ET CHABOT"]
[42951,"MACO PRODUCTIONS FRANCE SAS"]
[43121,"SYNGENTA AGRO SAS"]
[43145,"NLMK COATING"]
[43255,"KIABI EUROPE"]
[43523,"LES MENUISERIES DU CENTRE S.A.S."]
[43868,"COOPER STANDARD FRANCE SAS"]
[43952,"HUTCHINSON SNC"]
[44648,"SAINT GOBAIN QUARTZ SAS"]
[44722,"Albéa Le Treport SASU (Rexam)"]
[44726,"SIVAQ Sté Industrielle Vitrage d Aquitaine"]
[44921,"SAMSKIP HOLDING B.V."]
[47050,"GOAVEC ENGINEERING"]
[48818,"SAINT GOBAIN SOVIS"]
[51981,"Le Joint Français (LJF) SNC"]
[52032,"Montaigne Diffusion"]
[52034,"Lelievre"]
[52078,"FUJITSU TECHNOLOGY SOLUTIONS"]
[52210,"Pierre & Vacances Conseil Immobilier"]
[52228,"RUBIS TERMINAL"]
[52239,"REPETTO RETAIL SARL"]
[53431,"Société Verriere Française"]
[53784,"Rue du Commerce SA"]
[54255,"FEV SOFTWARE AND TESTING SOLUTIONS (from 01/01/2018 Old FEV SA - old D2T)"]
[54361,"CHR HANSEN FRANCE S.A.S."]
[54402,"CAP BOULANGER SCS (anciennement MÉDIA SATURN FRANCE)"]
[54814,"Saint Gobain Glass Solutions Sud Est (Gobba Vitrage)"]
[55092,"Société Verriere d'Encapsulation"]
[55307,"SIEMENS VAI METALS Technologies SAS"]
[55744,"WEHR MIROITERIE"]
[56561,"M.A. SAS"]
[56696,"COTUMER SAS (Cie de Tuyauterie et Mécanique Réunies)"]
[57776,"HMF FOOD PRODUCTION GMBH & CO. KG"]
[58047,"Dalkia SA-NV"]
[58096,"AGC Glass Europe Sales SA"]
[58246,"Valeo Vision Belgique SA"]
[58254,"VF Europe Bvba"]
[58267,"AALBORG PORTLAND HOLDING A/S (old entity of Aalborg Portland A/S)"]
[58373,"Georg Jensen A/S"]
[58417,"LINAK A/S"]
[58490,"TDC A/S"]
[58511,"Vestas Manufacturing A/S"]
[58640,"Pilkington Automotive Finland Oy"]
[59728,"Husky Injection Molding Systems SA"]
[60019,"NOKIA SPAIN S.A. (old Alcatel Lucent España S.A.)"]
[60456,"PROSEGUR COMPANIA DE SEGURIDAD SA"]
[60467,"Renault Trucks España S.L."]
[60484,"Sacyr Vallehermoso S.A."]
[60524,"SKF Española S.A."]
[60620,"Uralita S.A."]
[60669,"BILLERUDKORSNÄS AB"]
[60853,"Perstorp Specialty Chemicals AB"]
[61689,"PROFI ENGINEERING Systems AG"]
[61700,"HENKEL BELGIUM OPERATIONS N.V.  (former HENKEL BELGIUM NV)"]
[61812,"VITO NV"]
[61908,"Le Vitrage Du Midi"]
[62060,"Ter Hell Plastic GmbH"]
[62708,"CEPSA QUIMICA SA"]
[63166,"PIONEER EUROPE NV"]
[63379,"APPLIED MATERIALS GMBH"]
[63565,"BAYER CROPSCIENCE DEUTSCHLAND GMBH"]
[63632,"BERTRANDT AG"]
[64223,"VION Move GmbH"]
[64318,"Valeo Wischersysteme GmbH"]
[66065,"S.E.T. SELECT ENERGY GMBH"]
[66178,"RHENUS AG & CO. KG"]
[66792,"Lurgi GmbH"]
[66906,"LEISTRITZ EXTRUSIONSTECHNIK GMBH"]
[67080,"KRONOS TITAN GMBH"]
[67385,"HUMANA MILCHINDUSTRIE GMBH"]
[67452,"HORNBACH HOLDING AG"]
[67453,"HORNBACH International GmbH"]
[67734,"GEORG VON HOLTZBRINCK GMBH & CO.KG"]
[68687,"CONDOR FLUGDIENST GMBH"]
[71041,"Imperial - Produtos Alimentares S.A."]
[71049,"Flowserve Portuguesa Mecanismos de Controle de Fluxos Lda"]
[71209,"CORPUS SIREO ASSET MANAGEMENT Commercial GMBH"]
[71845,"Montaco - Tratamentos Anticorrosivos e Construcao Civil Lda."]
[72497,"REMIA HANDELMAATSCHAPPIJ B.V."]
[72589,"Novozymes France S.A."]
[72974,"Novartis Pharma sa / nv"]
[72986,"ASTELLAS PHARMA INTERNATIONAL B.V."]
[73008,"Monier B.V"]
[73018,"Koninklijke Gazelle NV"]
[73069,"Avon Cosmetics GmbH"]
[73246,"VALEO KLIMASYSTEME GMBH"]
[73790,"Syngenta France S.A.S (ex Syngenta Seeds S.A.S)"]
[73797,"CMI Beugin SASU"]
[74290,"Alcodis"]
[75726,"CRI CATALYST COMPANY BELGIUM"]
[76179,"ARVAL BELGIUM N.V."]
[76652,"Syngenta Seeds B.V."]
[76747,"TÜV NORD INTERNATIONAL GMBH & CO. KG"]
[76910,"CHOCOLADEFABRIKEN LINDT & SPRÜNGLI GMBH"]
[79712,"ANOVA SEAFOOD B.V."]
[80740,"BOOKING.COM B.V."]
[81482,"COLOMBIER INTERNATIONAL B.V."]
[81567,"Continental Bakeries (Haust)  B.V."]
[82455,"ELECTRONICS FOR IMAGING B.V."]
[82658,"EQUENS N.V."]
[83333,"GEORGIA-PACIFIC NEDERLAND B.V."]
[83766,"HASBRO EUROPEAN TRADING BV"]
[85237,"LAMB WESTON / MEIJER V.O.F."]
[85499,"CB&I Nederland BV"]
[86779,"Roche Diagnostics Nederland B.V."]
[86982,"HEINEN & HOPMAN ENGINEERING B.V."]
[87157,"SCHOUTEN CERALCO B.V."]
[88369,"Terex European Holdings BV"]
[89861,"WOODWARD NEDERLAND BV"]
[89918,"YANMAR EUROPE B.V."]
[91534,"Westmetall GmbH & Co. KG."]
[91791,"Syngenta Seeds N.V."]
[91886,"QUARZWERKE GMBH"]
[92294,"Big Pear Limited"]
[92356,"TÜV RHEINLAND INDUSTRIE SERVICE"]
[92495,"LOGILENIA DISTRIBUCION FARMACEUTICA SL"]
[92610,"Lhoist"]
[92646,"T.R.W."]
[92649,"INERGY AUTOMOTIVE SYSTEMS GERMANY GMBH"]
[92685,"BAYER CROPSCIENCE AKTIENGESELLSCHAFT"]
[93091,"EUROPCELL GMBH"]
[93246,"ACTEMIUM PROCESS AUTOMOTIVE"]
[93254,"RHI AG"]
[93332,"W.H. BRADY n.v."]
[93371,"NEXANS NETWORK SOLUTIONS"]
[93373,"YAMAZAKI MAZAK EUROPE N.V"]
[93506,"TAKATA-PETRI (Sachsen) GmbH"]
[93615,"TÜV NORD AG"]
[93621,"SAPPI DEUTSCHLAND GMBH"]
[93650,"PEAC (GERMANY) GmbH  (former IKB LEASING GmbH)"]
[93857,"ALFRED E. TIEFENBACHER (GMBH & CO. KG)"]
[93911,"BUHLER GMBH"]
[93983,"HILTI BELGIQUE S.A."]
[94147,"Mercedes-Benz Financial Services BeLux NV"]
[94194,"Georgia Pacific Services SNC"]
[94220,"ISK BIOSCIENCES EUROPE NV"]
[94224,"Caldic Nederland B.V."]
[94241,"Korean Motor Company"]
[94481,"HORNBACH BAUMARKT AG"]
[94901,"TASSINARI ET CHATEL"]
[94908,"TÜV RHEINLAND SERVICE GMBH"]
[94909,"TÜV Rheinland InterTraffic GmbH"]
[94912,"TÜV RHEINLAND ENERGIE GMBH"]
[94913,"TÜV RHEINLAND CERT GMBH"]
[95060,"THOR GMBH"]
[95294,"Rhenus Office Systems GmbH"]
[95727,"DEVANLAY E-COMMERCE S.A.S."]
[96082,"APPLUS NORCONTROL S.L."]
[96093,"MATRICERIA DEUSTO SL"]
[96135,"Dalkia Gebouwenbeheer B.V."]
[96212,"Total France (Marketing & Services)"]
[96221,"VION International GmbH"]
[96242,"Hyundai Construction Equipment Europe"]
[96269,"Alfa Laval Copenhagen A/S"]
[96286,"A2SEA A/S"]
[96295,"AASTED APS"]
[96296,"ANHYDRO A/S"]
[96315,"AGS Limited. - Four Winds"]
[96323,"HERA  AMASA S.A."]
[96325,"A. Espersen A/S"]
[96428,"THYSSENKRUPP ELEVATOR MANUFACTURING SPAIN SL"]
[96471,"Borgstena Textile Portugal Lda"]
[96516,"Alcomarques"]
[96518,"CRI / Criterion Catalyst Company Limited"]
[96519,"Plastic Omnium Auto Inergy Spain SA"]
[96573,"DLF A/S"]
[96574,"DISA Industries A/S"]
[96597,"NUVIA TRAVAUX SPECIAUX (NTS)"]
[96690,"APPLUS SERVICIOS TECNOLOGICOS  S.L.U."]
[96705,"LAMB WESTON / MEIJER UK LTD"]
[96708,"VRIEZO UK LTD"]
[96743,"Nec Computers SAS"]
[96776,"VAT Italie"]
[96784,"Wavestones"]
[96805,"European Software Institute (ESI)"]
[96849,"Daikin Chemical Europe GmbH"]
[96853,"ESERVGLOBAL SAS"]
[96916,"ESS-FOOD A/S"]
[96925,"Microcom Srl"]
[97000,"TOREX RETAIL SOLUTIONS GMBH"]
[97055,"CAE ELEKTRONIK GMBH"]
[97219,"T-Systems Telecommunication Services France"]
[97222,"Sogeti France SAS"]
[97224,"Seita SA"]
[97225,"Abbott SA/NV"]
[97243,"BNP PARIBAS REAL ESTATE VALUATION FRANCE"]
[97259,"Ulma Manutencion  S. Coop - Division: Ulma Handling Systems"]
[97273,"Autoliv -N.C.S. Pyrotechnie et Technologies"]
[97319,"Compagnie de Saint Gobain"]
[97322,"DUFERCO THIONVILLE"]
[97327,"Dolomies de Marche-les-Dames SA"]
[97331,"E.Canopy SA"]
[97349,"BNP Paribas SA"]
[97355,"EADS Information  Technologies & Services"]
[97356,"Araluce SA"]
[97357,"Bericap SARL"]
[97366,"RAMADA STORAGE SOLUTIONS SA"]
[97369,"Financiere & Commerciale de Carriere SA"]
[97381,"Fundasol - Engenharia de Fundaçoes  S.A."]
[97383,"GIE EADS CCR"]
[97392,"Gestamp Tooling Services AIE"]
[97401,"Capgemini Belgium"]
[97404,"Capgemini Consulting SAS"]
[97406,"Capgemini Est SAS"]
[97407,"Capgemini Finance et Services SAS"]
[97410,"Capgemini France SAS"]
[97413,"Capgemini Industrie et Distribution SAS"]
[97414,"Novozymes Biologicals France SAS"]
[97415,"Capgemini OS Electric SAS"]
[97416,"Capgemini Ouest SAS"]
[97417,"Capgemini Outsourcing Services SAS"]
[97418,"Capgemini Service SAS"]
[97419,"HENKEL NEDERLAND BV"]
[97421,"Capgemini Sud SAS"]
[97425,"Capgemini Telecom Media & Networks SAS"]
[97428,"INERGY Automotive Systems Slovakia s.r.o"]
[97432,"Iberian Salads Agricultura SA"]
[97438,"LVD Company NV"]
[97440,"Inergy Automotive Systems France SAS"]
[97442,"AG AMBIENTAL SL > absorbée par TRATESA (5544558)"]
[97480,"KPN B.V."]
[97482,"Knorr - Bremse"]
[97495,"Lhoist Recherche & Developpement SA"]
[97571,"Capgemini Deutschland Holding GmbH"]
[97572,"New IT Santé"]
[97622,"CAPGEMINI DEUTSCHLAND GMBH"]
[97623,"Capgemini Telecom Media & Networks Deutschland GmbH"]
[97624,"Capgemini Outsourcing Services GmbH"]
[97692,"VALEO COMFORT AND DRIVING ASSISTANCE SAS (New ex-VSH)"]
[97780,"JPR"]
[97785,"HFA"]
[98062,"SEPR - Société européenne des produits réfractaires"]
[98089,"Eiger Shipping SA"]
[98090,"Lukoil Technology Services Geneva Sàrl"]
[98097,"PLASTIC OMNIUM COMPOSITES SA ( Ex INOPLAST)"]
[98210,"PIERRE PRADEL PARIS"]
[98554,"ABBOTT INTERNATIONAL LIMITED"]
[98562,"Dücker Automation GmbH"]
[98574,"Dücker Conveyor Systems"]
[99161,"MIXT COMPOSITES RECYCLABLES"]
[99197,"ALP VERRE"]
[99262,"CLARION EUROPE SAS"]
[99311,"Société Verrerie De Saint-Just"]
[99518,"SAINT GOBAIN AUTOVER FRANCE"]
[100156,"CROWN EUROPE GROUP SERVICES"]
[100171,"HARKE Pharma GmbH"]
[100343,"Aicello Chemical Europe GmbH"]
[100554,"EUROKERA"]
[101060,"Saint-Gobain Glass Solutions Nord Est (Former Techniverre Industries)"]
[101236,"VAT Systems SAS"]
[101240,"VAT Systems Ltd"]
[101288,"Terumo BCT Europe Zaventem (Belgien) Zweigniederlassung Zug [ex-CaridianBCT]"]
[101530,"DISTRILAP"]
[101622,"TECHNIP FRANCE"]
[102300,"HENKEL TECHNOLOGIES FRANCE"]
[102356,"Capgemini sd&m AG"]
[103099,"ECKES GRANINI FRANCE SNC"]
[103932,"GEMALTO SA"]
[104108,"MEDWINDS DESIGN S.L.U"]
[104250,"AUTONEUM FRANCE SASU"]
[104543,"CHRISTIAN BERNARD INTERNATIONAL S.A."]
[104842,"AVON EMEA FSC SP. Z O.O."]
[104971,"CFEB SISLEY"]
[106085,"Edipresse Développement SA"]
[106118,"THYSSENKRUPP ELEVADORES SL"]
[106190,"KERAMIK LAUFEN AG"]
[106207,"ING LEASING FRANCE SASU"]
[106223,"Omya Management AG"]
[106306,"MOELLER ELECTRIC AG / Eaton"]
[106313,"Brand Rex LTD"]
[115996,"RHI REFRACTORIES IBERICA SL"]
[117043,"T 2 OPELOG S.A."]
[118704,"ALLEVARD SPRINGS LIMITED"]
[118789,"Amcor Europe Group Management"]
[119778,"Stanley Black & Decker UK Limited"]
[120515,"CAPGEMINI FINANCIAL SERVICES UK LIMITED"]
[129230,"REICHHOLD UK LIMITED"]
[135564,"British American Tobacco Western Europe Commercial Trading Ltd."]
[145207,"PILKINGTON Automotive Limited C/O Pilkington Polska SP. Z.o.o"]
[151428,"Arval Luxembourg S.A."]
[151593,"Avon Cosmetics Hungary Kft"]
[151609,"AXUS LUXEMBOURG SA"]
[152984,"CONNAUGHT ELECTRONICS LIMITED (CEL) / VALEO VISION SYSTEMS Division"]
[154004,"ETIMINE SA"]
[156708,"LES DOMAINES DE VINSMOSELLE"]
[156994,"KYMCO LUX S.A"]
[158428,"PAUL WAGNER ET FILS SA"]
[164262,"Avon Cosmetics SRL"]
[165191,"CARLSON WAGONLIT ITALIA SOCIETA' A RESPONSABILITA' LIMITATA IN BREVE"]
[166394,"DANA ITALIA SRL"]
[166660,"DOLOMITE FRANCHI S.P.A."]
[169976,"L'OREAL SAIPO INDUSTRIALE S.P.A."]
[172570,"REICHHOLD S.R.L."]
[174463,"THE NORTH FACE ITALY S.R.L."]
[175027,"VF Italy SRL"]
[175353,"3M POLAND SP. Z O.O."]
[176623,"Avon Cosmetics Polska Sp. z o.o."]
[176624,"Avon Operations Polska Sp. z o.o."]
[176876,"BEL Polska Sp. z o.o."]
[177631,"BSH SPRZET GOSPODARSTWA DOMOWEGO SP. Z O.O."]
[177902,"CAPGEMINI POLSKA SP. Z O.O."]
[179182,"DS Smith Polska Sp. z o.o."]
[181458,"IGT Poland Sp. Z.o.o. (old GTECH POLAND)"]
[182485,"Plastic Omnium Auto Inergy Poland Sp. z o.o."]
[182701,"INTERNATIONAL PAPER KWIDZYN SP  Z O.O."]
[183358,"KILARGO SP.Z O.O."]
[183381,"KIRCHHOFF POLSKA SP. Z O.O."]
[183833,"KRONOS INTERNATIONAL INC."]
[184125,"LENTEX S.A."]
[185042,"METSA TISSUE POLAND SP. Z O.O."]
[188745,"REICHHOLD AS"]
[188931,"Autoneum Poland Sp. z o.o."]
[188997,"Roche Polska Sp. z o.o."]
[189551,"SCANIA PRODUCTION SLUPSK S.A."]
[189879,"SILA POLAND SP. Z O.O."]
[190863,"STOLZLE CZESTOCHOWA SP. Z O.O."]
[191036,"SUN GARDEN POLSKA Spólka z ograniczona odpowiedzialnoscia sp.k."]
[191161,"CSF Poland Sp. z o.o."]
[191481,"TELE-FONIKA KABLE SA"]
[191563,"TELEWIZJA POLSAT S.A."]
[192311,"UNILEVER POLSKA SP Z O.O."]
[192475,"VALEO AUTOSYSTEMY SP. Z O.O."]
[192476,"VALEO ELECTRIC AND ELECTRONIC SYSTEMS SP. Z O.O."]
[195470,"BAXTER MEDICAL AB"]
[195863,"BOKUS AB"]
[196138,"BTG INSTRUMENTS AB"]
[198868,"BABCOCK & WILCOX VØLUND AB"]
[202648,"PERSTORP OXO AB"]
[203113,"REICHHOLD SVERIGE AB"]
[206462,"Accarda AG"]
[206477,"ACTELION PHARMACEUTICALS LTD"]
[206544,"AGIE CHARMILLES NEW TECHNOLOGIES SA"]
[207070,"ALPIQ INTEC ROMANDIE SA"]
[207075,"Athleticum Sportmarkets AG"]
[207641,"Bobst Mex SA"]
[207772,"BTG ECLÉPENS S.A."]
[207991,"CEMENTIA HOLDING AG"]
[208135,"CHOCOLAT FREY AG"]
[208226,"Cloos Electronic Sarl"]
[208672,"DOETSCH GRETHER AG"]
[208950,"E.M.S. Electro Medical Systems SA"]
[209191,"Endress + Hauser Flowtec AG"]
[209596,"FIXIT AG"]
[209783,"GAINERIE MODERNE SA"]
[210177,"GVFI INTERNATIONAL AG"]
[210330,"HELLO AG"]
[210544,"HUPAC SA"]
[210608,"ILFORD IMAGING SWITZERLAND GMBH"]
[210804,"MEAS SWITZERLAND SARL"]
[210874,"ISS FACILITY SERVICES AG"]
[210971,"JESA SA"]
[211000,"JUMBO MARKT AG"]
[211102,"KARDEX AG"]
[211103,"KRM Service AG"]
[212115,"LITASCO SA"]
[212523,"MAUS FRÈRES SA"]
[212554,"MCI SUISSE SA"]
[213456,"ODLO SPORTS GROUP"]
[213530,"OMYA (SCHWEIZ) AG"]
[213531,"OMYA  AG"]
[213756,"PELICHET NLC SA"]
[213850,"Sonova AG (old Phonak AG)"]
[214113,"Preci-DIP SA"]
[214599,"AUTONEUM SWITZERLAND AG"]
[214600,"AUTONEUM MANAGEMENT AG (ex Rieter Management AG)"]
[214693,"ROMAG AQUACARE AG"]
[214852,"SAINT GOBAIN GLASS SOLUTIONS PARIS CENTRE NORMANDIE"]
[215464,"SIMILOR AG"]
[215649,"SONOVA HOLDING AG"]
[216215,"SYNOVA SA"]
[216256,"TALLY WEIJL TRADING AG"]
[216688,"TRADALL SA"]
[216818,"ETAVIS TSA S.A."]
[217792,"WALO BERTSCHINGER AG"]
[218399,"ZWAHLEN ET MAYR S.A."]
[222842,"OY REICHHOLD AB"]
[224012,"SONY HELLAS S.A."]
[224851,"VF HELLAS S.A."]
[225186,"ITRON Holding France"]
[225608,"AREVA NP"]
[225741,"STANLEY Europe BVBA"]
[226187,"HENKEL ELECTRONIC MATERIALS (BELGIUM) NV"]
[227130,"VALEO VISION SAS",{"$nulls":3},"candy.kobli@gmail.com"]
[229852,"LANCOME PARFUMS ET BEAUTE ET COMPAGNIE (L.P.B.)"]
[231189,"PRESTIGE ET COLLECTIONS INTERNATIONAL"]
[231279,"Avon Kozmetika d.o.o."]
[231386,"REICHHOLD SAS"]
[231429,"REX ROTARY"]
[231515,"ROUSSELOT SAS"]
[232021,"SC2N SASU"]
[232283,"SIEMENS LEASE SERVICES SAS"]
[232832,"SOGETI HIGH TECH"]
[233212,"FERTILORE"]
[233926,"UBISOFT EMEA SAS"]
[234142,"VF (J) FRANCE SAS"]
[236411,"BUREAU VERITAS CERTIFICATION FRANCE"]
[236829,"CELLECTIS"]
[237179,"BTC FRANCE"]
[237364,"CLIMADIFF SA"]
[237566,"COINTREAU"]
[239228,"CROWN Foodcan Germany GmbH"]
[241627,"GROUPE ORMES SAS"]
[242205,"ICAPE"]
[245302,"OTND (onectra)"]
[246765,"ROUSSELOT ANGOULEME SAS"]
[247526,"SG Adfors France"]
[247529,"SAINT GOBAIN WEBER"]
[248287,"SEAQUIST PERFECT DISPENSING SAS (Aptar France SAS)"]
[251101,"CENIT AG"]
[254496,"CUMMINS DEUTSCHLAND GMBH"]
[255657,"FLEX ELEKTROWERKZEUGE GMBH"]
[256119,"NIDEC GPM GmbH"]
[256134,"GESIPA BLINDNIETTECHNIK GmbH"]
[257061,"HORNBACH Reisedienst GmbH"]
[257573,"JEPPESEN GMBH"]
[259405,"NEUMAN & ESSER DEUTSCHLAND GMBH & CO. KG"]
[259407,"NEUMAN & ESSER GMBH & CO. KG"]
[260004,"Polyplast Müller GmbH"]
[260258,"RATH GMBH"]
[260329,"REICHHOLD GMBH"]
[262037,"Ter Hell & Co. GmbH"]
[262176,"TORAY INTERNATIONAL EUROPE GMBH"]
[262292,"TÜV NORD CERT GMBH"]
[262293,"TÜV RHEINLAND AG"]
[262503,"VF GERMANY SERVICES GMBH"]
[262504,"VF GERMANY TEXTIL-HANDELS GMBH"]
[262536,"VION Convenience GmbH"]
[263079,"WOLLSCHLÄGER GMBH & CO. KG"]
[263427,"AGENCIA EFE SA"]
[263856,"APPLUS ITEUVE TECHNOLOGY SL."]
[264304,"Avon Cosmetics SAU"]
[264705,"NOVAPET SA"]
[264813,"COFLUSA SA (Camper)"]
[265149,"CEPSA CARD SA"]
[265530,"COMPANIA DE DISTRIBUCION INTEGRAL LOGISTA S.A"]
[265550,"COMPANIA GENERAL DE ZAPATERIA S.L.U"]
[266433,"DRONAS 2002 S.L."]
[267781,"GESTORA DE INVERSIONES AUDIOVISUALES LA SEXTA S.A."]
[268317,"HERA SEGASA SA > ABSORBEE PAR TRATESA (5544558)"]
[269790,"LGAI TECHNOLOGICAL CENTER SA."]
[269853,"LOGESTA GESTION DE TRANSPORTE S.A."]
[270350,"METROVACESA S.A."]
[270752,"NOVOTEC CONSULTORES SA"]
[271374,"PRETERSA PRENAVISA ESTRUCTURAS DE HORMIGON SL"]
[271430,"PRODUCTOS CAPILARES L'OREAL S.A."]
[271576,"Prosegur Transportes De Valores SA"]
[271931,"AUTONEUM Spain SAU"]
[273679,"VALEO ILUMINACION SA"]
[274709,"AMCOR FLEXIBLES UK LTD"]
[274710,"Amcor Flexibles Winterbourne Ltd"]
[275197,"Avon Cosmetics LTD"]
[278124,"DOW JONES INTERNATIONAL LTD."]
[279432,"GAME STORES GROUP LIMITED (in administration)"]
[287448,"THE VALSPAR (UK) CORPORATION LTD"]
[289143,"Icopal ApS"]
[293042,"DÜCKER FÖRDERTECHNIK GMBH"]
[295118,"Jebsen & Jessen (GmbH & Co.) KG"]
[296099,"Kaizhong VOGT GMBH"]
[296201,"HITACHI TOOL ENGINEERING EUROPE GMBH"]
[296443,"HUNTER DOUGLAS GMBH"]
[296907,"ITECO OILFIELD SUPPLY GMBH"]
[298539,"M. BUSCH GMBH & CO. KG"]
[298585,"MAGNA SPIEGELSYSTEME GMBH"]
[301178,"RHI DINARIS GMBH"]
[301179,"RHI REFRACTORIES SITE SERVICE GMBH"]
[303820,"TÜV INTERNATIONAL GMBH-UNTERNEHMENSGRUPPE TÜV RHEINLAND"]
[303821,"TÜV NORD MOBILITÄT GMBH &CO. KG"]
[303825,"TÜV Rheinland i-Sec GmbH"]
[303829,"TÜV NORD SERVICE GMBH & CO. KG"]
[303977,"Valspar Industries GmbH"]
[304186,"Sonac Bad Bramstedt GmbH"]
[306219,"AMBU A/S"]
[306466,"Astellas Pharma A/S"]
[306473,"ASTRAZENECA CZECH REPUBLIC  S.R.O."]
[306632,"Avon Cosmetics spol. s r.o."]
[306706,"BABCOCK & WILCOX VOELUND A/S"]
[309996,"FRITZ HANSEN A/S"]
[312500,"KVERNELAND GROUP KERTEMINDE A/S"]
[312863,"CGI IT Czech Republic s.r.o. (former Logica CZ)"]
[313012,"MAERSK BROKER K/S"]
[314425,"Atlantic Airways"]
[314496,"PALSGAARD A/S"]
[314808,"PLAST TEAM A/S"]
[315373,"REICHHOLD CZ S.R.O."]
[315461,"AUTONEUM CZ s.r.o."]
[317826,"Valeo Autoklimatizace  K.S"]
[317827,"VALEO COMPRESSOR EUROPE S.R.O."]
[317828,"VALEO VYMENIKY TEPLA S.R.O."]
[319603,"Atlas Copco Support Services NV"]
[319605,"Atlas Copco Airpower NV"]
[320973,"CATHAY INDUSTRIES EUROPE"]
[321115,"CHEVRON PHILLIPS CHEMICALS INTERNATIONAL NV"]
[321629,"CWT BELGIUM"]
[322247,"DONALDSON EUROPE BVBA"]
[323256,"FESTO BELGIUM"]
[323582,"FREMACH PLASTICS"]
[323667,"Kreglinger Europe NV"]
[323731,"TerumoBCT Europe NV (Caridian)"]
[323937,"GEMINI CORPORATION NV"]
[324738,"Huber Tricot GmbH"]
[325122,"Plastic Omnium Auto Inergy Belgium NV"]
[325439,"ISUZU BENELUX NV"]
[325533,"JEAN GOLDSCHMIDT INTERNATIONAL SA"]
[325632,"JSR Micro N.V."]
[325896,"KOMATSU EUROPE INTERNATIONAL NV"]
[325983,"KROMBERG & SCHUBERT AUSTRIA GmbH & CO. KG."]
[326706,"Magna Auteca GmbH"]
[326711,"MAGNA Presstec GmbH"]
[327133,"MEURA"]
[328364,"Porr AG"]
[328430,"PREMAMAN SA"]
[329326,"SAPPI EUROPE SA"]
[329392,"SCANSOURCE EUROPE Sprl"]
[329742,"SIMCORP BENELUX SA/NV"]
[329796,"SKILLTEAM sprl"]
[330011,"SOGETI BELGIUM"]
[330227,"Black & Decker Limited S.àr.L (BE Branch)"]
[330417,"VASCO GROUP NV (old Vasco Group BVBA and The Heating Company BVBA)"]
[330435,"SUZUKI BELGIUM NV"]
[330734,"Thomas Cook Airlines Belgium NV"]
[330738,"Thomas Cook Retail Belgium NV"]
[330739,"THOMAS COOK BELGIUM NV"]
[332099,"Will-Pharma SA"]
[333777,"Avon Cosmeticos Lda"]
[342862,"Prosegur - Companhia De Seguranca Unipessoal Lda"]
[342863,"Prosegur - Distribuicao e Servicos Lda"]
[342864,"Prosegur Activa Portugal Unipessoal Lda"]
[343338,"AUTONEUM Portugal Lda (anciennement Rieter-Componentes para Veículos)"]
[348807,"BUNGE Zrt."]
[352921,"Sila Holding Industriale S.p.A."]
[353023,"LINDT & SPRUNGLI S.P.A."]
[357730,"ESPERSEN POLSKA SP. Z O.O."]
[363077,"AIR EUROPA LINEAS AEREAS SAU"]
[365523,"Amcor Flexibles Rorschach AG"]
[365610,"Amcor Flexibles Burgdorf GmbH"]
[365655,"Amcor Flexibles Kreuzlingen AG"]
[365745,"Schott Schweiz AG"]
[367110,"Crown Bevcan Slovakia s.r.o."]
[368737,"TNS SAS"]
[368813,"Brooks Instruments GmbH"]
[368966,"ING Lease Italia S.p.A."]
[369390,"Donaldson Company Inc."]
[369677,"A-Exhibition GmbH"]
[369887,"Harke Chemicals GmbH"]
[370046,"Prosegur Securite Humaine"]
[370226,"Sensor-NITE Industrial EOOD"]
[370243,"PACIFIC TEST COMPANY 3"]
[370397,"DENTAL HI TEC"]
[370433,"MONOPRIX ONLINE SAS"]
[370439,"Mindstream SA"]
[370644,"Mercedes-Benz Fin Services Belux SA"]
[370654,"Ing. De Aloe Costruzioni s.r.l."]
[370716,"UNILEVER POLAND SERVICES SP. Z O.O."]
[370779,"TEREX GLOBAL GMBH"]
[370788,"DIW Mechanical Engineering GmbH & Co. KG"]
[370802,"LGA Training & Consulting GmbH"]
[370915,"EUROBUS - knecht AG"]
[370966,"SPORTFIVE International S.A."]
[371068,"Laboratorios Galderma SA"]
[371101,"Rauwers Controle GmbH"]
[371148,"MC CAIN SUD SAS"]
[371239,"DAV SAS"]
[371251,"3M Wroclaw Sp. z o.o."]
[371292,"GEMALTO INTERNATIONAL SAS"]
[371302,"Will-Pharma B.V."]
[371344,"Saint Gobain Services Materiaux Innovants"]
[371409,"WILL-PHARMA LUXEMBOURG SARL"]
[371416,"Capgemini Technology Services"]
[371459,"DEPHARM SCA"]
[371468,"SPRL M.V.V.M."]
[371557,"CWT Distribution SAS"]
[371558,"CWT France SAS"]
[371627,"SSANGYONG MOTORS MIDDLE EUROPE NV"]
[371747,"TRUMPF Finance (Schweiz) AG"]
[371814,"European Association of Hospital Pharmacists (EAHP)"]
[371851,"VBW Sp. z o.o"]
[372157,"Plastic Omnium Auto Exterieur"]
[372182,"Technicolor Polska Sp. z o.o."]
[372193,"SHARDA CROPCHEM LIMITED (FORMERLY SHARDA WORLDWIDE EXPORTS PVT. LTD)"]
[372382,"Victoria Chemicals Sp. z o.o."]
[372466,"Fermintrade sp. z o.o. sp.k."]
[372473,"Compresseurs Mauguière"]
[372554,"Beaumarais SAS"]
[372785,"Valeo Systèmes de Contrôle Moteur SAS (VSCM)"]
[372788,"U-SHIN SLOVAKIA s.r.o."]
[372811,"EPTDA - EMEA Power Transmission Distributors Association"]
[372822,"AstraZeneca AB organizacna zlozka"]
[373060,"Hanro International GmbH"]
[373072,"Skiny bodywear GmbH & Co. KG."]
[373087,"Cirmac International BV"]
[373196,"ETABLISSEMENTS REMY MARTIN & CO"]
[373198,"REMY COINTREAU INTERNATIONAL MARKETING SERVICES"]
[373220,"Levi Strauss & Co."]
[373252,"NBR SA"]
[373253,"ROYER SAS"]
[373254,"Feet"]
[373255,"Royer licences"]
[373257,"Royer Sport"]
[373258,"TSS"]
[373261,"SAINT GOBAIN PAM"]
[373288,"Hasbro SA"]
[373291,"KIRCHHOFF Automotive Romania"]
[373413,"CWT Meetings & Events"]
[373414,"TÜV Rheinland Schaden und Wertgutachten"]
[373421,"BUREAU VERITAS"]
[373422,"Environnement Contrôle Services SAS"]
[373424,"Bureau Veritas Certification Holding"]
[373434,"EDITIONS TAITBOUT SA"]
[373435,"SNC EDITIONS MONDADORI -AXEL-SPRINGER (EMAS)"]
[373438,"Astellas Pharma Finland"]
[373483,"SAINT GOBAIN MATERIAUX DE CONSTRUCTION SAS"]
[373541,"VELOX Specialities AB"]
[373896,"GP Services"]
[374098,"CMI Greenline Europe"]
[374117,"9091-6909 Québec Actioil International"]
[374131,"MIA ELECTRIC"]
[374139,"BorCop Overhead Solutions"]
[374149,"Valeo Systèmes Thermiques SAS"]
[374180,"RHI GLAS GMBH"]
[374183,"DAV TUNISIE"]
[374197,"COTULUX SA"]
[374211,"Actioil International PTE LTD"]
[374234,"Saint Gobain Abrasifs France"]
[374235,"SAINT GOBAIN GLASS France G09"]
[374241,"ANHYDRITE MINERALE France"]
[374243,"CHARLES ANDRÉ"]
[374248,"Reichhold Inc."]
[374253,"Plastic Omnium Auto Exterior  LLC"]
[374257,"Saint Gobain Solar Systems SASU"]
[374258,"Husky KTW GesmbH"]
[374263,"STANLEY WORKS (Europe) GmbH - BE Branch"]
[374278,"Laboratoires Nuxe SAS"]
[374284,"Rhenus Midi Data GmbH"]
[374287,"Whygo Europe Ltd"]
[374288,"Saint Gobain Coating Solutions"]
[374301,"PLACOPLATRE"]
[374302,"SAINT GOBAIN PLACO SAS"]
[374303,"Applied Materials Ireland Ltd"]
[374304,"Applied Materials UK Ltd"]
[374305,"Applied Materials Belgium NV"]
[374306,"Applied Materials Spain SL"]
[374307,"Applied Materials Italia Srl"]
[374309,"ANOV EXPANSION"]
[374311,"COMPAGNIE D OPERATIONS PETROLIERES SCHLUMBERGER SA"]
[374312,"SCHLUMBERGER SA"]
[374313,"SCHLUMBERGER LIMITED"]
[374317,"BILLERUDKORSNÄS FINLAND OY"]
[374320,"Alu Sommer GmbH"]
[374321,"Porr Design & Engineering GmbH"]
[374322,"Allgemeine Straßenbau GmbH"]
[374323,"Panitzky Gesellschaft GmbH"]
[374324,"UBM DEVELOPMENT AG"]
[374325,"Strauss & Partner Development GmbH"]
[374326,"Porr Umwelttechnik GmbH"]
[374327,"Ing. Otto Richter & Co Straßenmarkierungen GmbH"]
[374328,"PORREAL Immobilien Management GmbH"]
[374329,"Porr Bau GmbH"]
[374330,"Porr Equipment Services GmbH"]
[374331,"Schotter- und Betonwerk Karl Schwarzl Betriebsgesellschaft m.b.H."]
[374332,"Porr Tunnelbau GmbH"]
[374333,"PORREAL Facility Management GmbH"]
[374334,"ÖSTERREICHISCHE BETONDECKEN ARGE"]
[374335,"THEA FARMA SPA"]
[374336,"BazarChic SA"]
[374344,"Amcor Group GmbH"]
[374346,"THE KOOPLES"]
[374355,"Booking.com (Österreich) GmbH"]
[374356,"AREVA RENOUVELABLES SASU"]
[374360,"Maco Pharma SAS"]
[374371,"Gulf Polymers Distribution Company FZCO"]
[374374,"BILLERUDKORSNÄS SWEDEN AB"]
[374376,"Prosegur Servicios De Efectivo Espana SL"]
[374378,"MARKLAS NEDERLAND BV"]
[374380,"LAUFEN BATHROOMS AG"]
[374385,"GVFI EUROPE BV"]
[374391,"SAINT-GOBAIN INTERSERVICES"]
[374392,"SAINT-GOBAIN ACHATS"]
[374393,"SAINT-GOBAIN CONCEPTIONS VERRIERES"]
[374394,"SAINT-GOBAIN DSI GROUPE"]
[374395,"SAINT-GOBAIN-TECHNOLOGY SERVICES France"]
[374396,"SAINT-GOBAIN SERVICES RH France"]
[374399,"U-SHIN France SASU"]
[374401,"SAINT GOBAIN VETROTECH France"]
[374403,"Verrerie Aurys"]
[374404,"Saint Gobain Glass Solutions France GIE"]
[374405,"Valoref"]
[374406,"SG C.R.E.E."]
[374407,"SG Materiaux Céramiques"]
[374409,"Saint-Gobain Consulting Information and organization"]
[374410,"SGGS Menuisiers Industriels"]
[374411,"SGGS Sud Ouest"]
[374412,"Vitrages Isolants D'Auvergne"]
[374413,"SG Services Matériaux Innovants"]
[374418,"NOKIA TECSS (old Alcatel Lucent TECSS)"]
[374419,"TERRAGAIA"]
[374426,"Autoneum GB Limited"]
[374428,"TILLSTER"]
[374429,"AbbVie SA/NV"]
[374432,"Amcor Flexibles Cramlington Ltd"]
[374435,"UNITRON HEARING GMBH"]
[374436,"MAGNA STEYR AG & CO KG"]
[374437,"*A RENSEIGNER *"]
[374438,"MAGNA STEYR ENGINEERING AG & CO KG"]
[374441,"TÜV Rheinland-LGA Bautechnik GmbH"]
[374442,"KWEB SAS"]
[374446,"Amcor Flexibles Capsules France"]
[374447,"Amcor Flexibles Food France SAS"]
[374448,"Amcor Flexibles Packaging France SAS"]
[374449,"Amcor Group Management France SAS"]
[374450,"Amcor Flexibles Selestat SAS"]
[374451,"COSTA Meeresspezialitäten GmbH & Co. KG"]
[374453,"Constellium Extrusions Deutschland GmbH"]
[374455,"Bayer (Schweiz) AG"]
[374482,"CHRISTIAN LOUBOUTIN SUISSE SA"]
[374484,"Ares Capital"]
[374485,"LCGO (Commercial name: Oeuf dans l'eau)"]
[374486,"OEUF DANS L'EAU >> LCGO"]
[374497,"VF Ireland Ltd"]
[374498,"VF Northern Europe Services Ltd Ireland"]
[374499,"VF Sweden AB"]
[374500,"VF Northern Europe Ltd"]
[374501,"VF Polska Distribution Sp. Z.o.o."]
[374502,"Timberland IDC Ltd."]
[374503,"The North Face Italy SRL (TNF Italy SRL)"]
[374504,"Timberland Europe BV"]
[374505,"VF Northern Europe Services Ltd"]
[374506,"VF Italy Services SRL"]
[374507,"VF Italy Retail S.R.L. (before Timberland Italia S.R.L.)"]
[374508,"VF International SAGL"]
[374510,"VF Slovakia s.r.o."]
[374511,"VF Apparel Portugal Ltd"]
[374513,"VF (J) ESPANA S.L"]
[374514,"VF (J) NEDERLAND BV"]
[374515,"VF (J) NETHERLANDS SERVICES BV"]
[374516,"VF SCANDINAVIA A/S"]
[374517,"VF AUSTRIA GMBH"]
[374518,"VF HUNGARY DISTRIBUTION KFT"]
[374519,"VF CZECH SERVICES SPOL S.R.O"]
[374520,"VF CZECH S.R.O"]
[374526,"Wibeba Hochbau GmbH & Co Nfg. KG"]
[374527,"Grund- Pfahl- und Sonderbau Gesellschaft m.b.H."]
[374532,"SC Avon Cosmetics Romania SRL"]
[374537,"BEKAERT MACCAFERRI UNDERGROUND SOLUTIONS BVBA"]
[374550,"TEST COMPLIANCE & VAT RECOVERY 1"]
[374551,"TEST COMPLIANCE & VAT RECOVERY 2"]
[374554,"ALTERCOSMETO DIFFUSION",{"$nulls":3},"vtbytnbhnhntfe"]
[374574,"SILCO POLYMERS SA"]
[374583,"ECTA-European Communities Trade Mark Association"]
[374639,"OLE LYNGGAARD RETAIL DENMARK"]
[374642,"Capgemini Consulting Österreich AG"]
[374744,"GMA Garnet (Europe) GmbH"]
[374745,"Ruhr-Petrol GmbH"]
[374748,"Nivalis Group SA (old CPA Group SA)"]
[374750,"DG SPORT SPRL"]
[374785,"regenHU SA"]
[374786,"VENTURI Incubateur SA"]
[374787,"CPAutomation SA"]
[374788,"BS-Optics SA"]
[374789,"ASYRIL SA"]
[374790,"ViDi Systems SA"]
[374791,"Vivier SA"]
[374792,"VIVOS Dental Ltd"]
[374795,"ACOR"]
[374833,"AMD TÜV Arbeitsmedizinische Dienste GmbH"]
[374847,"Magna Exteriors GmbH"]
[374854,"BOCA SARL"]
[374855,"Imouraren SA"]
[374856,"Ole Lynggaard Retail Sverige ApS Danmark Filial"]
[374857,"OLE LYNGGAARD COPENHAGEN GmbH"]
[374859,"RHI ITALIA SRL"]
[374860,"OLE LYNGGAARD A/S"]
[374861,"CIARKO sp. z o.o. IP Sp.K."]
[374862,"Miroiteries Ouest Armorique"]
[374867,"KORDSA GLOBAL"]
[374868,"VALEO LIGHTING INJECTION SA"]
[374870,"ENCOS GmbH 1 Co. KG"]
[374876,"VALEO COMFORT AND DRIVING ASSISTANCE SAS (old entity)"]
[374877,"HOM GmbH"]
[374878,"SOGETI Luxembourg"]
[374880,"REMY COINTREAU EUROPE & MEA"]
[374881,"Miliboo SA"]
[374882,"Porr Austria Rail GmbH"]
[374883,"Bautech Labor GmbH"]
[374884,"Avon Cosmetics Greece MEPE"]
[374886,"Bavaria Studios Art Department GmbH"]
[374887,"Cine-Mobil GmbH"]
[374898,"THERMOHEAT PORTUGAL LDA"]
[374900,"PLASTIPAK PACKAGING FRANCE"]
[374904,"STEIN RIVER TRADE"]
[374910,"KSB SERVICE COTUMER SAS"]
[374915,"CORAMINE"]
[374916,"Indorama Ventures Química S.L.U."]
[374917,"GUNVOR INTERNATIONAL B.V. GENEVA BRANCH"]
[374918,"Valeo Japan Co. Ltd."]
[374919,"JP Molyneux Studio Ltd"]
[374958,"Aalborg Portland A/S"]
[374962,"KRONOS TITAN GMBH"]
[374968,"SOCIETE D'EXPLOITATION DES SABLES ET MINERAUX SAMIN"]
[374969,"LINDE + WIEMANN GmbH KG"]
[374972,"KRONOS TITAN AS"]
[374977,"MCGREGOR FASHION GROUP FISCAL ENTITY"]
[374978,"McGregor E-store B.V."]
[374979,"Adam Menswear BV"]
[374980,"Emergo Sportswear BV"]
[374982,"McGregor Retail BV."]
[374983,"Magna Exteriors Systems GmbH"]
[374987,"Vetrotech Saint-Gobain International AG"]
[374988,"Gaastra Retail BV\t\t\t\t\t\t\t\t\t\t\t\t\t"]
[374989,"WireCo Crane Center BV"]
[375002,"Capgemini Asia Pacific Pte Ltd"]
[375003,"Capgemini Singapore Pte Ltd."]
[375004,"Capgemini Australia Pty Ltd"]
[375005,"Capgemini Technology Services India Limited"]
[375006,"Capgemini (China) Co. Ltd"]
[375007,"Praxis (Beijing) Technology Co. Ltd."]
[375008,"Capgemini (Hangzhou) Co. Ltd."]
[375009,"Capgemini (Kun Shan) Co. Ltd."]
[375010,"Capgemini Business Services (China) Ltd"]
[375011,"Capgemini Hong Kong Ltd"]
[375012,"Capgemini Middle East FZ LLC"]
[375014,"Capgemini Vietnam Co. Ltd"]
[375015,"Capgemini Saudi Ltd"]
[375016,"Capgemini Japan K.K."]
[375017,"Capgemini Philippines Corp"]
[375018,"Capgemini Services Malaysia Sdn Bhd"]
[375019,"ITBconsult Hong Kong Ltd."]
[375020,"ITBconsult Shanghai Ltd."]
[375029,"Capgemini Financial Services USA"]
[375031,"Sogeti USA LLC"]
[375062,"Cloud ERP Solutions SASU"]
[375073,"Capgemini Business Services Chile Ltda"]
[375079,"MicroPort Orthopedics B.V."]
[375081,"Van Heck Interpieces France"]
[375085,"KOMATSU FINANCIAL FRANCE SAS"]
[375088,"EOL COORDINATION CENTER SA"]
[375089,"AMW Asphalt-Mischwerk GmbH & Co KG"]
[375090,"Porreal GmbH"]
[375091,"Teerag-Asdag Hochbau Burgenland GmbH"]
[375094,"Autoneum Belgium NV"]
[375095,"Aalborg Portland France S.A.S"]
[375096,"Ryan Netherlands"]
[375099,"Capgemini US LLC"]
[375100,"IGATE Technologies Inc"]
[375104,"AP Logistics BV"]
[375106,"HENKEL NEDERLAND OPERATIONS B.V."]
[375107,"HENKEL BELGIUM N.V. S.A."]
[375112,"TÜV Rheinland Akademie GmbH"]
[375115,"TÜV Saarland Automobil GmbH"]
[375116,"Ifes GmbH"]
[375117,"TÜV Rheinland Werkstoffprüfung GmbH"]
[375118,"TÜV Rheinland Consulting GmbH"]
[375150,"Prosegur Soluciones Integrales De Seguridad Espana SLU"]
[375151,"Prosegur Alarmas Espana SLU"]
[375154,"PICK TO LIGHT SYSTEMS SL"]
[375159,"TÜV Rheinland campus GmbH"]
[375161,"AGC Glass Poland Sp. z o. o."]
[375164,"Access",{"$nulls":3},"jkjregihgtrnnbtr"]
[375166,"Laiterie de Saint Denis de l'Hôtel"]
[375169,"Sogeti Deutschland GmbH"]
[375170,"PLASTIC OMNIUM AUTO INERGY FRANCE"]
[375171,"PLASTIC OMNIUM AUTO INERGY SERVICES"]
[375173,"Leistritz Turbomaschinen Technik GmbH"]
[375177,"Erre DB Group SA"]
[375180,"Mylan EPD SPRL / BVBA"]
[375181,"LOGISTA PHARMA"]
[375185,"KAYAK EUROPE"]
[375187,"Cepsa Business Services S.A."]
[375192,"Saint Gobain pour Produits de Construction Services"]
[375199,"UMS - Urban Mining Solutions GmbH"]
[375203,"Igate Global Solutions Ltd"]
[375204,"Optiva Solution (UK) Limited"]
[375213,"RED ESPAÑOLA DE SERVICIOS S.A."]
[375214,"WINE AND CO"]
[375215,"Le Carré Des Vins"]
[375216,"Plafometal"]
[375217,"Saint Gobain Lumilog"]
[375218,"Cooper Standard Automotive España SL"]
[375219,"CWT Comevat"]
[375220,"CWT Monaco"]
[375221,"Weitnauer Distribution Ltd."]
[375225,"ASI Sign Systems Inc."]
[375226,"VASCO BVBA"]
[375266,"Guerbet SA"]
[375271,"Tannico SPA"]
[375274,"XtraWine S.r.l."]
[375275,"LA PASSIONE Srl"]
[375277,"INTERCHEM EUROPE (UK) LTD"]
[375278,"RECENSO Gmbh"]
[375288,"Mc Gregor Fashion Group BV"]
[375294,"DEEZER"]
[375299,"IEF EVENTS SAS"]
[375309,"Jebagro GmbH"]
[375310,"Jebsen & Jessen Life Science GmbH"]
[375315,"Amcor Flexibles Saint Maur SAS"]
[375317,"Amcor Flexibles SPS Coulommiers"]
[375322,"Dachcom.CH AG"]
[375323,"Dachcom.Dialog AG"]
[375376,"Plastic Omnium Auto Inergy Services SAS"]
[375423,"CEPSA COMERCIAL PETROLEO SAU"]
[375441,"BNP Paribas Real estate consult GMBH"]
[375450,"CAPGEMINI AMERICA INC"]
[375453,"CARROZ.CO SARL"]
[375455,"Euro VAT Refund Inc."]
[375460,"MANN ENTERPRISES LTD"]
[375461,"Le Bélier Mohács Kft"]
[375465,"NOKIA SOLUTIONS AND NETWORKS SPAIN SL"]
[375478,"GoldenBay Turizm Yatirimlari AS"]
[375497,"Aalborg Portland Belgium",{"$nulls":3},"papapapapapapa"]
[375500,"SEEGPHARM SA"]
[375504,"Porr Beteiligungen und Management GmbH"]
[375505,"Asphalt-Unternehmung Carl Günther GmbH"]
[375506,"Avon d.o.o. Ljubljiana"]
[375507,"Avon Distribution Polska Sp. z o.o."]
[375510,"Salamander Group"]
[375512,"VINATIS"]
[375514,"Cooper Standard Automotive International Holdings B.V."]
[375515,"The Perryman Company"]
[375516,"Joss Chemicals B.V."]
[375517,"SimCorp France SAS"]
[375518,"Saint-Gobain Performance Plastics France"]
[375519,"SimCorp Netherlands"]
[375520,"SOD.I.A. SA"]
[375526,"Bavaria Film Content GmbH"]
[375600,"Electronics for Imaging United Kingdom Ltd"]
[375605,"Österreichische Betondecken Ausbau GmbH"]
[375608,"EPSA"]
[375618,"Neuman & Esser GmbH Mahl- und Sichtsysteme"]
[375694,"SOLACE CORPORATION"]
[375695,"CHAI DES CRUS SARL-S"]
[375711,"VENTEALAPROPRIETE.COM"]
[375744,"RHI Magnesita GmbH"]
[375762,"MEUNIER SA"]
[375776,"H.A.C. Pharma SAS"]
[375820,"Septodont Holding"]
[375821,"SIX Payment Services (Europe) SA"]
[375856,"CHARLES JOURDAN"]
[375868,"TER NORDICS APS"]
[375888,"FRANCE GOURMET DIFFUSION (PLUGWINE)"]
[375894,"White Key Villas"]
[375897,"Saint Gobain Habitat"]
[375898,"CFD Distribution"]
[375899,"GRAINCOM GMBH"]
[375900,"Avon Eesti OU"]
[375901,"Avon Cosmetics SIA"]
[375902,"Avon Cosmetics UAB"]
[375903,"Avon Cosmetics Finland Oy"]
[375905,"MMTCI Group"]
[375906,"DECANTALO VINOS S.L."]
[375907,"Capgemini Schweiz AG"]
[375914,"Samskip Logistics International BV"]
[375915,"Samskip Multimodal BV"]
[375916,"Samskip Logistics Benelux B.V."]
[375939,"BUREAU VERITAS SA"]
[375941,"BUREAU VERITAS CONSTRUCTION"]
[375942,"BUREAU VERITAS EXPLOITATION"]
[375943,"BUREAU VERITAS MARINE OFFSHORE"]
[375944,"BUREAU VERITAS GSIT"]
[375945,"BUREAU VERITAS SERVICES"]
[375946,"BUREAU VERITAS SERVICES France"]
[375947,"SOD.I.A  SA"]
[375962,"Renault Trucks SAS"]
[376013,"Renault Trucks Defense"]
[376041,"TIMAB NL B.V."]
[381027,"TRS LINES"]
[381043,"Speedcast Netherlands B.V."]
[381049,"Samskip Van Dieren Multimodal BV"]
[381061,"Perstorp Specialty Fluids AB"]
[381074,"Saint-Gobain Archives"]
[381088,"P3 Systems GmbH"]
[381103,"Pivotal Software International"]
[381108,"TÜV Rheinland Personal GmbH"]
[381109,"Tüv Rheinland Schniering GmbH"]
[381110,"UBM Hotels Management GmbH"]
[381111,"Bureau Veritas International"]
[381117,"Volvo Construction Equipment Europe SAS"]
[381124,"Redapt Inc."]
[381129,"ZUFFA LLC DBA UFC"]
[381153,"LAPEYRE SERVICES"]
[381157,"TCM Gourmet 2012 S.L.U."]
[381158,"Rigby Capital"]
[381167,"STADE 27 S.A."]
[381169,"POREAUX ET CIE S.A.S."]
[381170,"SOCIETE PASTURAL & CIE S.A.S."]
[381171,"ENTREPRISE CORDIER S.A.S."]
[381172,"LAGRANGE PRODUCTION S.A.S."]
[381173,"OUEST PRODUCTION"]
[381174,"S.B.L. S.A.S."]
[381175,"COUGNAUD S.A.S."]
[381176,"AZUR PRODUCTION S.A.S."]
[381177,"GIRAUD PRODUCTIONS S.A.S."]
[381178,"GAM S.A.S."]
[381179,"TECHNIFEN S.A.S."]
[381189,"Perstorp Services UK Ltd."]
[381190,"RHI Magnesita Trading BV"]
[381197,"Druva Singapore Private Ltd."]
[381198,"Tiefenbacher API+Ingredients GmbH & Co. KG"]
[381214,"PWC Société d Avocats"]
[381227,"L'Oreal USA Products"]
[381238,"Huber-Shop GmbH"]
[381245,"Joss Elastomers & Chemicals B.V."]
[381254,"Greenlane Holdings EU B.V."]
[381255,"The Proactiv Company Sàrl"]
[381256,"Gordon Sales Inc."]
[381266,"Laird Plastics Inc."]
[381275,"CONTITECH AVS France"]
[381276,"Druva Technologies Pte. Ltd."]
[2334526,"HALUCO B.V."]
[2334928,"HASKONING DHV NEDERLAND B.V."]
[2335614,"REICHHOLD FINANCE B.V."]
[2335615,"REICHHOLD BV"]
[2336241,"VAN DEN BAN AUTOBANDEN B.V."]
[2336490,"CLAAS Tractor SAS"]
[2336521,"REICHHOLD DANMARK A/S"]
[2450258,"EFI Belgium BVBA"]
[2450259,"Electronics for Imaging GmbH"]
[2450260,"Electronics for Imaging Espana S.L."]
[2450261,"Electronics For Imaging SARL"]
[2450263,"Electronics for Imaging Nordic A.B."]
[2450264,"Electronics for Imaging (Europe) Ltd"]
[2450283,"FARICO"]
[2450288,"Electronics for Imaging Srl"]
[2450306,"SAS CIAT PRODUCTION"]
[2516941,"TÜV NORD EnSys GmbH & Co. KG"]
[2516944,"TÜV NORD SysTec GmbH & Co. KG"]
[2516945,"TÜV NORD Systems GmbH & Co. KG"]
[2517031,"LAFARGE ITEC SP. Z O.O."]
[2517034,"EFI Hungary Trading Kft"]
[2551109,"Sintex NP Group"]
[2551111,"Ateliers Picot"]
[2551113,"SONAC BRAMSTEDT NORD GMBH"]
[2553149,"MAISADOUR SEMENCES"]
[2553153,"MARITIME PERFORMANCES BV"]
[2553155,"GEORGIA-PACIFIC DEUTSCHLAND GmbH"]
[2553189,"APPLUS SERVICES SA (former APPLUS TECHNOLOGIES HOLDING S.L.)"]
[2553194,"NVS SAS"]
[2553195,"A NOVO LOGITEC SA"]
[2553214,"Les Etapes André Trigano - CEHPA (CEHPA)"]
[5544558,"Hera Tratesa"]
[5544565,"PACIFIC TEST COMPANY 2"]
[5544724,"RICHEMONT INTERNATIONAL SA"]
[5544748,"Hera Energia"]
[5544749,"Hera Holding"]
[5544769,"Prosegur Activa Holding SL"]
[5544770,"Prosegur Activa Espana SL"]
[5544771,"Prosegur Tecnologia SLU"]
[5544779,"Intertoresa AG"]
[5544780,"Omya Immobilien AG"]
[5544782,"Omya International AG"]
[5544783,"Omya Development AG"]
[5544784,"Omya Technology AG"]
[5544785,"Alcadis NV"]
[5544806,"Intersilesia McBride Polska Sp. z o.o."]
[5544831,"Astellas Pharma AB"]
[5544832,"ASTELLAS PHARMA"]
[5544888,"TÜV NORD Akademie GmbH & Co. KG"]
[5545278,"PROVIMI FRANCE"]
[5545550,"BIG PEAR TRADING UG & CO. KG"]
[5545639,"EURASUD CEREALES SNC"]
[null,"PN Home LTD"]
[null,"Asociacion Latinoamericana de Administradores"]
[null,"Babcock & Wilcox Vølund Limited"]
[null,"Cepsa Business Services, S.A."]
[null,"Cooper Standard Automotive España"]
[null,"FEV SOFTWARE AND TESTING SOLUTIONS"]
[null,"FocusonVAT"]
[null,"TÜV NORD MOBILITÄT GmbH & Co Kg"]
[null,"VALEO COMPRESSOR EUROPE SRO"]
[null,"VALEO SYSTEMES DE CONTRÔLE"]
[null,"VEITSCH RADEX VERTRIEBS GMBH"]
[null,"SALAMANDER GROUP SAS"]
[null,"Sappi Papier Holding GmbH"]
[null,"SCHMIDT GROUP SAS"]
[null,"Sersa Group AG (Schweiz)"]
[null,"Skiny Bodywear GMBH & CO KG"]
[null,"SOCIÉTÉ EUROPÉENNE DES PRODUITS"]
[null,"Sonae MC - Serviços Partilhados"]
[null,"SUN GARDEN POLSKA Sp.Z.o.o. Sp. K."]
[null,"THALES SERVICES SAS"]
[null,"KILARGO SP. Z.O.O."]
[null,"KIRCHHOFF POLSKA SP ZOO"]
[null,"KPN B.V"]
[null,"KPN EURORINGS BV"]
[null,"KRONOS INTERNATIONAL, INC."]
[null,"LE BELIER MAGYARORSZAG FORMAÖNTÖDE ZRT."]
[null,"MDS - Corretor de Seguros SA"]
[null,"MEDICAL AND HEALTHCARE"]
[null,"MILIBOO"]
[null,"NANJING TATA AUTOCOMP SYSTEMS LIMITED"]
[null,"NEXANS FRANCE",{"$nulls":10},"mamamamamamama"]
[null,"RHI MARVO Feuerungs - und Industriebau GmbH"]
[null,"RUE DU COMMERCE"]
[null,"Saint Gobain MC Matx Const"]
[null,"H.B. Fuller Adhesives France SAS "]
[null,"H.B. Fuller France SAS"]
[null,"Home Design international  Ltd"]
[null,"Huber Tricot Gesellschaft GmbH"]
[null,"CAPGEMINI BELGIUM NV"]
[null,"Groupe F. Guarino Design SAS"]
[null,"Bright Brands Sportsgoods S.A."]
[null,"British American Tobacco Holdings"]
[null,"BÜHLER GMBH"]

{"sheet":"Unpaid_details","index":1,"n_rows":241,"n_cols":14,"rows_kept":241}
[{"$nulls":3},"Company","Client No.","Company concerned","Document Date","Due \nDate","Document Type","Document No.","Remaining Amount","Contact name","Email address to send","Consultant"]
[{"$nulls":3},"VSUK","411AALBORGPORTLANDBE","Aalborg Portland Belgium","2019-05-31","2019-06-30","Invoice","IN05190008",{"v":571.67,"d":"571.67 €"},{"$f":"IF(VLOOKUP(F2,Companies!$B$3:$M$1250,2,FALSE)<>\"\",VLOOKUP(F2,Companies!$B$3:$M$1250,2,FALSE),IF(VLOOKUP(F2,Companies!$B$3:$M$1250,4,FALSE)<>\"\",VLOOKUP(F2,Companies!$B$3:$M$1250,4,FALSE),IF(VLOOKUP(F2,Companies!$B$3:$M$1250,6,FALSE)<>\"\",VLOOKUP(F2,Companies!$B$3:$M$1250,6,FALSE),IF(VLOOKUP(F2,Companies!$B$3:$M$1250,8,FALSE)<>\"\",VLOOKUP(F2,Companies!$B$3:$M$1250,8,FALSE),IF(VLOOKUP(F2,Companies!$B$3:$M$1250,10,FALSE)<>\"\",VLOOKUP(F2,Companies!$B$3:$M$1250,10,FALSE),\"\")))))","v":""},{"$f":"IF(VLOOKUP(F2,Companies!$B$3:$M$1250,3,FALSE)<>\"\",VLOOKUP(F2,Companies!$B$3:$M$1250,3,FALSE),IF(VLOOKUP(F2,Companies!$B$3:$M$1250,5,FALSE)<>\"\",VLOOKUP(F2,Companies!$B$3:$M$1250,5,FALSE),IF(VLOOKUP(F2,Companies!$B$3:$M$1250,7,FALSE)<>\"\",VLOOKUP(F2,Companies!$B$3:$M$1250,7,FALSE),IF(VLOOKUP(F2,Companies!$B$3:$M$1250,9,FALSE)<>\"\",VLOOKUP(F2,Companies!$B$3:$M$1250,9,FALSE),IF(VLOOKUP(F2,Companies!$B$3:$M$1250,11,FALSE)<>\"\",VLOOKUP(F2,Companies!$B$3:$M$1250,11,FALSE),\"\")))))","v":"papapapapapapa"},"candy"]
[{"$nulls":3},"VSFR","411ACCESS","Access","2018-09-30","2018-11-14","Invoice","18.09.0065",{"v":309.59,"d":"309.59 €"},"kobli",{"$f":"IF(VLOOKUP(F3,Companies!$B$3:$M$1250,3,FALSE)<>\"\",VLOOKUP(F3,Companies!$B$3:$M$1250,3,FALSE),IF(VLOOKUP(F3,Companies!$B$3:$M$1250,5,FALSE)<>\"\",VLOOKUP(F3,Companies!$B$3:$M$1250,5,FALSE),IF(VLOOKUP(F3,Companies!$B$3:$M$1250,7,FALSE)<>\"\",VLOOKUP(F3,Companies!$B$3:$M$1250,7,FALSE),IF(VLOOKUP(F3,Companies!$B$3:$M$1250,9,FALSE)<>\"\",VLOOKUP(F3,Companies!$B$3:$M$1250,9,FALSE),IF(VLOOKUP(F3,Companies!$B$3:$M$1250,11,FALSE)<>\"\",VLOOKUP(F3,Companies!$B$3:$M$1250,11,FALSE),\"\")))))","v":"jkjregihgtrnnbtr"},"papap"]
[{"$nulls":3},"VSFR","411ALTERCOSMETODIFUS","ALTERCOSMETO DIFFUSION","2019-05-31","2019-06-30","Invoice","FA19050100",{"v":420,"d":"420.00 €"},{"$f":"IF(VLOOKUP(F4,Companies!$B$3:$M$1250,2,FALSE)<>\"\",VLOOKUP(F4,Companies!$B$3:$M$1250,2,FALSE),IF(VLOOKUP(F4,Companies!$B$3:$M$1250,4,FALSE)<>\"\",VLOOKUP(F4,Companies!$B$3:$M$1250,4,FALSE),IF(VLOOKUP(F4,Companies!$B$3:$M$1250,6,FALSE)<>\"\",VLOOKUP(F4,Companies!$B$3:$M$1250,6,FALSE),IF(VLOOKUP(F4,Companies!$B$3:$M$1250,8,FALSE)<>\"\",VLOOKUP(F4,Companies!$B$3:$M$1250,8,FALSE),IF(VLOOKUP(F4,Companies!$B$3:$M$1250,10,FALSE)<>\"\",VLOOKUP(F4,Companies!$B$3:$M$1250,10,FALSE),\"\")))))","v":""},{"$f":"IF(VLOOKUP(F4,Companies!$B$3:$M$1250,3,FALSE)<>\"\",VLOOKUP(F4,Companies!$B$3:$M$1250,3,FALSE),IF(VLOOKUP(F4,Companies!$B$3:$M$1250,5,FALSE)<>\"\",VLOOKUP(F4,Companies!$B$3:$M$1250,5,FALSE),IF(VLOOKUP(F4,Companies!$B$3:$M$1250,7,FALSE)<>\"\",VLOOKUP(F4,Companies!$B$3:$M$1250,7,FALSE),IF(VLOOKUP(F4,Companies!$B$3:$M$1250,9,FALSE)<>\"\",VLOOKUP(F4,Companies!$B$3:$M$1250,9,FALSE),IF(VLOOKUP(F4,Companies!$B$3:$M$1250,11,FALSE)<>\"\",VLOOKUP(F4,Companies!$B$3:$M$1250,11,FALSE),\"\")))))","v":"vtbytnbhnhntfe"},{"$f":"IF(VLOOKUP(F4,Companies!$B$3:$M$1250,12,FALSE)<>\"\",VLOOKUP(F4,Companies!$B$3:$M$1250,12,FALSE),\"\")","v":""}]
[{"$nulls":3},"VSFR","411AMCOREUROPEANGROU","Amcor Europe Group Management","2019-04-23","2019-05-23","Invoice","19.04.0014",{"v":132.36,"d":"132.36 €"},{"$f":"IF(VLOOKUP(F5,Companies!$B$3:$M$1250,2,FALSE)<>\"\",VLOOKUP(F5,Companies!$B$3:$M$1250,2,FALSE),IF(VLOOKUP(F5,Companies!$B$3:$M$1250,4,FALSE)<>\"\",VLOOKUP(F5,Companies!$B$3:$M$1250,4,FALSE),IF(VLOOKUP(F5,Companies!$B$3:$M$1250,6,FALSE)<>\"\",VLOOKUP(F5,Companies!$B$3:$M$1250,6,FALSE),IF(VLOOKUP(F5,Companies!$B$3:$M$1250,8,FALSE)<>\"\",VLOOKUP(F5,Companies!$B$3:$M$1250,8,FALSE),IF(VLOOKUP(F5,Companies!$B$3:$M$1250,10,FALSE)<>\"\",VLOOKUP(F5,Companies!$B$3:$M$1250,10,FALSE),\"\")))))","v":""},{"$f":"IF(VLOOKUP(F5,Companies!$B$3:$M$1250,3,FALSE)<>\"\",VLOOKUP(F5,Companies!$B$3:$M$1250,3,FALSE),IF(VLOOKUP(F5,Companies!$B$3:$M$1250,5,FALSE)<>\"\",VLOOKUP(F5,Companies!$B$3:$M$1250,5,FALSE),IF(VLOOKUP(F5,Companies!$B$3:$M$1250,7,FALSE)<>\"\",VLOOKUP(F5,Companies!$B$3:$M$1250,7,FALSE),IF(VLOOKUP(F5,Companies!$B$3:$M$1250,9,FALSE)<>\"\",VLOOKUP(F5,Companies!$B$3:$M$1250,9,FALSE),IF(VLOOKUP(F5,Companies!$B$3:$M$1250,11,FALSE)<>\"\",VLOOKUP(F5,Companies!$B$3:$M$1250,11,FALSE),\"\")))))","v":""},{"$f":"IF(VLOOKUP(F5,Companies!$B$3:$M$1250,12,FALSE)<>\"\",VLOOKUP(F5,Companies!$B$3:$M$1250,12,FALSE),\"\")","v":""}]
[{"$nulls":3},"VSFR","411AMCOREUROPEANGROU","Amcor Europe Group Management","2019-04-30","2019-05-30","Invoice","19.04.0060",{"v":43.94,"d":"43.94 €"},{"$f":"IF(VLOOKUP(F6,Companies!$B$3:$M$1250,2,FALSE)<>\"\",VLOOKUP(F6,Companies!$B$3:$M$1250,2,FALSE),IF(VLOOKUP(F6,Companies!$B$3:$M$1250,4,FALSE)<>\"\",VLOOKUP(F6,Companies!$B$3:$M$1250,4,FALSE),IF(VLOOKUP(F6,Companies!$B$3:$M$1250,6,FALSE)<>\"\",VLOOKUP(F6,Companies!$B$3:$M$1250,6,FALSE),IF(VLOOKUP(F6,Companies!$B$3:$M$1250,8,FALSE)<>\"\",VLOOKUP(F6,Companies!$B$3:$M$1250,8,FALSE),IF(VLOOKUP(F6,Companies!$B$3:$M$1250,10,FALSE)<>\"\",VLOOKUP(F6,Companies!$B$3:$M$1250,10,FALSE),\"\")))))","v":""},{"$f":"IF(VLOOKUP(F6,Companies!$B$3:$M$1250,3,FALSE)<>\"\",VLOOKUP(F6,Companies!$B$3:$M$1250,3,FALSE),IF(VLOOKUP(F6,Companies!$B$3:$M$1250,5,FALSE)<>\"\",VLOOKUP(F6,Companies!$B$3:$M$1250,5,FALSE),IF(VLOOKUP(F6,Companies!$B$3:$M$1250,7,FALSE)<>\"\",VLOOKUP(F6,Companies!$B$3:$M$1250,7,FALSE),IF(VLOOKUP(F6,Companies!$B$3:$M$1250,9,FALSE)<>\"\",VLOOKUP(F6,Companies!$B$3:$M$1250,9,FALSE),IF(VLOOKUP(F6,Companies!$B$3:$M$1250,11,FALSE)<>\"\",VLOOKUP(F6,Companies!$B$3:$M$1250,11,FALSE),\"\")))))","v":""},{"$f":"IF(VLOOKUP(F6,Companies!$B$3:$M$1250,12,FALSE)<>\"\",VLOOKUP(F6,Companies!$B$3:$M$1250,12,FALSE),\"\")","v":""}]
[{"$nulls":3},"VSFR","411AMCOREUROPEANGROU","Amcor Europe Group Management","2019-05-31","2019-06-30","Invoice",{"$f":"\"19050017\"","v":"19050017"},{"v":300,"d":"300.00 €"},{"$f":"IF(VLOOKUP(F7,Companies!$B$3:$M$1250,2,FALSE)<>\"\",VLOOKUP(F7,Companies!$B$3:$M$1250,2,FALSE),IF(VLOOKUP(F7,Companies!$B$3:$M$1250,4,FALSE)<>\"\",VLOOKUP(F7,Companies!$B$3:$M$1250,4,FALSE),IF(VLOOKUP(F7,Companies!$B$3:$M$1250,6,FALSE)<>\"\",VLOOKUP(F7,Companies!$B$3:$M$1250,6,FALSE),IF(VLOOKUP(F7,Companies!$B$3:$M$1250,8,FALSE)<>\"\",VLOOKUP(F7,Companies!$B$3:$M$1250,8,FALSE),IF(VLOOKUP(F7,Companies!$B$3:$M$1250,10,FALSE)<>\"\",VLOOKUP(F7,Companies!$B$3:$M$1250,10,FALSE),\"\")))))","v":""},{"$f":"IF(VLOOKUP(F7,Companies!$B$3:$M$1250,3,FALSE)<>\"\",VLOOKUP(F7,Companies!$B$3:$M$1250,3,FALSE),IF(VLOOKUP(F7,Companies!$B$3:$M$1250,5,FALSE)<>\"\",VLOOKUP(F7,Companies!$B$3:$M$1250,5,FALSE),IF(VLOOKUP(F7,Companies!$B$3:$M$1250,7,FALSE)<>\"\",VLOOKUP(F7,Companies!$B$3:$M$1250,7,FALSE),IF(VLOOKUP(F7,Companies!$B$3:$M$1250,9,FALSE)<>\"\",VLOOKUP(F7,Companies!$B$3:$M$1250,9,FALSE),IF(VLOOKUP(F7,Companies!$B$3:$M$1250,11,FALSE)<>\"\",VLOOKUP(F7,Companies!$B$3:$M$1250,11,FALSE),\"\")))))","v":""},{"$f":"IF(VLOOKUP(F7,Companies!$B$3:$M$1250,12,FALSE)<>\"\",VLOOKUP(F7,Companies!$B$3:$M$1250,12,FALSE),\"\")","v":""}]
[{"$nulls":3},"VSPT","C000381071","Asociacion Latinoamericana de Administradores","2019-05-31","2019-06-30","Invoice","FA 2019/64",{"v":55,"d":"55.00 €"},{"$f":"IF(VLOOKUP(F8,Companies!$B$3:$M$1250,2,FALSE)<>\"\",VLOOKUP(F8,Companies!$B$3:$M$1250,2,FALSE),IF(VLOOKUP(F8,Companies!$B$3:$M$1250,4,FALSE)<>\"\",VLOOKUP(F8,Companies!$B$3:$M$1250,4,FALSE),IF(VLOOKUP(F8,Companies!$B$3:$M$1250,6,FALSE)<>\"\",VLOOKUP(F8,Companies!$B$3:$M$1250,6,FALSE),IF(VLOOKUP(F8,Companies!$B$3:$M$1250,8,FALSE)<>\"\",VLOOKUP(F8,Companies!$B$3:$M$1250,8,FALSE),IF(VLOOKUP(F8,Companies!$B$3:$M$1250,10,FALSE)<>\"\",VLOOKUP(F8,Companies!$B$3:$M$1250,10,FALSE),\"\")))))","v":""},{"$f":"IF(VLOOKUP(F8,Companies!$B$3:$M$1250,3,FALSE)<>\"\",VLOOKUP(F8,Companies!$B$3:$M$1250,3,FALSE),IF(VLOOKUP(F8,Companies!$B$3:$M$1250,5,FALSE)<>\"\",VLOOKUP(F8,Companies!$B$3:$M$1250,5,FALSE),IF(VLOOKUP(F8,Companies!$B$3:$M$1250,7,FALSE)<>\"\",VLOOKUP(F8,Companies!$B$3:$M$1250,7,FALSE),IF(VLOOKUP(F8,Companies!$B$3:$M$1250,9,FALSE)<>\"\",VLOOKUP(F8,Companies!$B$3:$M$1250,9,FALSE),IF(VLOOKUP(F8,Companies!$B$3:$M$1250,11,FALSE)<>\"\",VLOOKUP(F8,Companies!$B$3:$M$1250,11,FALSE),\"\")))))","v":""},{"$f":"IF(VLOOKUP(F8,Companies!$B$3:$M$1250,12,FALSE)<>\"\",VLOOKUP(F8,Companies!$B$3:$M$1250,12,FALSE),\"\")","v":""}]
[{"$nulls":3},"VSPT","C000381071","Asociacion Latinoamericana de Administradores","2018-12-31","2019-01-30","Invoice","FA 2018/127",{"v":522.01,"d":"522.01 €"},{"$f":"IF(VLOOKUP(F9,Companies!$B$3:$M$1250,2,FALSE)<>\"\",VLOOKUP(F9,Companies!$B$3:$M$1250,2,FALSE),IF(VLOOKUP(F9,Companies!$B$3:$M$1250,4,FALSE)<>\"\",VLOOKUP(F9,Companies!$B$3:$M$1250,4,FALSE),IF(VLOOKUP(F9,Companies!$B$3:$M$1250,6,FALSE)<>\"\",VLOOKUP(F9,Companies!$B$3:$M$1250,6,FALSE),IF(VLOOKUP(F9,Companies!$B$3:$M$1250,8,FALSE)<>\"\",VLOOKUP(F9,Companies!$B$3:$M$1250,8,FALSE),IF(VLOOKUP(F9,Companies!$B$3:$M$1250,10,FALSE)<>\"\",VLOOKUP(F9,Companies!$B$3:$M$1250,10,FALSE),\"\")))))","v":""},{"$f":"IF(VLOOKUP(F9,Companies!$B$3:$M$1250,3,FALSE)<>\"\",VLOOKUP(F9,Companies!$B$3:$M$1250,3,FALSE),IF(VLOOKUP(F9,Companies!$B$3:$M$1250,5,FALSE)<>\"\",VLOOKUP(F9,Companies!$B$3:$M$1250,5,FALSE),IF(VLOOKUP(F9,Companies!$B$3:$M$1250,7,FALSE)<>\"\",VLOOKUP(F9,Companies!$B$3:$M$1250,7,FALSE),IF(VLOOKUP(F9,Companies!$B$3:$M$1250,9,FALSE)<>\"\",VLOOKUP(F9,Companies!$B$3:$M$1250,9,FALSE),IF(VLOOKUP(F9,Companies!$B$3:$M$1250,11,FALSE)<>\"\",VLOOKUP(F9,Companies!$B$3:$M$1250,11,FALSE),\"\")))))","v":""},{"$f":"IF(VLOOKUP(F9,Companies!$B$3:$M$1250,12,FALSE)<>\"\",VLOOKUP(F9,Companies!$B$3:$M$1250,12,FALSE),\"\")","v":""}]
[{"$nulls":3},"VSPT","C000381071","Asociacion Latinoamericana de Administradores","2019-01-31","2019-03-02","Invoice","FA 2019/12",{"v":297.5,"d":"297.50 €"},{"$f":"IF(VLOOKUP(F10,Companies!$B$3:$M$1250,2,FALSE)<>\"\",VLOOKUP(F10,Companies!$B$3:$M$1250,2,FALSE),IF(VLOOKUP(F10,Companies!$B$3:$M$1250,4,FALSE)<>\"\",VLOOKUP(F10,Companies!$B$3:$M$1250,4,FALSE),IF(VLOOKUP(F10,Companies!$B$3:$M$1250,6,FALSE)<>\"\",VLOOKUP(F10,Companies!$B$3:$M$1250,6,FALSE),IF(VLOOKUP(F10,Companies!$B$3:$M$1250,8,FALSE)<>\"\",VLOOKUP(F10,Companies!$B$3:$M$1250,8,FALSE),IF(VLOOKUP(F10,Companies!$B$3:$M$1250,10,FALSE)<>\"\",VLOOKUP(F10,Companies!$B$3:$M$1250,10,FALSE),\"\")))))","v":""},{"$f":"IF(VLOOKUP(F10,Companies!$B$3:$M$1250,3,FALSE)<>\"\",VLOOKUP(F10,Companies!$B$3:$M$1250,3,FALSE),IF(VLOOKUP(F10,Companies!$B$3:$M$1250,5,FALSE)<>\"\",VLOOKUP(F10,Companies!$B$3:$M$1250,5,FALSE),IF(VLOOKUP(F10,Companies!$B$3:$M$1250,7,FALSE)<>\"\",VLOOKUP(F10,Companies!$B$3:$M$1250,7,FALSE),IF(VLOOKUP(F10,Companies!$B$3:$M$1250,9,FALSE)<>\"\",VLOOKUP(F10,Companies!$B$3:$M$1250,9,FALSE),IF(VLOOKUP(F10,Companies!$B$3:$M$1250,11,FALSE)<>\"\",VLOOKUP(F10,Companies!$B$3:$M$1250,11,FALSE),\"\")))))","v":""},{"$f":"IF(VLOOKUP(F10,Companies!$B$3:$M$1250,12,FALSE)<>\"\",VLOOKUP(F10,Companies!$B$3:$M$1250,12,FALSE),\"\")","v":""}]
[{"$nulls":3},"VSPT","C000381071","Asociacion Latinoamericana de Administradores","2019-03-29","2019-04-28","Invoice","FA 2019/32",{"v":54.83,"d":"54.83 €"},"Joachim","ferfregtrhtrhtr","rtytruytjy"]
[{"$nulls":3},"VSFR","411AUTONEUMBELGIUMNV","Autoneum Belgium NV","2018-10-31","2018-11-30","Invoice","18.10.0249",{"v":4349.34,"d":"4,349.34 €"},{"$f":"IF(VLOOKUP(F12,Companies!$B$3:$M$1250,2,FALSE)<>\"\",VLOOKUP(F12,Companies!$B$3:$M$1250,2,FALSE),IF(VLOOKUP(F12,Companies!$B$3:$M$1250,4,FALSE)<>\"\",VLOOKUP(F12,Companies!$B$3:$M$1250,4,FALSE),IF(VLOOKUP(F12,Companies!$B$3:$M$1250,6,FALSE)<>\"\",VLOOKUP(F12,Companies!$B$3:$M$1250,6,FALSE),IF(VLOOKUP(F12,Companies!$B$3:$M$1250,8,FALSE)<>\"\",VLOOKUP(F12,Companies!$B$3:$M$1250,8,FALSE),IF(VLOOKUP(F12,Companies!$B$3:$M$1250,10,FALSE)<>\"\",VLOOKUP(F12,Companies!$B$3:$M$1250,10,FALSE),\"\")))))","v":""},{"$f":"IF(VLOOKUP(F12,Companies!$B$3:$M$1250,3,FALSE)<>\"\",VLOOKUP(F12,Companies!$B$3:$M$1250,3,FALSE),IF(VLOOKUP(F12,Companies!$B$3:$M$1250,5,FALSE)<>\"\",VLOOKUP(F12,Companies!$B$3:$M$1250,5,FALSE),IF(VLOOKUP(F12,Companies!$B$3:$M$1250,7,FALSE)<>\"\",VLOOKUP(F12,Companies!$B$3:$M$1250,7,FALSE),IF(VLOOKUP(F12,Companies!$B$3:$M$1250,9,FALSE)<>\"\",VLOOKUP(F12,Companies!$B$3:$M$1250,9,FALSE),IF(VLOOKUP(F12,Companies!$B$3:$M$1250,11,FALSE)<>\"\",VLOOKUP(F12,Companies!$B$3:$M$1250,11,FALSE),\"\")))))","v":""},{"$f":"IF(VLOOKUP(F12,Companies!$B$3:$M$1250,12,FALSE)<>\"\",VLOOKUP(F12,Companies!$B$3:$M$1250,12,FALSE),\"\")","v":""}]
[{"$nulls":3},"VSFR","411AUTONEUMBELGIUMNV","Autoneum Belgium NV","2018-11-30","2018-12-30","Invoice","18.11.0243",{"v":1866.67,"d":"1,866.67 €"},{"$f":"IF(VLOOKUP(F13,Companies!$B$3:$M$1250,2,FALSE)<>\"\",VLOOKUP(F13,Companies!$B$3:$M$1250,2,FALSE),IF(VLOOKUP(F13,Companies!$B$3:$M$1250,4,FALSE)<>\"\",VLOOKUP(F13,Companies!$B$3:$M$1250,4,FALSE),IF(VLOOKUP(F13,Companies!$B$3:$M$1250,6,FALSE)<>\"\",VLOOKUP(F13,Companies!$B$3:$M$1250,6,FALSE),IF(VLOOKUP(F13,Companies!$B$3:$M$1250,8,FALSE)<>\"\",VLOOKUP(F13,Companies!$B$3:$M$1250,8,FALSE),IF(VLOOKUP(F13,Companies!$B$3:$M$1250,10,FALSE)<>\"\",VLOOKUP(F13,Companies!$B$3:$M$1250,10,FALSE),\"\")))))","v":""},{"$f":"IF(VLOOKUP(F13,Companies!$B$3:$M$1250,3,FALSE)<>\"\",VLOOKUP(F13,Companies!$B$3:$M$1250,3,FALSE),IF(VLOOKUP(F13,Companies!$B$3:$M$1250,5,FALSE)<>\"\",VLOOKUP(F13,Companies!$B$3:$M$1250,5,FALSE),IF(VLOOKUP(F13,Companies!$B$3:$M$1250,7,FALSE)<>\"\",VLOOKUP(F13,Companies!$B$3:$M$1250,7,FALSE),IF(VLOOKUP(F13,Companies!$B$3:$M$1250,9,FALSE)<>\"\",VLOOKUP(F13,Companies!$B$3:$M$1250,9,FALSE),IF(VLOOKUP(F13,Companies!$B$3:$M$1250,11,FALSE)<>\"\",VLOOKUP(F13,Companies!$B$3:$M$1250,11,FALSE),\"\")))))","v":""},{"$f":"IF(VLOOKUP(F13,Companies!$B$3:$M$1250,12,FALSE)<>\"\",VLOOKUP(F13,Companies!$B$3:$M$1250,12,FALSE),\"\")","v":""}]
[{"$nulls":3},"VSFR","411AUTONEUMBELGIUMNV","Autoneum Belgium NV","2019-03-31","2019-04-30","Invoice","19.03.0196",{"v":1806.66,"d":"1,806.66 €"},{"$f":"IF(VLOOKUP(F14,Companies!$B$3:$M$1250,2,FALSE)<>\"\",VLOOKUP(F14,Companies!$B$3:$M$1250,2,FALSE),IF(VLOOKUP(F14,Companies!$B$3:$M$1250,4,FALSE)<>\"\",VLOOKUP(F14,Companies!$B$3:$M$1250,4,FALSE),IF(VLOOKUP(F14,Companies!$B$3:$M$1250,6,FALSE)<>\"\",VLOOKUP(F14,Companies!$B$3:$M$1250,6,FALSE),IF(VLOOKUP(F14,Companies!$B$3:$M$1250,8,FALSE)<>\"\",VLOOKUP(F14,Companies!$B$3:$M$1250,8,FALSE),IF(VLOOKUP(F14,Companies!$B$3:$M$1250,10,FALSE)<>\"\",VLOOKUP(F14,Companies!$B$3:$M$1250,10,FALSE),\"\")))))","v":""},{"$f":"IF(VLOOKUP(F14,Companies!$B$3:$M$1250,3,FALSE)<>\"\",VLOOKUP(F14,Companies!$B$3:$M$1250,3,FALSE),IF(VLOOKUP(F14,Companies!$B$3:$M$1250,5,FALSE)<>\"\",VLOOKUP(F14,Companies!$B$3:$M$1250,5,FALSE),IF(VLOOKUP(F14,Companies!$B$3:$M$1250,7,FALSE)<>\"\",VLOOKUP(F14,Companies!$B$3:$M$1250,7,FALSE),IF(VLOOKUP(F14,Companies!$B$3:$M$1250,9,FALSE)<>\"\",VLOOKUP(F14,Companies!$B$3:$M$1250,9,FALSE),IF(VLOOKUP(F14,Companies!$B$3:$M$1250,11,FALSE)<>\"\",VLOOKUP(F14,Companies!$B$3:$M$1250,11,FALSE),\"\")))))","v":""},{"$f":"IF(VLOOKUP(F14,Companies!$B$3:$M$1250,12,FALSE)<>\"\",VLOOKUP(F14,Companies!$B$3:$M$1250,12,FALSE),\"\")","v":""}]
[{"$nulls":3},"VSFR","411AUTONEUMGBLIMITED","Autoneum GB Limited","2019-04-30","2019-05-30","Invoice","19.04.0090",{"v":1213.33,"d":"1,213.33 €"},{"$f":"IF(VLOOKUP(F15,Companies!$B$3:$M$1250,2,FALSE)<>\"\",VLOOKUP(F15,Companies!$B$3:$M$1250,2,FALSE),IF(VLOOKUP(F15,Companies!$B$3:$M$1250,4,FALSE)<>\"\",VLOOKUP(F15,Companies!$B$3:$M$1250,4,FALSE),IF(VLOOKUP(F15,Companies!$B$3:$M$1250,6,FALSE)<>\"\",VLOOKUP(F15,Companies!$B$3:$M$1250,6,FALSE),IF(VLOOKUP(F15,Companies!$B$3:$M$1250,8,FALSE)<>\"\",VLOOKUP(F15,Companies!$B$3:$M$1250,8,FALSE),IF(VLOOKUP(F15,Companies!$B$3:$M$1250,10,FALSE)<>\"\",VLOOKUP(F15,Companies!$B$3:$M$1250,10,FALSE),\"\")))))","v":""},{"$f":"IF(VLOOKUP(F15,Companies!$B$3:$M$1250,3,FALSE)<>\"\",VLOOKUP(F15,Companies!$B$3:$M$1250,3,FALSE),IF(VLOOKUP(F15,Companies!$B$3:$M$1250,5,FALSE)<>\"\",VLOOKUP(F15,Companies!$B$3:$M$1250,5,FALSE),IF(VLOOKUP(F15,Companies!$B$3:$M$1250,7,FALSE)<>\"\",VLOOKUP(F15,Companies!$B$3:$M$1250,7,FALSE),IF(VLOOKUP(F15,Companies!$B$3:$M$1250,9,FALSE)<>\"\",VLOOKUP(F15,Companies!$B$3:$M$1250,9,FALSE),IF(VLOOKUP(F15,Companies!$B$3:$M$1250,11,FALSE)<>\"\",VLOOKUP(F15,Companies!$B$3:$M$1250,11,FALSE),\"\")))))","v":""},{"$f":"IF(VLOOKUP(F15,Companies!$B$3:$M$1250,12,FALSE)<>\"\",VLOOKUP(F15,Companies!$B$3:$M$1250,12,FALSE),\"\")","v":""}]
[{"$nulls":3},"VSFR","411AUTONEUMPOLANDSPZ","AUTONEUM POLAND Sp. Z o.o.","2019-04-30","2019-05-30","Invoice","19.04.0118",{"v":773.34,"d":"773.34 €"},{"$f":"IF(VLOOKUP(F16,Companies!$B$3:$M$1250,2,FALSE)<>\"\",VLOOKUP(F16,Companies!$B$3:$M$1250,2,FALSE),IF(VLOOKUP(F16,Companies!$B$3:$M$1250,4,FALSE)<>\"\",VLOOKUP(F16,Companies!$B$3:$M$1250,4,FALSE),IF(VLOOKUP(F16,Companies!$B$3:$M$1250,6,FALSE)<>\"\",VLOOKUP(F16,Companies!$B$3:$M$1250,6,FALSE),IF(VLOOKUP(F16,Companies!$B$3:$M$1250,8,FALSE)<>\"\",VLOOKUP(F16,Companies!$B$3:$M$1250,8,FALSE),IF(VLOOKUP(F16,Companies!$B$3:$M$1250,10,FALSE)<>\"\",VLOOKUP(F16,Companies!$B$3:$M$1250,10,FALSE),\"\")))))","v":""},{"$f":"IF(VLOOKUP(F16,Companies!$B$3:$M$1250,3,FALSE)<>\"\",VLOOKUP(F16,Companies!$B$3:$M$1250,3,FALSE),IF(VLOOKUP(F16,Companies!$B$3:$M$1250,5,FALSE)<>\"\",VLOOKUP(F16,Companies!$B$3:$M$1250,5,FALSE),IF(VLOOKUP(F16,Companies!$B$3:$M$1250,7,FALSE)<>\"\",VLOOKUP(F16,Companies!$B$3:$M$1250,7,FALSE),IF(VLOOKUP(F16,Companies!$B$3:$M$1250,9,FALSE)<>\"\",VLOOKUP(F16,Companies!$B$3:$M$1250,9,FALSE),IF(VLOOKUP(F16,Companies!$B$3:$M$1250,11,FALSE)<>\"\",VLOOKUP(F16,Companies!$B$3:$M$1250,11,FALSE),\"\")))))","v":""},{"$f":"IF(VLOOKUP(F16,Companies!$B$3:$M$1250,12,FALSE)<>\"\",VLOOKUP(F16,Companies!$B$3:$M$1250,12,FALSE),\"\")","v":""}]
[{"$nulls":3},"VSFR","411GOTAVERKENMILJOAB","BABCOCK & WILCOX VØLUND AB","2019-05-31","2019-06-30","Invoice","FA19050074",{"v":823.33,"d":"823.33 €"},{"$f":"IF(VLOOKUP(F17,Companies!$B$3:$M$1250,2,FALSE)<>\"\",VLOOKUP(F17,Companies!$B$3:$M$1250,2,FALSE),IF(VLOOKUP(F17,Companies!$B$3:$M$1250,4,FALSE)<>\"\",VLOOKUP(F17,Companies!$B$3:$M$1250,4,FALSE),IF(VLOOKUP(F17,Companies!$B$3:$M$1250,6,FALSE)<>\"\",VLOOKUP(F17,Companies!$B$3:$M$1250,6,FALSE),IF(VLOOKUP(F17,Companies!$B$3:$M$1250,8,FALSE)<>\"\",VLOOKUP(F17,Companies!$B$3:$M$1250,8,FALSE),IF(VLOOKUP(F17,Companies!$B$3:$M$1250,10,FALSE)<>\"\",VLOOKUP(F17,Companies!$B$3:$M$1250,10,FALSE),\"\")))))","v":""},{"$f":"IF(VLOOKUP(F17,Companies!$B$3:$M$1250,3,FALSE)<>\"\",VLOOKUP(F17,Companies!$B$3:$M$1250,3,FALSE),IF(VLOOKUP(F17,Companies!$B$3:$M$1250,5,FALSE)<>\"\",VLOOKUP(F17,Companies!$B$3:$M$1250,5,FALSE),IF(VLOOKUP(F17,Companies!$B$3:$M$1250,7,FALSE)<>\"\",VLOOKUP(F17,Companies!$B$3:$M$1250,7,FALSE),IF(VLOOKUP(F17,Companies!$B$3:$M$1250,9,FALSE)<>\"\",VLOOKUP(F17,Companies!$B$3:$M$1250,9,FALSE),IF(VLOOKUP(F17,Companies!$B$3:$M$1250,11,FALSE)<>\"\",VLOOKUP(F17,Companies!$B$3:$M$1250,11,FALSE),\"\")))))","v":""},{"$f":"IF(VLOOKUP(F17,Companies!$B$3:$M$1250,12,FALSE)<>\"\",VLOOKUP(F17,Companies!$B$3:$M$1250,12,FALSE),\"\")","v":""}]
[{"$nulls":3},"VSUK","411BWVUKENERGYLTD","Babcock & Wilcox Vølund Limited","2019-03-31","2019-04-30","Invoice","03.19.0034",{"v":132,"d":"132.00 €"},{"$f":"IF(VLOOKUP(F18,Companies!$B$3:$M$1250,2,FALSE)<>\"\",VLOOKUP(F18,Companies!$B$3:$M$1250,2,FALSE),IF(VLOOKUP(F18,Companies!$B$3:$M$1250,4,FALSE)<>\"\",VLOOKUP(F18,Companies!$B$3:$M$1250,4,FALSE),IF(VLOOKUP(F18,Companies!$B$3:$M$1250,6,FALSE)<>\"\",VLOOKUP(F18,Companies!$B$3:$M$1250,6,FALSE),IF(VLOOKUP(F18,Companies!$B$3:$M$1250,8,FALSE)<>\"\",VLOOKUP(F18,Companies!$B$3:$M$1250,8,FALSE),IF(VLOOKUP(F18,Companies!$B$3:$M$1250,10,FALSE)<>\"\",VLOOKUP(F18,Companies!$B$3:$M$1250,10,FALSE),\"\")))))","v":""},{"$f":"IF(VLOOKUP(F18,Companies!$B$3:$M$1250,3,FALSE)<>\"\",VLOOKUP(F18,Companies!$B$3:$M$1250,3,FALSE),IF(VLOOKUP(F18,Companies!$B$3:$M$1250,5,FALSE)<>\"\",VLOOKUP(F18,Companies!$B$3:$M$1250,5,FALSE),IF(VLOOKUP(F18,Companies!$B$3:$M$1250,7,FALSE)<>\"\",VLOOKUP(F18,Companies!$B$3:$M$1250,7,FALSE),IF(VLOOKUP(F18,Companies!$B$3:$M$1250,9,FALSE)<>\"\",VLOOKUP(F18,Companies!$B$3:$M$1250,9,FALSE),IF(VLOOKUP(F18,Companies!$B$3:$M$1250,11,FALSE)<>\"\",VLOOKUP(F18,Companies!$B$3:$M$1250,11,FALSE),\"\")))))","v":""},{"$f":"IF(VLOOKUP(F18,Companies!$B$3:$M$1250,12,FALSE)<>\"\",VLOOKUP(F18,Companies!$B$3:$M$1250,12,FALSE),\"\")","v":""}]
[{"$nulls":3},"VSFR","411BNPPARIBASRESTATE","BNP Paribas Real estate consult GMBH","2019-03-31","2019-04-30","Invoice","19.03.0113",{"v":1264.83,"d":"1,264.83 €"},{"$f":"IF(VLOOKUP(F19,Companies!$B$3:$M$1250,2,FALSE)<>\"\",VLOOKUP(F19,Companies!$B$3:$M$1250,2,FALSE),IF(VLOOKUP(F19,Companies!$B$3:$M$1250,4,FALSE)<>\"\",VLOOKUP(F19,Companies!$B$3:$M$1250,4,FALSE),IF(VLOOKUP(F19,Companies!$B$3:$M$1250,6,FALSE)<>\"\",VLOOKUP(F19,Companies!$B$3:$M$1250,6,FALSE),IF(VLOOKUP(F19,Companies!$B$3:$M$1250,8,FALSE)<>\"\",VLOOKUP(F19,Companies!$B$3:$M$1250,8,FALSE),IF(VLOOKUP(F19,Companies!$B$3:$M$1250,10,FALSE)<>\"\",VLOOKUP(F19,Companies!$B$3:$M$1250,10,FALSE),\"\")))))","v":""},{"$f":"IF(VLOOKUP(F19,Companies!$B$3:$M$1250,3,FALSE)<>\"\",VLOOKUP(F19,Companies!$B$3:$M$1250,3,FALSE),IF(VLOOKUP(F19,Companies!$B$3:$M$1250,5,FALSE)<>\"\",VLOOKUP(F19,Companies!$B$3:$M$1250,5,FALSE),IF(VLOOKUP(F19,Companies!$B$3:$M$1250,7,FALSE)<>\"\",VLOOKUP(F19,Companies!$B$3:$M$1250,7,FALSE),IF(VLOOKUP(F19,Companies!$B$3:$M$1250,9,FALSE)<>\"\",VLOOKUP(F19,Companies!$B$3:$M$1250,9,FALSE),IF(VLOOKUP(F19,Companies!$B$3:$M$1250,11,FALSE)<>\"\",VLOOKUP(F19,Companies!$B$3:$M$1250,11,FALSE),\"\")))))","v":""},{"$f":"IF(VLOOKUP(F19,Companies!$B$3:$M$1250,12,FALSE)<>\"\",VLOOKUP(F19,Companies!$B$3:$M$1250,12,FALSE),\"\")","v":""}]
[{"$nulls":3},"VSFR","411BNPPARIBASRESTATE","BNP Paribas Real estate consult GMBH","2019-04-30","2019-05-30","Invoice","19.04.0111",{"v":3258.17,"d":"3,258.17 €"},{"$f":"IF(VLOOKUP(F20,Companies!$B$3:$M$1250,2,FALSE)<>\"\",VLOOKUP(F20,Companies!$B$3:$M$1250,2,FALSE),IF(VLOOKUP(F20,Companies!$B$3:$M$1250,4,FALSE)<>\"\",VLOOKUP(F20,Companies!$B$3:$M$1250,4,FALSE),IF(VLOOKUP(F20,Companies!$B$3:$M$1250,6,FALSE)<>\"\",VLOOKUP(F20,Companies!$B$3:$M$1250,6,FALSE),IF(VLOOKUP(F20,Companies!$B$3:$M$1250,8,FALSE)<>\"\",VLOOKUP(F20,Companies!$B$3:$M$1250,8,FALSE),IF(VLOOKUP(F20,Companies!$B$3:$M$1250,10,FALSE)<>\"\",VLOOKUP(F20,Companies!$B$3:$M$1250,10,FALSE),\"\")))))","v":""},{"$f":"IF(VLOOKUP(F20,Companies!$B$3:$M$1250,3,FALSE)<>\"\",VLOOKUP(F20,Companies!$B$3:$M$1250,3,FALSE),IF(VLOOKUP(F20,Companies!$B$3:$M$1250,5,FALSE)<>\"\",VLOOKUP(F20,Companies!$B$3:$M$1250,5,FALSE),IF(VLOOKUP(F20,Companies!$B$3:$M$1250,7,FALSE)<>\"\",VLOOKUP(F20,Companies!$B$3:$M$1250,7,FALSE),IF(VLOOKUP(F20,Companies!$B$3:$M$1250,9,FALSE)<>\"\",VLOOKUP(F20,Companies!$B$3:$M$1250,9,FALSE),IF(VLOOKUP(F20,Companies!$B$3:$M$1250,11,FALSE)<>\"\",VLOOKUP(F20,Companies!$B$3:$M$1250,11,FALSE),\"\")))))","v":""},{"$f":"IF(VLOOKUP(F20,Companies!$B$3:$M$1250,12,FALSE)<>\"\",VLOOKUP(F20,Companies!$B$3:$M$1250,12,FALSE),\"\")","v":""}]
[{"$nulls":3},"VSFR","411BNPPARIBASRESTATE","BNP Paribas Real estate consult GMBH","2019-05-31","2019-06-30","Invoice","FA19050105",{"v":530,"d":"530.00 €"},{"$f":"IF(VLOOKUP(F21,Companies!$B$3:$M$1250,2,FALSE)<>\"\",VLOOKUP(F21,Companies!$B$3:$M$1250,2,FALSE),IF(VLOOKUP(F21,Companies!$B$3:$M$1250,4,FALSE)<>\"\",VLOOKUP(F21,Companies!$B$3:$M$1250,4,FALSE),IF(VLOOKUP(F21,Companies!$B$3:$M$1250,6,FALSE)<>\"\",VLOOKUP(F21,Companies!$B$3:$M$1250,6,FALSE),IF(VLOOKUP(F21,Companies!$B$3:$M$1250,8,FALSE)<>\"\",VLOOKUP(F21,Companies!$B$3:$M$1250,8,FALSE),IF(VLOOKUP(F21,Companies!$B$3:$M$1250,10,FALSE)<>\"\",VLOOKUP(F21,Companies!$B$3:$M$1250,10,FALSE),\"\")))))","v":""},{"$f":"IF(VLOOKUP(F21,Companies!$B$3:$M$1250,3,FALSE)<>\"\",VLOOKUP(F21,Companies!$B$3:$M$1250,3,FALSE),IF(VLOOKUP(F21,Companies!$B$3:$M$1250,5,FALSE)<>\"\",VLOOKUP(F21,Companies!$B$3:$M$1250,5,FALSE),IF(VLOOKUP(F21,Companies!$B$3:$M$1250,7,FALSE)<>\"\",VLOOKUP(F21,Companies!$B$3:$M$1250,7,FALSE),IF(VLOOKUP(F21,Companies!$B$3:$M$1250,9,FALSE)<>\"\",VLOOKUP(F21,Companies!$B$3:$M$1250,9,FALSE),IF(VLOOKUP(F21,Companies!$B$3:$M$1250,11,FALSE)<>\"\",VLOOKUP(F21,Companies!$B$3:$M$1250,11,FALSE),\"\")))))","v":""},{"$f":"IF(VLOOKUP(F21,Companies!$B$3:$M$1250,12,FALSE)<>\"\",VLOOKUP(F21,Companies!$B$3:$M$1250,12,FALSE),\"\")","v":""}]
[{"$nulls":3},"VSFR","411BNPPARIBAS","BNP PARIBAS SA","2019-04-30","2019-05-30","Invoice","19.04.0063",{"v":4115.84,"d":"4,115.84 €"},{"$f":"IF(VLOOKUP(F22,Companies!$B$3:$M$1250,2,FALSE)<>\"\",VLOOKUP(F22,Companies!$B$3:$M$1250,2,FALSE),IF(VLOOKUP(F22,Companies!$B$3:$M$1250,4,FALSE)<>\"\",VLOOKUP(F22,Companies!$B$3:$M$1250,4,FALSE),IF(VLOOKUP(F22,Companies!$B$3:$M$1250,6,FALSE)<>\"\",VLOOKUP(F22,Companies!$B$3:$M$1250,6,FALSE),IF(VLOOKUP(F22,Companies!$B$3:$M$1250,8,FALSE)<>\"\",VLOOKUP(F22,Companies!$B$3:$M$1250,8,FALSE),IF(VLOOKUP(F22,Companies!$B$3:$M$1250,10,FALSE)<>\"\",VLOOKUP(F22,Companies!$B$3:$M$1250,10,FALSE),\"\")))))","v":""},{"$f":"IF(VLOOKUP(F22,Companies!$B$3:$M$1250,3,FALSE)<>\"\",VLOOKUP(F22,Companies!$B$3:$M$1250,3,FALSE),IF(VLOOKUP(F22,Companies!$B$3:$M$1250,5,FALSE)<>\"\",VLOOKUP(F22,Companies!$B$3:$M$1250,5,FALSE),IF(VLOOKUP(F22,Companies!$B$3:$M$1250,7,FALSE)<>\"\",VLOOKUP(F22,Companies!$B$3:$M$1250,7,FALSE),IF(VLOOKUP(F22,Companies!$B$3:$M$1250,9,FALSE)<>\"\",VLOOKUP(F22,Companies!$B$3:$M$1250,9,FALSE),IF(VLOOKUP(F22,Companies!$B$3:$M$1250,11,FALSE)<>\"\",VLOOKUP(F22,Companies!$B$3:$M$1250,11,FALSE),\"\")))))","v":""},{"$f":"IF(VLOOKUP(F22,Companies!$B$3:$M$1250,12,FALSE)<>\"\",VLOOKUP(F22,Companies!$B$3:$M$1250,12,FALSE),\"\")","v":""}]
[{"$nulls":3},"VSFR","411BORGSTENATEXTILEP","Borgstena Textile Portugal Lda","2019-05-31","2019-06-30","Invoice","FA19050061",{"v":1321.66,"d":"1,321.66 €"},{"$f":"IF(VLOOKUP(F23,Companies!$B$3:$M$1250,2,FALSE)<>\"\",VLOOKUP(F23,Companies!$B$3:$M$1250,2,FALSE),IF(VLOOKUP(F23,Companies!$B$3:$M$1250,4,FALSE)<>\"\",VLOOKUP(F23,Companies!$B$3:$M$1250,4,FALSE),IF(VLOOKUP(F23,Companies!$B$3:$M$1250,6,FALSE)<>\"\",VLOOKUP(F23,Companies!$B$3:$M$1250,6,FALSE),IF(VLOOKUP(F23,Companies!$B$3:$M$1250,8,FALSE)<>\"\",VLOOKUP(F23,Companies!$B$3:$M$1250,8,FALSE),IF(VLOOKUP(F23,Companies!$B$3:$M$1250,10,FALSE)<>\"\",VLOOKUP(F23,Companies!$B$3:$M$1250,10,FALSE),\"\")))))","v":""},{"$f":"IF(VLOOKUP(F23,Companies!$B$3:$M$1250,3,FALSE)<>\"\",VLOOKUP(F23,Companies!$B$3:$M$1250,3,FALSE),IF(VLOOKUP(F23,Companies!$B$3:$M$1250,5,FALSE)<>\"\",VLOOKUP(F23,Companies!$B$3:$M$1250,5,FALSE),IF(VLOOKUP(F23,Companies!$B$3:$M$1250,7,FALSE)<>\"\",VLOOKUP(F23,Companies!$B$3:$M$1250,7,FALSE),IF(VLOOKUP(F23,Companies!$B$3:$M$1250,9,FALSE)<>\"\",VLOOKUP(F23,Companies!$B$3:$M$1250,9,FALSE),IF(VLOOKUP(F23,Companies!$B$3:$M$1250,11,FALSE)<>\"\",VLOOKUP(F23,Companies!$B$3:$M$1250,11,FALSE),\"\")))))","v":""},{"$f":"IF(VLOOKUP(F23,Companies!$B$3:$M$1250,12,FALSE)<>\"\",VLOOKUP(F23,Companies!$B$3:$M$1250,12,FALSE),\"\")","v":""}]
[{"$nulls":3},"VSPT","C000375932","Bright Brands Sportsgoods S.A.","2019-04-30","2019-05-30","Invoice","FA 2019/54",{"v":615,"d":"615.00 €"},{"$f":"IF(VLOOKUP(F24,Companies!$B$3:$M$1250,2,FALSE)<>\"\",VLOOKUP(F24,Companies!$B$3:$M$1250,2,FALSE),IF(VLOOKUP(F24,Companies!$B$3:$M$1250,4,FALSE)<>\"\",VLOOKUP(F24,Companies!$B$3:$M$1250,4,FALSE),IF(VLOOKUP(F24,Companies!$B$3:$M$1250,6,FALSE)<>\"\",VLOOKUP(F24,Companies!$B$3:$M$1250,6,FALSE),IF(VLOOKUP(F24,Companies!$B$3:$M$1250,8,FALSE)<>\"\",VLOOKUP(F24,Companies!$B$3:$M$1250,8,FALSE),IF(VLOOKUP(F24,Companies!$B$3:$M$1250,10,FALSE)<>\"\",VLOOKUP(F24,Companies!$B$3:$M$1250,10,FALSE),\"\")))))","v":""},{"$f":"IF(VLOOKUP(F24,Companies!$B$3:$M$1250,3,FALSE)<>\"\",VLOOKUP(F24,Companies!$B$3:$M$1250,3,FALSE),IF(VLOOKUP(F24,Companies!$B$3:$M$1250,5,FALSE)<>\"\",VLOOKUP(F24,Companies!$B$3:$M$1250,5,FALSE),IF(VLOOKUP(F24,Companies!$B$3:$M$1250,7,FALSE)<>\"\",VLOOKUP(F24,Companies!$B$3:$M$1250,7,FALSE),IF(VLOOKUP(F24,Companies!$B$3:$M$1250,9,FALSE)<>\"\",VLOOKUP(F24,Companies!$B$3:$M$1250,9,FALSE),IF(VLOOKUP(F24,Companies!$B$3:$M$1250,11,FALSE)<>\"\",VLOOKUP(F24,Companies!$B$3:$M$1250,11,FALSE),\"\")))))","v":""},{"$f":"IF(VLOOKUP(F24,Companies!$B$3:$M$1250,12,FALSE)<>\"\",VLOOKUP(F24,Companies!$B$3:$M$1250,12,FALSE),\"\")","v":""}]
[{"$nulls":3},"VSFR",135564,"British American Tobacco Holdings","2019-05-31","2019-06-30","Invoice","FA19050181",{"v":4393.15,"d":"4,393.15 €"},{"$f":"IF(VLOOKUP(F25,Companies!$B$3:$M$1250,2,FALSE)<>\"\",VLOOKUP(F25,Companies!$B$3:$M$1250,2,FALSE),IF(VLOOKUP(F25,Companies!$B$3:$M$1250,4,FALSE)<>\"\",VLOOKUP(F25,Companies!$B$3:$M$1250,4,FALSE),IF(VLOOKUP(F25,Companies!$B$3:$M$1250,6,FALSE)<>\"\",VLOOKUP(F25,Companies!$B$3:$M$1250,6,FALSE),IF(VLOOKUP(F25,Companies!$B$3:$M$1250,8,FALSE)<>\"\",VLOOKUP(F25,Companies!$B$3:$M$1250,8,FALSE),IF(VLOOKUP(F25,Companies!$B$3:$M$1250,10,FALSE)<>\"\",VLOOKUP(F25,Companies!$B$3:$M$1250,10,FALSE),\"\")))))","v":""},{"$f":"IF(VLOOKUP(F25,Companies!$B$3:$M$1250,3,FALSE)<>\"\",VLOOKUP(F25,Companies!$B$3:$M$1250,3,FALSE),IF(VLOOKUP(F25,Companies!$B$3:$M$1250,5,FALSE)<>\"\",VLOOKUP(F25,Companies!$B$3:$M$1250,5,FALSE),IF(VLOOKUP(F25,Companies!$B$3:$M$1250,7,FALSE)<>\"\",VLOOKUP(F25,Companies!$B$3:$M$1250,7,FALSE),IF(VLOOKUP(F25,Companies!$B$3:$M$1250,9,FALSE)<>\"\",VLOOKUP(F25,Companies!$B$3:$M$1250,9,FALSE),IF(VLOOKUP(F25,Companies!$B$3:$M$1250,11,FALSE)<>\"\",VLOOKUP(F25,Companies!$B$3:$M$1250,11,FALSE),\"\")))))","v":""},{"$f":"IF(VLOOKUP(F25,Companies!$B$3:$M$1250,12,FALSE)<>\"\",VLOOKUP(F25,Companies!$B$3:$M$1250,12,FALSE),\"\")","v":""}]
[{"$nulls":3},"VSFR","411BRITISHAMERICAN","British American Tobacco Holdings","2019-03-31","2019-04-30","Invoice","19.03.0185",{"v":6090.16,"d":"6,090.16 €"},{"$f":"IF(VLOOKUP(F26,Companies!$B$3:$M$1250,2,FALSE)<>\"\",VLOOKUP(F26,Companies!$B$3:$M$1250,2,FALSE),IF(VLOOKUP(F26,Companies!$B$3:$M$1250,4,FALSE)<>\"\",VLOOKUP(F26,Companies!$B$3:$M$1250,4,FALSE),IF(VLOOKUP(F26,Companies!$B$3:$M$1250,6,FALSE)<>\"\",VLOOKUP(F26,Companies!$B$3:$M$1250,6,FALSE),IF(VLOOKUP(F26,Companies!$B$3:$M$1250,8,FALSE)<>\"\",VLOOKUP(F26,Companies!$B$3:$M$1250,8,FALSE),IF(VLOOKUP(F26,Companies!$B$3:$M$1250,10,FALSE)<>\"\",VLOOKUP(F26,Companies!$B$3:$M$1250,10,FALSE),\"\")))))","v":""},{"$f":"IF(VLOOKUP(F26,Companies!$B$3:$M$1250,3,FALSE)<>\"\",VLOOKUP(F26,Companies!$B$3:$M$1250,3,FALSE),IF(VLOOKUP(F26,Companies!$B$3:$M$1250,5,FALSE)<>\"\",VLOOKUP(F26,Companies!$B$3:$M$1250,5,FALSE),IF(VLOOKUP(F26,Companies!$B$3:$M$1250,7,FALSE)<>\"\",VLOOKUP(F26,Companies!$B$3:$M$1250,7,FALSE),IF(VLOOKUP(F26,Companies!$B$3:$M$1250,9,FALSE)<>\"\",VLOOKUP(F26,Companies!$B$3:$M$1250,9,FALSE),IF(VLOOKUP(F26,Companies!$B$3:$M$1250,11,FALSE)<>\"\",VLOOKUP(F26,Companies!$B$3:$M$1250,11,FALSE),\"\")))))","v":""},{"$f":"IF(VLOOKUP(F26,Companies!$B$3:$M$1250,12,FALSE)<>\"\",VLOOKUP(F26,Companies!$B$3:$M$1250,12,FALSE),\"\")","v":""}]
[{"$nulls":3},"VSFR","411BRITISHAMERICAN","British American Tobacco Holdings","2019-04-30","2019-05-30","Invoice","19.04.0212",{"v":893.94,"d":"893.94 €"},{"$f":"IF(VLOOKUP(F27,Companies!$B$3:$M$1250,2,FALSE)<>\"\",VLOOKUP(F27,Companies!$B$3:$M$1250,2,FALSE),IF(VLOOKUP(F27,Companies!$B$3:$M$1250,4,FALSE)<>\"\",VLOOKUP(F27,Companies!$B$3:$M$1250,4,FALSE),IF(VLOOKUP(F27,Companies!$B$3:$M$1250,6,FALSE)<>\"\",VLOOKUP(F27,Companies!$B$3:$M$1250,6,FALSE),IF(VLOOKUP(F27,Companies!$B$3:$M$1250,8,FALSE)<>\"\",VLOOKUP(F27,Companies!$B$3:$M$1250,8,FALSE),IF(VLOOKUP(F27,Companies!$B$3:$M$1250,10,FALSE)<>\"\",VLOOKUP(F27,Companies!$B$3:$M$1250,10,FALSE),\"\")))))","v":""},{"$f":"IF(VLOOKUP(F27,Companies!$B$3:$M$1250,3,FALSE)<>\"\",VLOOKUP(F27,Companies!$B$3:$M$1250,3,FALSE),IF(VLOOKUP(F27,Companies!$B$3:$M$1250,5,FALSE)<>\"\",VLOOKUP(F27,Companies!$B$3:$M$1250,5,FALSE),IF(VLOOKUP(F27,Companies!$B$3:$M$1250,7,FALSE)<>\"\",VLOOKUP(F27,Companies!$B$3:$M$1250,7,FALSE),IF(VLOOKUP(F27,Companies!$B$3:$M$1250,9,FALSE)<>\"\",VLOOKUP(F27,Companies!$B$3:$M$1250,9,FALSE),IF(VLOOKUP(F27,Companies!$B$3:$M$1250,11,FALSE)<>\"\",VLOOKUP(F27,Companies!$B$3:$M$1250,11,FALSE),\"\")))))","v":""},{"$f":"IF(VLOOKUP(F27,Companies!$B$3:$M$1250,12,FALSE)<>\"\",VLOOKUP(F27,Companies!$B$3:$M$1250,12,FALSE),\"\")","v":""}]
[{"$nulls":3},"VSFR","411BUHLERGMBH","BÜHLER GMBH","2019-05-31","2019-06-30","Invoice","FA19050132",{"v":6884.16,"d":"6,884.16 €"},{"$f":"IF(VLOOKUP(F28,Companies!$B$3:$M$1250,2,FALSE)<>\"\",VLOOKUP(F28,Companies!$B$3:$M$1250,2,FALSE),IF(VLOOKUP(F28,Companies!$B$3:$M$1250,4,FALSE)<>\"\",VLOOKUP(F28,Companies!$B$3:$M$1250,4,FALSE),IF(VLOOKUP(F28,Companies!$B$3:$M$1250,6,FALSE)<>\"\",VLOOKUP(F28,Companies!$B$3:$M$1250,6,FALSE),IF(VLOOKUP(F28,Companies!$B$3:$M$1250,8,FALSE)<>\"\",VLOOKUP(F28,Companies!$B$3:$M$1250,8,FALSE),IF(VLOOKUP(F28,Companies!$B$3:$M$1250,10,FALSE)<>\"\",VLOOKUP(F28,Companies!$B$3:$M$1250,10,FALSE),\"\")))))","v":""},{"$f":"IF(VLOOKUP(F28,Companies!$B$3:$M$1250,3,FALSE)<>\"\",VLOOKUP(F28,Companies!$B$3:$M$1250,3,FALSE),IF(VLOOKUP(F28,Companies!$B$3:$M$1250,5,FALSE)<>\"\",VLOOKUP(F28,Companies!$B$3:$M$1250,5,FALSE),IF(VLOOKUP(F28,Companies!$B$3:$M$1250,7,FALSE)<>\"\",VLOOKUP(F28,Companies!$B$3:$M$1250,7,FALSE),IF(VLOOKUP(F28,Companies!$B$3:$M$1250,9,FALSE)<>\"\",VLOOKUP(F28,Companies!$B$3:$M$1250,9,FALSE),IF(VLOOKUP(F28,Companies!$B$3:$M$1250,11,FALSE)<>\"\",VLOOKUP(F28,Companies!$B$3:$M$1250,11,FALSE),\"\")))))","v":""},{"$f":"IF(VLOOKUP(F28,Companies!$B$3:$M$1250,12,FALSE)<>\"\",VLOOKUP(F28,Companies!$B$3:$M$1250,12,FALSE),\"\")","v":""}]
[{"$nulls":3},"VSUK","411CAPGEMINIBELGIUMN","CAPGEMINI BELGIUM NV","2019-05-31","2019-06-30","Invoice","IN05190002",{"v":84.17,"d":"84.17 €"},{"$f":"IF(VLOOKUP(F29,Companies!$B$3:$M$1250,2,FALSE)<>\"\",VLOOKUP(F29,Companies!$B$3:$M$1250,2,FALSE),IF(VLOOKUP(F29,Companies!$B$3:$M$1250,4,FALSE)<>\"\",VLOOKUP(F29,Companies!$B$3:$M$1250,4,FALSE),IF(VLOOKUP(F29,Companies!$B$3:$M$1250,6,FALSE)<>\"\",VLOOKUP(F29,Companies!$B$3:$M$1250,6,FALSE),IF(VLOOKUP(F29,Companies!$B$3:$M$1250,8,FALSE)<>\"\",VLOOKUP(F29,Companies!$B$3:$M$1250,8,FALSE),IF(VLOOKUP(F29,Companies!$B$3:$M$1250,10,FALSE)<>\"\",VLOOKUP(F29,Companies!$B$3:$M$1250,10,FALSE),\"\")))))","v":""},{"$f":"IF(VLOOKUP(F29,Companies!$B$3:$M$1250,3,FALSE)<>\"\",VLOOKUP(F29,Companies!$B$3:$M$1250,3,FALSE),IF(VLOOKUP(F29,Companies!$B$3:$M$1250,5,FALSE)<>\"\",VLOOKUP(F29,Companies!$B$3:$M$1250,5,FALSE),IF(VLOOKUP(F29,Companies!$B$3:$M$1250,7,FALSE)<>\"\",VLOOKUP(F29,Companies!$B$3:$M$1250,7,FALSE),IF(VLOOKUP(F29,Companies!$B$3:$M$1250,9,FALSE)<>\"\",VLOOKUP(F29,Companies!$B$3:$M$1250,9,FALSE),IF(VLOOKUP(F29,Companies!$B$3:$M$1250,11,FALSE)<>\"\",VLOOKUP(F29,Companies!$B$3:$M$1250,11,FALSE),\"\")))))","v":""},{"$f":"IF(VLOOKUP(F29,Companies!$B$3:$M$1250,12,FALSE)<>\"\",VLOOKUP(F29,Companies!$B$3:$M$1250,12,FALSE),\"\")","v":""}]
[{"$nulls":3},"VSFR","411CAPGEMINIPOLSKASO","CAPGEMINI POLSKA SP. Z O.O.","2019-05-31","2019-06-30","Invoice",{"$f":"\"19050010\"","v":"19050010"},{"v":300,"d":"300.00 €"},{"$f":"IF(VLOOKUP(F30,Companies!$B$3:$M$1250,2,FALSE)<>\"\",VLOOKUP(F30,Companies!$B$3:$M$1250,2,FALSE),IF(VLOOKUP(F30,Companies!$B$3:$M$1250,4,FALSE)<>\"\",VLOOKUP(F30,Companies!$B$3:$M$1250,4,FALSE),IF(VLOOKUP(F30,Companies!$B$3:$M$1250,6,FALSE)<>\"\",VLOOKUP(F30,Companies!$B$3:$M$1250,6,FALSE),IF(VLOOKUP(F30,Companies!$B$3:$M$1250,8,FALSE)<>\"\",VLOOKUP(F30,Companies!$B$3:$M$1250,8,FALSE),IF(VLOOKUP(F30,Companies!$B$3:$M$1250,10,FALSE)<>\"\",VLOOKUP(F30,Companies!$B$3:$M$1250,10,FALSE),\"\")))))","v":""},{"$f":"IF(VLOOKUP(F30,Companies!$B$3:$M$1250,3,FALSE)<>\"\",VLOOKUP(F30,Companies!$B$3:$M$1250,3,FALSE),IF(VLOOKUP(F30,Companies!$B$3:$M$1250,5,FALSE)<>\"\",VLOOKUP(F30,Companies!$B$3:$M$1250,5,FALSE),IF(VLOOKUP(F30,Companies!$B$3:$M$1250,7,FALSE)<>\"\",VLOOKUP(F30,Companies!$B$3:$M$1250,7,FALSE),IF(VLOOKUP(F30,Companies!$B$3:$M$1250,9,FALSE)<>\"\",VLOOKUP(F30,Companies!$B$3:$M$1250,9,FALSE),IF(VLOOKUP(F30,Companies!$B$3:$M$1250,11,FALSE)<>\"\",VLOOKUP(F30,Companies!$B$3:$M$1250,11,FALSE),\"\")))))","v":""},{"$f":"IF(VLOOKUP(F30,Companies!$B$3:$M$1250,12,FALSE)<>\"\",VLOOKUP(F30,Companies!$B$3:$M$1250,12,FALSE),\"\")","v":""}]
[{"$nulls":3},"VSFR","411CAPGEMINISERVICES","CAPGEMINI SERVICE SAS","2019-04-23","2019-05-23","Invoice","19.04.0019",{"v":21553.64,"d":"21,553.64 €"},{"$f":"IF(VLOOKUP(F31,Companies!$B$3:$M$1250,2,FALSE)<>\"\",VLOOKUP(F31,Companies!$B$3:$M$1250,2,FALSE),IF(VLOOKUP(F31,Companies!$B$3:$M$1250,4,FALSE)<>\"\",VLOOKUP(F31,Companies!$B$3:$M$1250,4,FALSE),IF(VLOOKUP(F31,Companies!$B$3:$M$1250,6,FALSE)<>\"\",VLOOKUP(F31,Companies!$B$3:$M$1250,6,FALSE),IF(VLOOKUP(F31,Companies!$B$3:$M$1250,8,FALSE)<>\"\",VLOOKUP(F31,Companies!$B$3:$M$1250,8,FALSE),IF(VLOOKUP(F31,Companies!$B$3:$M$1250,10,FALSE)<>\"\",VLOOKUP(F31,Companies!$B$3:$M$1250,10,FALSE),\"\")))))","v":""},{"$f":"IF(VLOOKUP(F31,Companies!$B$3:$M$1250,3,FALSE)<>\"\",VLOOKUP(F31,Companies!$B$3:$M$1250,3,FALSE),IF(VLOOKUP(F31,Companies!$B$3:$M$1250,5,FALSE)<>\"\",VLOOKUP(F31,Companies!$B$3:$M$1250,5,FALSE),IF(VLOOKUP(F31,Companies!$B$3:$M$1250,7,FALSE)<>\"\",VLOOKUP(F31,Companies!$B$3:$M$1250,7,FALSE),IF(VLOOKUP(F31,Companies!$B$3:$M$1250,9,FALSE)<>\"\",VLOOKUP(F31,Companies!$B$3:$M$1250,9,FALSE),IF(VLOOKUP(F31,Companies!$B$3:$M$1250,11,FALSE)<>\"\",VLOOKUP(F31,Companies!$B$3:$M$1250,11,FALSE),\"\")))))","v":""},{"$f":"IF(VLOOKUP(F31,Companies!$B$3:$M$1250,12,FALSE)<>\"\",VLOOKUP(F31,Companies!$B$3:$M$1250,12,FALSE),\"\")","v":""}]
[{"$nulls":3},"VSFR","411CAPGEMINITECHNOLO","CAPGEMINI TECHNOLOGY SERVICES","2019-04-30","2019-05-30","Invoice","19.04.0058",{"v":1023.86,"d":"1,023.86 €"},{"$f":"IF(VLOOKUP(F32,Companies!$B$3:$M$1250,2,FALSE)<>\"\",VLOOKUP(F32,Companies!$B$3:$M$1250,2,FALSE),IF(VLOOKUP(F32,Companies!$B$3:$M$1250,4,FALSE)<>\"\",VLOOKUP(F32,Companies!$B$3:$M$1250,4,FALSE),IF(VLOOKUP(F32,Companies!$B$3:$M$1250,6,FALSE)<>\"\",VLOOKUP(F32,Companies!$B$3:$M$1250,6,FALSE),IF(VLOOKUP(F32,Companies!$B$3:$M$1250,8,FALSE)<>\"\",VLOOKUP(F32,Companies!$B$3:$M$1250,8,FALSE),IF(VLOOKUP(F32,Companies!$B$3:$M$1250,10,FALSE)<>\"\",VLOOKUP(F32,Companies!$B$3:$M$1250,10,FALSE),\"\")))))","v":""},{"$f":"IF(VLOOKUP(F32,Companies!$B$3:$M$1250,3,FALSE)<>\"\",VLOOKUP(F32,Companies!$B$3:$M$1250,3,FALSE),IF(VLOOKUP(F32,Companies!$B$3:$M$1250,5,FALSE)<>\"\",VLOOKUP(F32,Companies!$B$3:$M$1250,5,FALSE),IF(VLOOKUP(F32,Companies!$B$3:$M$1250,7,FALSE)<>\"\",VLOOKUP(F32,Companies!$B$3:$M$1250,7,FALSE),IF(VLOOKUP(F32,Companies!$B$3:$M$1250,9,FALSE)<>\"\",VLOOKUP(F32,Companies!$B$3:$M$1250,9,FALSE),IF(VLOOKUP(F32,Companies!$B$3:$M$1250,11,FALSE)<>\"\",VLOOKUP(F32,Companies!$B$3:$M$1250,11,FALSE),\"\")))))","v":""},{"$f":"IF(VLOOKUP(F32,Companies!$B$3:$M$1250,12,FALSE)<>\"\",VLOOKUP(F32,Companies!$B$3:$M$1250,12,FALSE),\"\")","v":""}]
[{"$nulls":3},"VSFR","411CAPGEMINITECHNOLO","CAPGEMINI TECHNOLOGY SERVICES","2019-05-31","2019-06-30","Invoice",{"$f":"\"19050014\"","v":"19050014"},{"v":11367.11,"d":"11,367.11 €"},{"$f":"IF(VLOOKUP(F33,Companies!$B$3:$M$1250,2,FALSE)<>\"\",VLOOKUP(F33,Companies!$B$3:$M$1250,2,FALSE),IF(VLOOKUP(F33,Companies!$B$3:$M$1250,4,FALSE)<>\"\",VLOOKUP(F33,Companies!$B$3:$M$1250,4,FALSE),IF(VLOOKUP(F33,Companies!$B$3:$M$1250,6,FALSE)<>\"\",VLOOKUP(F33,Companies!$B$3:$M$1250,6,FALSE),IF(VLOOKUP(F33,Companies!$B$3:$M$1250,8,FALSE)<>\"\",VLOOKUP(F33,Companies!$B$3:$M$1250,8,FALSE),IF(VLOOKUP(F33,Companies!$B$3:$M$1250,10,FALSE)<>\"\",VLOOKUP(F33,Companies!$B$3:$M$1250,10,FALSE),\"\")))))","v":""},{"$f":"IF(VLOOKUP(F33,Companies!$B$3:$M$1250,3,FALSE)<>\"\",VLOOKUP(F33,Companies!$B$3:$M$1250,3,FALSE),IF(VLOOKUP(F33,Companies!$B$3:$M$1250,5,FALSE)<>\"\",VLOOKUP(F33,Companies!$B$3:$M$1250,5,FALSE),IF(VLOOKUP(F33,Companies!$B$3:$M$1250,7,FALSE)<>\"\",VLOOKUP(F33,Companies!$B$3:$M$1250,7,FALSE),IF(VLOOKUP(F33,Companies!$B$3:$M$1250,9,FALSE)<>\"\",VLOOKUP(F33,Companies!$B$3:$M$1250,9,FALSE),IF(VLOOKUP(F33,Companies!$B$3:$M$1250,11,FALSE)<>\"\",VLOOKUP(F33,Companies!$B$3:$M$1250,11,FALSE),\"\")))))","v":""},{"$f":"IF(VLOOKUP(F33,Companies!$B$3:$M$1250,12,FALSE)<>\"\",VLOOKUP(F33,Companies!$B$3:$M$1250,12,FALSE),\"\")","v":""}]
[{"$nulls":3},"VSFR","411CARROZCOSARL","CARROZ.CO SARL","2018-01-31","2018-03-02","Invoice","18.01.0175",{"v":300,"d":"300.00 €"},{"$f":"IF(VLOOKUP(F34,Companies!$B$3:$M$1250,2,FALSE)<>\"\",VLOOKUP(F34,Companies!$B$3:$M$1250,2,FALSE),IF(VLOOKUP(F34,Companies!$B$3:$M$1250,4,FALSE)<>\"\",VLOOKUP(F34,Companies!$B$3:$M$1250,4,FALSE),IF(VLOOKUP(F34,Companies!$B$3:$M$1250,6,FALSE)<>\"\",VLOOKUP(F34,Companies!$B$3:$M$1250,6,FALSE),IF(VLOOKUP(F34,Companies!$B$3:$M$1250,8,FALSE)<>\"\",VLOOKUP(F34,Companies!$B$3:$M$1250,8,FALSE),IF(VLOOKUP(F34,Companies!$B$3:$M$1250,10,FALSE)<>\"\",VLOOKUP(F34,Companies!$B$3:$M$1250,10,FALSE),\"\")))))","v":""},{"$f":"IF(VLOOKUP(F34,Companies!$B$3:$M$1250,3,FALSE)<>\"\",VLOOKUP(F34,Companies!$B$3:$M$1250,3,FALSE),IF(VLOOKUP(F34,Companies!$B$3:$M$1250,5,FALSE)<>\"\",VLOOKUP(F34,Companies!$B$3:$M$1250,5,FALSE),IF(VLOOKUP(F34,Companies!$B$3:$M$1250,7,FALSE)<>\"\",VLOOKUP(F34,Companies!$B$3:$M$1250,7,FALSE),IF(VLOOKUP(F34,Companies!$B$3:$M$1250,9,FALSE)<>\"\",VLOOKUP(F34,Companies!$B$3:$M$1250,9,FALSE),IF(VLOOKUP(F34,Companies!$B$3:$M$1250,11,FALSE)<>\"\",VLOOKUP(F34,Companies!$B$3:$M$1250,11,FALSE),\"\")))))","v":""},{"$f":"IF(VLOOKUP(F34,Companies!$B$3:$M$1250,12,FALSE)<>\"\",VLOOKUP(F34,Companies!$B$3:$M$1250,12,FALSE),\"\")","v":""}]
[{"$nulls":3},"VSFR","411CARROZCOSARL","CARROZ.CO SARL","2018-02-28","2018-03-30","Invoice","18.02.0083",{"v":300,"d":"300.00 €"},{"$f":"IF(VLOOKUP(F35,Companies!$B$3:$M$1250,2,FALSE)<>\"\",VLOOKUP(F35,Companies!$B$3:$M$1250,2,FALSE),IF(VLOOKUP(F35,Companies!$B$3:$M$1250,4,FALSE)<>\"\",VLOOKUP(F35,Companies!$B$3:$M$1250,4,FALSE),IF(VLOOKUP(F35,Companies!$B$3:$M$1250,6,FALSE)<>\"\",VLOOKUP(F35,Companies!$B$3:$M$1250,6,FALSE),IF(VLOOKUP(F35,Companies!$B$3:$M$1250,8,FALSE)<>\"\",VLOOKUP(F35,Companies!$B$3:$M$1250,8,FALSE),IF(VLOOKUP(F35,Companies!$B$3:$M$1250,10,FALSE)<>\"\",VLOOKUP(F35,Companies!$B$3:$M$1250,10,FALSE),\"\")))))","v":""},{"$f":"IF(VLOOKUP(F35,Companies!$B$3:$M$1250,3,FALSE)<>\"\",VLOOKUP(F35,Companies!$B$3:$M$1250,3,FALSE),IF(VLOOKUP(F35,Companies!$B$3:$M$1250,5,FALSE)<>\"\",VLOOKUP(F35,Companies!$B$3:$M$1250,5,FALSE),IF(VLOOKUP(F35,Companies!$B$3:$M$1250,7,FALSE)<>\"\",VLOOKUP(F35,Companies!$B$3:$M$1250,7,FALSE),IF(VLOOKUP(F35,Companies!$B$3:$M$1250,9,FALSE)<>\"\",VLOOKUP(F35,Companies!$B$3:$M$1250,9,FALSE),IF(VLOOKUP(F35,Companies!$B$3:$M$1250,11,FALSE)<>\"\",VLOOKUP(F35,Companies!$B$3:$M$1250,11,FALSE),\"\")))))","v":""},{"$f":"IF(VLOOKUP(F35,Companies!$B$3:$M$1250,12,FALSE)<>\"\",VLOOKUP(F35,Companies!$B$3:$M$1250,12,FALSE),\"\")","v":""}]
[{"$nulls":3},"VSFR","411CARROZCOSARL","CARROZ.CO SARL","2018-03-29","2018-04-28","Invoice","18.03.0073",{"v":300,"d":"300.00 €"},{"$f":"IF(VLOOKUP(F36,Companies!$B$3:$M$1250,2,FALSE)<>\"\",VLOOKUP(F36,Companies!$B$3:$M$1250,2,FALSE),IF(VLOOKUP(F36,Companies!$B$3:$M$1250,4,FALSE)<>\"\",VLOOKUP(F36,Companies!$B$3:$M$1250,4,FALSE),IF(VLOOKUP(F36,Companies!$B$3:$M$1250,6,FALSE)<>\"\",VLOOKUP(F36,Companies!$B$3:$M$1250,6,FALSE),IF(VLOOKUP(F36,Companies!$B$3:$M$1250,8,FALSE)<>\"\",VLOOKUP(F36,Companies!$B$3:$M$1250,8,FALSE),IF(VLOOKUP(F36,Companies!$B$3:$M$1250,10,FALSE)<>\"\",VLOOKUP(F36,Companies!$B$3:$M$1250,10,FALSE),\"\")))))","v":""},{"$f":"IF(VLOOKUP(F36,Companies!$B$3:$M$1250,3,FALSE)<>\"\",VLOOKUP(F36,Companies!$B$3:$M$1250,3,FALSE),IF(VLOOKUP(F36,Companies!$B$3:$M$1250,5,FALSE)<>\"\",VLOOKUP(F36,Companies!$B$3:$M$1250,5,FALSE),IF(VLOOKUP(F36,Companies!$B$3:$M$1250,7,FALSE)<>\"\",VLOOKUP(F36,Companies!$B$3:$M$1250,7,FALSE),IF(VLOOKUP(F36,Companies!$B$3:$M$1250,9,FALSE)<>\"\",VLOOKUP(F36,Companies!$B$3:$M$1250,9,FALSE),IF(VLOOKUP(F36,Companies!$B$3:$M$1250,11,FALSE)<>\"\",VLOOKUP(F36,Companies!$B$3:$M$1250,11,FALSE),\"\")))))","v":""},{"$f":"IF(VLOOKUP(F36,Companies!$B$3:$M$1250,12,FALSE)<>\"\",VLOOKUP(F36,Companies!$B$3:$M$1250,12,FALSE),\"\")","v":""}]
[{"$nulls":3},"VSFR","411CARROZCOSARL","CARROZ.CO SARL","2018-04-30","2018-05-30","Invoice","18.04.0041",{"v":300,"d":"300.00 €"},{"$f":"IF(VLOOKUP(F37,Companies!$B$3:$M$1250,2,FALSE)<>\"\",VLOOKUP(F37,Companies!$B$3:$M$1250,2,FALSE),IF(VLOOKUP(F37,Companies!$B$3:$M$1250,4,FALSE)<>\"\",VLOOKUP(F37,Companies!$B$3:$M$1250,4,FALSE),IF(VLOOKUP(F37,Companies!$B$3:$M$1250,6,FALSE)<>\"\",VLOOKUP(F37,Companies!$B$3:$M$1250,6,FALSE),IF(VLOOKUP(F37,Companies!$B$3:$M$1250,8,FALSE)<>\"\",VLOOKUP(F37,Companies!$B$3:$M$1250,8,FALSE),IF(VLOOKUP(F37,Companies!$B$3:$M$1250,10,FALSE)<>\"\",VLOOKUP(F37,Companies!$B$3:$M$1250,10,FALSE),\"\")))))","v":""},{"$f":"IF(VLOOKUP(F37,Companies!$B$3:$M$1250,3,FALSE)<>\"\",VLOOKUP(F37,Companies!$B$3:$M$1250,3,FALSE),IF(VLOOKUP(F37,Companies!$B$3:$M$1250,5,FALSE)<>\"\",VLOOKUP(F37,Companies!$B$3:$M$1250,5,FALSE),IF(VLOOKUP(F37,Companies!$B$3:$M$1250,7,FALSE)<>\"\",VLOOKUP(F37,Companies!$B$3:$M$1250,7,FALSE),IF(VLOOKUP(F37,Companies!$B$3:$M$1250,9,FALSE)<>\"\",VLOOKUP(F37,Companies!$B$3:$M$1250,9,FALSE),IF(VLOOKUP(F37,Companies!$B$3:$M$1250,11,FALSE)<>\"\",VLOOKUP(F37,Companies!$B$3:$M$1250,11,FALSE),\"\")))))","v":""},{"$f":"IF(VLOOKUP(F37,Companies!$B$3:$M$1250,12,FALSE)<>\"\",VLOOKUP(F37,Companies!$B$3:$M$1250,12,FALSE),\"\")","v":""}]
[{"$nulls":3},"VSFR","411CARROZCOSARL","CARROZ.CO SARL","2018-05-31","2018-06-30","Invoice","18.05.0074",{"v":410,"d":"410.00 €"},{"$f":"IF(VLOOKUP(F38,Companies!$B$3:$M$1250,2,FALSE)<>\"\",VLOOKUP(F38,Companies!$B$3:$M$1250,2,FALSE),IF(VLOOKUP(F38,Companies!$B$3:$M$1250,4,FALSE)<>\"\",VLOOKUP(F38,Companies!$B$3:$M$1250,4,FALSE),IF(VLOOKUP(F38,Companies!$B$3:$M$1250,6,FALSE)<>\"\",VLOOKUP(F38,Companies!$B$3:$M$1250,6,FALSE),IF(VLOOKUP(F38,Companies!$B$3:$M$1250,8,FALSE)<>\"\",VLOOKUP(F38,Companies!$B$3:$M$1250,8,FALSE),IF(VLOOKUP(F38,Companies!$B$3:$M$1250,10,FALSE)<>\"\",VLOOKUP(F38,Companies!$B$3:$M$1250,10,FALSE),\"\")))))","v":""},{"$f":"IF(VLOOKUP(F38,Companies!$B$3:$M$1250,3,FALSE)<>\"\",VLOOKUP(F38,Companies!$B$3:$M$1250,3,FALSE),IF(VLOOKUP(F38,Companies!$B$3:$M$1250,5,FALSE)<>\"\",VLOOKUP(F38,Companies!$B$3:$M$1250,5,FALSE),IF(VLOOKUP(F38,Companies!$B$3:$M$1250,7,FALSE)<>\"\",VLOOKUP(F38,Companies!$B$3:$M$1250,7,FALSE),IF(VLOOKUP(F38,Companies!$B$3:$M$1250,9,FALSE)<>\"\",VLOOKUP(F38,Companies!$B$3:$M$1250,9,FALSE),IF(VLOOKUP(F38,Companies!$B$3:$M$1250,11,FALSE)<>\"\",VLOOKUP(F38,Companies!$B$3:$M$1250,11,FALSE),\"\")))))","v":""},{"$f":"IF(VLOOKUP(F38,Companies!$B$3:$M$1250,12,FALSE)<>\"\",VLOOKUP(F38,Companies!$B$3:$M$1250,12,FALSE),\"\")","v":""}]
[{"$nulls":3},"VSFR","411CARROZCOSARL","CARROZ.CO SARL","2018-06-30","2018-07-30","Invoice","18.06.0148",{"v":938,"d":"938.00 €"},{"$f":"IF(VLOOKUP(F39,Companies!$B$3:$M$1250,2,FALSE)<>\"\",VLOOKUP(F39,Companies!$B$3:$M$1250,2,FALSE),IF(VLOOKUP(F39,Companies!$B$3:$M$1250,4,FALSE)<>\"\",VLOOKUP(F39,Companies!$B$3:$M$1250,4,FALSE),IF(VLOOKUP(F39,Companies!$B$3:$M$1250,6,FALSE)<>\"\",VLOOKUP(F39,Companies!$B$3:$M$1250,6,FALSE),IF(VLOOKUP(F39,Companies!$B$3:$M$1250,8,FALSE)<>\"\",VLOOKUP(F39,Companies!$B$3:$M$1250,8,FALSE),IF(VLOOKUP(F39,Companies!$B$3:$M$1250,10,FALSE)<>\"\",VLOOKUP(F39,Companies!$B$3:$M$1250,10,FALSE),\"\")))))","v":""},{"$f":"IF(VLOOKUP(F39,Companies!$B$3:$M$1250,3,FALSE)<>\"\",VLOOKUP(F39,Companies!$B$3:$M$1250,3,FALSE),IF(VLOOKUP(F39,Companies!$B$3:$M$1250,5,FALSE)<>\"\",VLOOKUP(F39,Companies!$B$3:$M$1250,5,FALSE),IF(VLOOKUP(F39,Companies!$B$3:$M$1250,7,FALSE)<>\"\",VLOOKUP(F39,Companies!$B$3:$M$1250,7,FALSE),IF(VLOOKUP(F39,Companies!$B$3:$M$1250,9,FALSE)<>\"\",VLOOKUP(F39,Companies!$B$3:$M$1250,9,FALSE),IF(VLOOKUP(F39,Companies!$B$3:$M$1250,11,FALSE)<>\"\",VLOOKUP(F39,Companies!$B$3:$M$1250,11,FALSE),\"\")))))","v":""},{"$f":"IF(VLOOKUP(F39,Companies!$B$3:$M$1250,12,FALSE)<>\"\",VLOOKUP(F39,Companies!$B$3:$M$1250,12,FALSE),\"\")","v":""}]
[{"$nulls":3},"VSFR","411CEPSABUSINESSSERV","Cepsa Business Services, S.A.","2019-03-31","2019-05-30","Invoice","19.03.0147",{"v":2884.13,"d":"2,884.13 €"},{"$f":"IF(VLOOKUP(F40,Companies!$B$3:$M$1250,2,FALSE)<>\"\",VLOOKUP(F40,Companies!$B$3:$M$1250,2,FALSE),IF(VLOOKUP(F40,Companies!$B$3:$M$1250,4,FALSE)<>\"\",VLOOKUP(F40,Companies!$B$3:$M$1250,4,FALSE),IF(VLOOKUP(F40,Companies!$B$3:$M$1250,6,FALSE)<>\"\",VLOOKUP(F40,Companies!$B$3:$M$1250,6,FALSE),IF(VLOOKUP(F40,Companies!$B$3:$M$1250,8,FALSE)<>\"\",VLOOKUP(F40,Companies!$B$3:$M$1250,8,FALSE),IF(VLOOKUP(F40,Companies!$B$3:$M$1250,10,FALSE)<>\"\",VLOOKUP(F40,Companies!$B$3:$M$1250,10,FALSE),\"\")))))","v":""},{"$f":"IF(VLOOKUP(F40,Companies!$B$3:$M$1250,3,FALSE)<>\"\",VLOOKUP(F40,Companies!$B$3:$M$1250,3,FALSE),IF(VLOOKUP(F40,Companies!$B$3:$M$1250,5,FALSE)<>\"\",VLOOKUP(F40,Companies!$B$3:$M$1250,5,FALSE),IF(VLOOKUP(F40,Companies!$B$3:$M$1250,7,FALSE)<>\"\",VLOOKUP(F40,Companies!$B$3:$M$1250,7,FALSE),IF(VLOOKUP(F40,Companies!$B$3:$M$1250,9,FALSE)<>\"\",VLOOKUP(F40,Companies!$B$3:$M$1250,9,FALSE),IF(VLOOKUP(F40,Companies!$B$3:$M$1250,11,FALSE)<>\"\",VLOOKUP(F40,Companies!$B$3:$M$1250,11,FALSE),\"\")))))","v":""},{"$f":"IF(VLOOKUP(F40,Companies!$B$3:$M$1250,12,FALSE)<>\"\",VLOOKUP(F40,Companies!$B$3:$M$1250,12,FALSE),\"\")","v":""}]
[{"$nulls":3},"VSFR","411CEPSABUSINESSSERV","Cepsa Business Services, S.A.","2019-03-31","2019-05-30","Invoice","19.03.0148",{"v":2362.5,"d":"2,362.50 €"},{"$f":"IF(VLOOKUP(F41,Companies!$B$3:$M$1250,2,FALSE)<>\"\",VLOOKUP(F41,Companies!$B$3:$M$1250,2,FALSE),IF(VLOOKUP(F41,Companies!$B$3:$M$1250,4,FALSE)<>\"\",VLOOKUP(F41,Companies!$B$3:$M$1250,4,FALSE),IF(VLOOKUP(F41,Companies!$B$3:$M$1250,6,FALSE)<>\"\",VLOOKUP(F41,Companies!$B$3:$M$1250,6,FALSE),IF(VLOOKUP(F41,Companies!$B$3:$M$1250,8,FALSE)<>\"\",VLOOKUP(F41,Companies!$B$3:$M$1250,8,FALSE),IF(VLOOKUP(F41,Companies!$B$3:$M$1250,10,FALSE)<>\"\",VLOOKUP(F41,Companies!$B$3:$M$1250,10,FALSE),\"\")))))","v":""},{"$f":"IF(VLOOKUP(F41,Companies!$B$3:$M$1250,3,FALSE)<>\"\",VLOOKUP(F41,Companies!$B$3:$M$1250,3,FALSE),IF(VLOOKUP(F41,Companies!$B$3:$M$1250,5,FALSE)<>\"\",VLOOKUP(F41,Companies!$B$3:$M$1250,5,FALSE),IF(VLOOKUP(F41,Companies!$B$3:$M$1250,7,FALSE)<>\"\",VLOOKUP(F41,Companies!$B$3:$M$1250,7,FALSE),IF(VLOOKUP(F41,Companies!$B$3:$M$1250,9,FALSE)<>\"\",VLOOKUP(F41,Companies!$B$3:$M$1250,9,FALSE),IF(VLOOKUP(F41,Companies!$B$3:$M$1250,11,FALSE)<>\"\",VLOOKUP(F41,Companies!$B$3:$M$1250,11,FALSE),\"\")))))","v":""},{"$f":"IF(VLOOKUP(F41,Companies!$B$3:$M$1250,12,FALSE)<>\"\",VLOOKUP(F41,Companies!$B$3:$M$1250,12,FALSE),\"\")","v":""}]
[{"$nulls":3},"VSFR","411CEPSABUSINESSSERV","Cepsa Business Services, S.A.","2019-03-31","2019-05-30","Invoice","19.03.0150",{"v":387.5,"d":"387.50 €"},{"$f":"IF(VLOOKUP(F42,Companies!$B$3:$M$1250,2,FALSE)<>\"\",VLOOKUP(F42,Companies!$B$3:$M$1250,2,FALSE),IF(VLOOKUP(F42,Companies!$B$3:$M$1250,4,FALSE)<>\"\",VLOOKUP(F42,Companies!$B$3:$M$1250,4,FALSE),IF(VLOOKUP(F42,Companies!$B$3:$M$1250,6,FALSE)<>\"\",VLOOKUP(F42,Companies!$B$3:$M$1250,6,FALSE),IF(VLOOKUP(F42,Companies!$B$3:$M$1250,8,FALSE)<>\"\",VLOOKUP(F42,Companies!$B$3:$M$1250,8,FALSE),IF(VLOOKUP(F42,Companies!$B$3:$M$1250,10,FALSE)<>\"\",VLOOKUP(F42,Companies!$B$3:$M$1250,10,FALSE),\"\")))))","v":""},{"$f":"IF(VLOOKUP(F42,Companies!$B$3:$M$1250,3,FALSE)<>\"\",VLOOKUP(F42,Companies!$B$3:$M$1250,3,FALSE),IF(VLOOKUP(F42,Companies!$B$3:$M$1250,5,FALSE)<>\"\",VLOOKUP(F42,Companies!$B$3:$M$1250,5,FALSE),IF(VLOOKUP(F42,Companies!$B$3:$M$1250,7,FALSE)<>\"\",VLOOKUP(F42,Companies!$B$3:$M$1250,7,FALSE),IF(VLOOKUP(F42,Companies!$B$3:$M$1250,9,FALSE)<>\"\",VLOOKUP(F42,Companies!$B$3:$M$1250,9,FALSE),IF(VLOOKUP(F42,Companies!$B$3:$M$1250,11,FALSE)<>\"\",VLOOKUP(F42,Companies!$B$3:$M$1250,11,FALSE),\"\")))))","v":""},{"$f":"IF(VLOOKUP(F42,Companies!$B$3:$M$1250,12,FALSE)<>\"\",VLOOKUP(F42,Companies!$B$3:$M$1250,12,FALSE),\"\")","v":""}]
[{"$nulls":3},"VSFR","411CEPSABUSINESSSERV","Cepsa Business Services, S.A.","2019-04-30","2019-06-29","Invoice","19.04.0231",{"v":3589.13,"d":"3,589.13 €"},{"$f":"IF(VLOOKUP(F43,Companies!$B$3:$M$1250,2,FALSE)<>\"\",VLOOKUP(F43,Companies!$B$3:$M$1250,2,FALSE),IF(VLOOKUP(F43,Companies!$B$3:$M$1250,4,FALSE)<>\"\",VLOOKUP(F43,Companies!$B$3:$M$1250,4,FALSE),IF(VLOOKUP(F43,Companies!$B$3:$M$1250,6,FALSE)<>\"\",VLOOKUP(F43,Companies!$B$3:$M$1250,6,FALSE),IF(VLOOKUP(F43,Companies!$B$3:$M$1250,8,FALSE)<>\"\",VLOOKUP(F43,Companies!$B$3:$M$1250,8,FALSE),IF(VLOOKUP(F43,Companies!$B$3:$M$1250,10,FALSE)<>\"\",VLOOKUP(F43,Companies!$B$3:$M$1250,10,FALSE),\"\")))))","v":""},{"$f":"IF(VLOOKUP(F43,Companies!$B$3:$M$1250,3,FALSE)<>\"\",VLOOKUP(F43,Companies!$B$3:$M$1250,3,FALSE),IF(VLOOKUP(F43,Companies!$B$3:$M$1250,5,FALSE)<>\"\",VLOOKUP(F43,Companies!$B$3:$M$1250,5,FALSE),IF(VLOOKUP(F43,Companies!$B$3:$M$1250,7,FALSE)<>\"\",VLOOKUP(F43,Companies!$B$3:$M$1250,7,FALSE),IF(VLOOKUP(F43,Companies!$B$3:$M$1250,9,FALSE)<>\"\",VLOOKUP(F43,Companies!$B$3:$M$1250,9,FALSE),IF(VLOOKUP(F43,Companies!$B$3:$M$1250,11,FALSE)<>\"\",VLOOKUP(F43,Companies!$B$3:$M$1250,11,FALSE),\"\")))))","v":""},{"$f":"IF(VLOOKUP(F43,Companies!$B$3:$M$1250,12,FALSE)<>\"\",VLOOKUP(F43,Companies!$B$3:$M$1250,12,FALSE),\"\")","v":""}]
[{"$nulls":3},"VSFR","411CHARLESJOURDAN","CHARLES JOURDAN","2018-07-23","2018-08-22","Invoice","18.07.0011",{"v":3942.91,"d":"3,942.91 €"},{"$f":"IF(VLOOKUP(F44,Companies!$B$3:$M$1250,2,FALSE)<>\"\",VLOOKUP(F44,Companies!$B$3:$M$1250,2,FALSE),IF(VLOOKUP(F44,Companies!$B$3:$M$1250,4,FALSE)<>\"\",VLOOKUP(F44,Companies!$B$3:$M$1250,4,FALSE),IF(VLOOKUP(F44,Companies!$B$3:$M$1250,6,FALSE)<>\"\",VLOOKUP(F44,Companies!$B$3:$M$1250,6,FALSE),IF(VLOOKUP(F44,Companies!$B$3:$M$1250,8,FALSE)<>\"\",VLOOKUP(F44,Companies!$B$3:$M$1250,8,FALSE),IF(VLOOKUP(F44,Companies!$B$3:$M$1250,10,FALSE)<>\"\",VLOOKUP(F44,Companies!$B$3:$M$1250,10,FALSE),\"\")))))","v":""},{"$f":"IF(VLOOKUP(F44,Companies!$B$3:$M$1250,3,FALSE)<>\"\",VLOOKUP(F44,Companies!$B$3:$M$1250,3,FALSE),IF(VLOOKUP(F44,Companies!$B$3:$M$1250,5,FALSE)<>\"\",VLOOKUP(F44,Companies!$B$3:$M$1250,5,FALSE),IF(VLOOKUP(F44,Companies!$B$3:$M$1250,7,FALSE)<>\"\",VLOOKUP(F44,Companies!$B$3:$M$1250,7,FALSE),IF(VLOOKUP(F44,Companies!$B$3:$M$1250,9,FALSE)<>\"\",VLOOKUP(F44,Companies!$B$3:$M$1250,9,FALSE),IF(VLOOKUP(F44,Companies!$B$3:$M$1250,11,FALSE)<>\"\",VLOOKUP(F44,Companies!$B$3:$M$1250,11,FALSE),\"\")))))","v":""},{"$f":"IF(VLOOKUP(F44,Companies!$B$3:$M$1250,12,FALSE)<>\"\",VLOOKUP(F44,Companies!$B$3:$M$1250,12,FALSE),\"\")","v":""}]
[{"$nulls":3},"VSFR","411CHRISTIANLOUBOUTI","CHRISTIAN LOUBOUTIN SUISSE SA","2019-04-30","2019-05-30","Invoice","19.04.0098",{"v":9739.41,"d":"9,739.41 €"},{"$f":"IF(VLOOKUP(F45,Companies!$B$3:$M$1250,2,FALSE)<>\"\",VLOOKUP(F45,Companies!$B$3:$M$1250,2,FALSE),IF(VLOOKUP(F45,Companies!$B$3:$M$1250,4,FALSE)<>\"\",VLOOKUP(F45,Companies!$B$3:$M$1250,4,FALSE),IF(VLOOKUP(F45,Companies!$B$3:$M$1250,6,FALSE)<>\"\",VLOOKUP(F45,Companies!$B$3:$M$1250,6,FALSE),IF(VLOOKUP(F45,Companies!$B$3:$M$1250,8,FALSE)<>\"\",VLOOKUP(F45,Companies!$B$3:$M$1250,8,FALSE),IF(VLOOKUP(F45,Companies!$B$3:$M$1250,10,FALSE)<>\"\",VLOOKUP(F45,Companies!$B$3:$M$1250,10,FALSE),\"\")))))","v":""},{"$f":"IF(VLOOKUP(F45,Companies!$B$3:$M$1250,3,FALSE)<>\"\",VLOOKUP(F45,Companies!$B$3:$M$1250,3,FALSE),IF(VLOOKUP(F45,Companies!$B$3:$M$1250,5,FALSE)<>\"\",VLOOKUP(F45,Companies!$B$3:$M$1250,5,FALSE),IF(VLOOKUP(F45,Companies!$B$3:$M$1250,7,FALSE)<>\"\",VLOOKUP(F45,Companies!$B$3:$M$1250,7,FALSE),IF(VLOOKUP(F45,Companies!$B$3:$M$1250,9,FALSE)<>\"\",VLOOKUP(F45,Companies!$B$3:$M$1250,9,FALSE),IF(VLOOKUP(F45,Companies!$B$3:$M$1250,11,FALSE)<>\"\",VLOOKUP(F45,Companies!$B$3:$M$1250,11,FALSE),\"\")))))","v":""},{"$f":"IF(VLOOKUP(F45,Companies!$B$3:$M$1250,12,FALSE)<>\"\",VLOOKUP(F45,Companies!$B$3:$M$1250,12,FALSE),\"\")","v":""}]
[{"$nulls":3},"VSFR","411CLARIONEUROPESAS","CLARION EUROPE SAS","2019-04-30","2019-05-30","Invoice","19.04.0069",{"v":504,"d":"504.00 €"},{"$f":"IF(VLOOKUP(F46,Companies!$B$3:$M$1250,2,FALSE)<>\"\",VLOOKUP(F46,Companies!$B$3:$M$1250,2,FALSE),IF(VLOOKUP(F46,Companies!$B$3:$M$1250,4,FALSE)<>\"\",VLOOKUP(F46,Companies!$B$3:$M$1250,4,FALSE),IF(VLOOKUP(F46,Companies!$B$3:$M$1250,6,FALSE)<>\"\",VLOOKUP(F46,Companies!$B$3:$M$1250,6,FALSE),IF(VLOOKUP(F46,Companies!$B$3:$M$1250,8,FALSE)<>\"\",VLOOKUP(F46,Companies!$B$3:$M$1250,8,FALSE),IF(VLOOKUP(F46,Companies!$B$3:$M$1250,10,FALSE)<>\"\",VLOOKUP(F46,Companies!$B$3:$M$1250,10,FALSE),\"\")))))","v":""},{"$f":"IF(VLOOKUP(F46,Companies!$B$3:$M$1250,3,FALSE)<>\"\",VLOOKUP(F46,Companies!$B$3:$M$1250,3,FALSE),IF(VLOOKUP(F46,Companies!$B$3:$M$1250,5,FALSE)<>\"\",VLOOKUP(F46,Companies!$B$3:$M$1250,5,FALSE),IF(VLOOKUP(F46,Companies!$B$3:$M$1250,7,FALSE)<>\"\",VLOOKUP(F46,Companies!$B$3:$M$1250,7,FALSE),IF(VLOOKUP(F46,Companies!$B$3:$M$1250,9,FALSE)<>\"\",VLOOKUP(F46,Companies!$B$3:$M$1250,9,FALSE),IF(VLOOKUP(F46,Companies!$B$3:$M$1250,11,FALSE)<>\"\",VLOOKUP(F46,Companies!$B$3:$M$1250,11,FALSE),\"\")))))","v":""},{"$f":"IF(VLOOKUP(F46,Companies!$B$3:$M$1250,12,FALSE)<>\"\",VLOOKUP(F46,Companies!$B$3:$M$1250,12,FALSE),\"\")","v":""}]
[{"$nulls":3},"VSFR","411CONDORFLUGDIENSTG","CONDOR FLUGDIENST GMBH","2019-04-30","2019-05-30","Invoice","19.04.0127",{"v":541.67,"d":"541.67 €"},{"$f":"IF(VLOOKUP(F47,Companies!$B$3:$M$1250,2,FALSE)<>\"\",VLOOKUP(F47,Companies!$B$3:$M$1250,2,FALSE),IF(VLOOKUP(F47,Companies!$B$3:$M$1250,4,FALSE)<>\"\",VLOOKUP(F47,Companies!$B$3:$M$1250,4,FALSE),IF(VLOOKUP(F47,Companies!$B$3:$M$1250,6,FALSE)<>\"\",VLOOKUP(F47,Companies!$B$3:$M$1250,6,FALSE),IF(VLOOKUP(F47,Companies!$B$3:$M$1250,8,FALSE)<>\"\",VLOOKUP(F47,Companies!$B$3:$M$1250,8,FALSE),IF(VLOOKUP(F47,Companies!$B$3:$M$1250,10,FALSE)<>\"\",VLOOKUP(F47,Companies!$B$3:$M$1250,10,FALSE),\"\")))))","v":""},{"$f":"IF(VLOOKUP(F47,Companies!$B$3:$M$1250,3,FALSE)<>\"\",VLOOKUP(F47,Companies!$B$3:$M$1250,3,FALSE),IF(VLOOKUP(F47,Companies!$B$3:$M$1250,5,FALSE)<>\"\",VLOOKUP(F47,Companies!$B$3:$M$1250,5,FALSE),IF(VLOOKUP(F47,Companies!$B$3:$M$1250,7,FALSE)<>\"\",VLOOKUP(F47,Companies!$B$3:$M$1250,7,FALSE),IF(VLOOKUP(F47,Companies!$B$3:$M$1250,9,FALSE)<>\"\",VLOOKUP(F47,Companies!$B$3:$M$1250,9,FALSE),IF(VLOOKUP(F47,Companies!$B$3:$M$1250,11,FALSE)<>\"\",VLOOKUP(F47,Companies!$B$3:$M$1250,11,FALSE),\"\")))))","v":""},{"$f":"IF(VLOOKUP(F47,Companies!$B$3:$M$1250,12,FALSE)<>\"\",VLOOKUP(F47,Companies!$B$3:$M$1250,12,FALSE),\"\")","v":""}]
[{"$nulls":3},"VSFR","411COOPERSTANDARDAUT","Cooper Standard Automotive España","2019-05-31","2019-06-30","Invoice","FA19050134",{"v":145.83,"d":"145.83 €"},{"$f":"IF(VLOOKUP(F48,Companies!$B$3:$M$1250,2,FALSE)<>\"\",VLOOKUP(F48,Companies!$B$3:$M$1250,2,FALSE),IF(VLOOKUP(F48,Companies!$B$3:$M$1250,4,FALSE)<>\"\",VLOOKUP(F48,Companies!$B$3:$M$1250,4,FALSE),IF(VLOOKUP(F48,Companies!$B$3:$M$1250,6,FALSE)<>\"\",VLOOKUP(F48,Companies!$B$3:$M$1250,6,FALSE),IF(VLOOKUP(F48,Companies!$B$3:$M$1250,8,FALSE)<>\"\",VLOOKUP(F48,Companies!$B$3:$M$1250,8,FALSE),IF(VLOOKUP(F48,Companies!$B$3:$M$1250,10,FALSE)<>\"\",VLOOKUP(F48,Companies!$B$3:$M$1250,10,FALSE),\"\")))))","v":""},{"$f":"IF(VLOOKUP(F48,Companies!$B$3:$M$1250,3,FALSE)<>\"\",VLOOKUP(F48,Companies!$B$3:$M$1250,3,FALSE),IF(VLOOKUP(F48,Companies!$B$3:$M$1250,5,FALSE)<>\"\",VLOOKUP(F48,Companies!$B$3:$M$1250,5,FALSE),IF(VLOOKUP(F48,Companies!$B$3:$M$1250,7,FALSE)<>\"\",VLOOKUP(F48,Companies!$B$3:$M$1250,7,FALSE),IF(VLOOKUP(F48,Companies!$B$3:$M$1250,9,FALSE)<>\"\",VLOOKUP(F48,Companies!$B$3:$M$1250,9,FALSE),IF(VLOOKUP(F48,Companies!$B$3:$M$1250,11,FALSE)<>\"\",VLOOKUP(F48,Companies!$B$3:$M$1250,11,FALSE),\"\")))))","v":""},{"$f":"IF(VLOOKUP(F48,Companies!$B$3:$M$1250,12,FALSE)<>\"\",VLOOKUP(F48,Companies!$B$3:$M$1250,12,FALSE),\"\")","v":""}]
[{"$nulls":3},"VSFR","411COOPERSTANDARDFR","COOPER STANDARD FRANCE SAS","2019-04-18","2019-05-18","Invoice","19.04.0009",{"v":33.24,"d":"33.24 €"},{"$f":"IF(VLOOKUP(F49,Companies!$B$3:$M$1250,2,FALSE)<>\"\",VLOOKUP(F49,Companies!$B$3:$M$1250,2,FALSE),IF(VLOOKUP(F49,Companies!$B$3:$M$1250,4,FALSE)<>\"\",VLOOKUP(F49,Companies!$B$3:$M$1250,4,FALSE),IF(VLOOKUP(F49,Companies!$B$3:$M$1250,6,FALSE)<>\"\",VLOOKUP(F49,Companies!$B$3:$M$1250,6,FALSE),IF(VLOOKUP(F49,Companies!$B$3:$M$1250,8,FALSE)<>\"\",VLOOKUP(F49,Companies!$B$3:$M$1250,8,FALSE),IF(VLOOKUP(F49,Companies!$B$3:$M$1250,10,FALSE)<>\"\",VLOOKUP(F49,Companies!$B$3:$M$1250,10,FALSE),\"\")))))","v":""},{"$f":"IF(VLOOKUP(F49,Companies!$B$3:$M$1250,3,FALSE)<>\"\",VLOOKUP(F49,Companies!$B$3:$M$1250,3,FALSE),IF(VLOOKUP(F49,Companies!$B$3:$M$1250,5,FALSE)<>\"\",VLOOKUP(F49,Companies!$B$3:$M$1250,5,FALSE),IF(VLOOKUP(F49,Companies!$B$3:$M$1250,7,FALSE)<>\"\",VLOOKUP(F49,Companies!$B$3:$M$1250,7,FALSE),IF(VLOOKUP(F49,Companies!$B$3:$M$1250,9,FALSE)<>\"\",VLOOKUP(F49,Companies!$B$3:$M$1250,9,FALSE),IF(VLOOKUP(F49,Companies!$B$3:$M$1250,11,FALSE)<>\"\",VLOOKUP(F49,Companies!$B$3:$M$1250,11,FALSE),\"\")))))","v":""},{"$f":"IF(VLOOKUP(F49,Companies!$B$3:$M$1250,12,FALSE)<>\"\",VLOOKUP(F49,Companies!$B$3:$M$1250,12,FALSE),\"\")","v":""}]
[{"$nulls":3},"VSFR","411DAV","DAV SAS","2019-05-31","2019-06-30","Invoice","FA19050071",{"v":1702,"d":"1,702.00 €"},{"$f":"IF(VLOOKUP(F50,Companies!$B$3:$M$1250,2,FALSE)<>\"\",VLOOKUP(F50,Companies!$B$3:$M$1250,2,FALSE),IF(VLOOKUP(F50,Companies!$B$3:$M$1250,4,FALSE)<>\"\",VLOOKUP(F50,Companies!$B$3:$M$1250,4,FALSE),IF(VLOOKUP(F50,Companies!$B$3:$M$1250,6,FALSE)<>\"\",VLOOKUP(F50,Companies!$B$3:$M$1250,6,FALSE),IF(VLOOKUP(F50,Companies!$B$3:$M$1250,8,FALSE)<>\"\",VLOOKUP(F50,Companies!$B$3:$M$1250,8,FALSE),IF(VLOOKUP(F50,Companies!$B$3:$M$1250,10,FALSE)<>\"\",VLOOKUP(F50,Companies!$B$3:$M$1250,10,FALSE),\"\")))))","v":""},{"$f":"IF(VLOOKUP(F50,Companies!$B$3:$M$1250,3,FALSE)<>\"\",VLOOKUP(F50,Companies!$B$3:$M$1250,3,FALSE),IF(VLOOKUP(F50,Companies!$B$3:$M$1250,5,FALSE)<>\"\",VLOOKUP(F50,Companies!$B$3:$M$1250,5,FALSE),IF(VLOOKUP(F50,Companies!$B$3:$M$1250,7,FALSE)<>\"\",VLOOKUP(F50,Companies!$B$3:$M$1250,7,FALSE),IF(VLOOKUP(F50,Companies!$B$3:$M$1250,9,FALSE)<>\"\",VLOOKUP(F50,Companies!$B$3:$M$1250,9,FALSE),IF(VLOOKUP(F50,Companies!$B$3:$M$1250,11,FALSE)<>\"\",VLOOKUP(F50,Companies!$B$3:$M$1250,11,FALSE),\"\")))))","v":""},{"$f":"IF(VLOOKUP(F50,Companies!$B$3:$M$1250,12,FALSE)<>\"\",VLOOKUP(F50,Companies!$B$3:$M$1250,12,FALSE),\"\")","v":""}]
[{"$nulls":3},"VSFR","411DECANTALOVINOSSL","DECANTALO VINOS S.L.","2019-05-31","2019-06-30","Invoice","FA19050101",{"v":1560.33,"d":"1,560.33 €"},{"$f":"IF(VLOOKUP(F51,Companies!$B$3:$M$1250,2,FALSE)<>\"\",VLOOKUP(F51,Companies!$B$3:$M$1250,2,FALSE),IF(VLOOKUP(F51,Companies!$B$3:$M$1250,4,FALSE)<>\"\",VLOOKUP(F51,Companies!$B$3:$M$1250,4,FALSE),IF(VLOOKUP(F51,Companies!$B$3:$M$1250,6,FALSE)<>\"\",VLOOKUP(F51,Companies!$B$3:$M$1250,6,FALSE),IF(VLOOKUP(F51,Companies!$B$3:$M$1250,8,FALSE)<>\"\",VLOOKUP(F51,Companies!$B$3:$M$1250,8,FALSE),IF(VLOOKUP(F51,Companies!$B$3:$M$1250,10,FALSE)<>\"\",VLOOKUP(F51,Companies!$B$3:$M$1250,10,FALSE),\"\")))))","v":""},{"$f":"IF(VLOOKUP(F51,Companies!$B$3:$M$1250,3,FALSE)<>\"\",VLOOKUP(F51,Companies!$B$3:$M$1250,3,FALSE),IF(VLOOKUP(F51,Companies!$B$3:$M$1250,5,FALSE)<>\"\",VLOOKUP(F51,Companies!$B$3:$M$1250,5,FALSE),IF(VLOOKUP(F51,Companies!$B$3:$M$1250,7,FALSE)<>\"\",VLOOKUP(F51,Companies!$B$3:$M$1250,7,FALSE),IF(VLOOKUP(F51,Companies!$B$3:$M$1250,9,FALSE)<>\"\",VLOOKUP(F51,Companies!$B$3:$M$1250,9,FALSE),IF(VLOOKUP(F51,Companies!$B$3:$M$1250,11,FALSE)<>\"\",VLOOKUP(F51,Companies!$B$3:$M$1250,11,FALSE),\"\")))))","v":""},{"$f":"IF(VLOOKUP(F51,Companies!$B$3:$M$1250,12,FALSE)<>\"\",VLOOKUP(F51,Companies!$B$3:$M$1250,12,FALSE),\"\")","v":""}]
[{"$nulls":3},"VSFR","411DEEZER","DEEZER","2018-12-20","2019-01-19","Invoice","18.12.0036",{"v":173.05,"d":"173.05 €"},{"$f":"IF(VLOOKUP(F52,Companies!$B$3:$M$1250,2,FALSE)<>\"\",VLOOKUP(F52,Companies!$B$3:$M$1250,2,FALSE),IF(VLOOKUP(F52,Companies!$B$3:$M$1250,4,FALSE)<>\"\",VLOOKUP(F52,Companies!$B$3:$M$1250,4,FALSE),IF(VLOOKUP(F52,Companies!$B$3:$M$1250,6,FALSE)<>\"\",VLOOKUP(F52,Companies!$B$3:$M$1250,6,FALSE),IF(VLOOKUP(F52,Companies!$B$3:$M$1250,8,FALSE)<>\"\",VLOOKUP(F52,Companies!$B$3:$M$1250,8,FALSE),IF(VLOOKUP(F52,Companies!$B$3:$M$1250,10,FALSE)<>\"\",VLOOKUP(F52,Companies!$B$3:$M$1250,10,FALSE),\"\")))))","v":""},{"$f":"IF(VLOOKUP(F52,Companies!$B$3:$M$1250,3,FALSE)<>\"\",VLOOKUP(F52,Companies!$B$3:$M$1250,3,FALSE),IF(VLOOKUP(F52,Companies!$B$3:$M$1250,5,FALSE)<>\"\",VLOOKUP(F52,Companies!$B$3:$M$1250,5,FALSE),IF(VLOOKUP(F52,Companies!$B$3:$M$1250,7,FALSE)<>\"\",VLOOKUP(F52,Companies!$B$3:$M$1250,7,FALSE),IF(VLOOKUP(F52,Companies!$B$3:$M$1250,9,FALSE)<>\"\",VLOOKUP(F52,Companies!$B$3:$M$1250,9,FALSE),IF(VLOOKUP(F52,Companies!$B$3:$M$1250,11,FALSE)<>\"\",VLOOKUP(F52,Companies!$B$3:$M$1250,11,FALSE),\"\")))))","v":""},{"$f":"IF(VLOOKUP(F52,Companies!$B$3:$M$1250,12,FALSE)<>\"\",VLOOKUP(F52,Companies!$B$3:$M$1250,12,FALSE),\"\")","v":""}]
[{"$nulls":3},"VSFR","411DEEZER","DEEZER","2018-12-26","2019-01-25","Invoice","18.12.0058",{"v":275.83,"d":"275.83 €"},{"$f":"IF(VLOOKUP(F53,Companies!$B$3:$M$1250,2,FALSE)<>\"\",VLOOKUP(F53,Companies!$B$3:$M$1250,2,FALSE),IF(VLOOKUP(F53,Companies!$B$3:$M$1250,4,FALSE)<>\"\",VLOOKUP(F53,Companies!$B$3:$M$1250,4,FALSE),IF(VLOOKUP(F53,Companies!$B$3:$M$1250,6,FALSE)<>\"\",VLOOKUP(F53,Companies!$B$3:$M$1250,6,FALSE),IF(VLOOKUP(F53,Companies!$B$3:$M$1250,8,FALSE)<>\"\",VLOOKUP(F53,Companies!$B$3:$M$1250,8,FALSE),IF(VLOOKUP(F53,Companies!$B$3:$M$1250,10,FALSE)<>\"\",VLOOKUP(F53,Companies!$B$3:$M$1250,10,FALSE),\"\")))))","v":""},{"$f":"IF(VLOOKUP(F53,Companies!$B$3:$M$1250,3,FALSE)<>\"\",VLOOKUP(F53,Companies!$B$3:$M$1250,3,FALSE),IF(VLOOKUP(F53,Companies!$B$3:$M$1250,5,FALSE)<>\"\",VLOOKUP(F53,Companies!$B$3:$M$1250,5,FALSE),IF(VLOOKUP(F53,Companies!$B$3:$M$1250,7,FALSE)<>\"\",VLOOKUP(F53,Companies!$B$3:$M$1250,7,FALSE),IF(VLOOKUP(F53,Companies!$B$3:$M$1250,9,FALSE)<>\"\",VLOOKUP(F53,Companies!$B$3:$M$1250,9,FALSE),IF(VLOOKUP(F53,Companies!$B$3:$M$1250,11,FALSE)<>\"\",VLOOKUP(F53,Companies!$B$3:$M$1250,11,FALSE),\"\")))))","v":""},{"$f":"IF(VLOOKUP(F53,Companies!$B$3:$M$1250,12,FALSE)<>\"\",VLOOKUP(F53,Companies!$B$3:$M$1250,12,FALSE),\"\")","v":""}]
[{"$nulls":3},"VSFR","411DEEZER","DEEZER","2018-12-31","2019-01-30","Invoice","18.12.0123",{"v":84,"d":"84.00 €"},{"$f":"IF(VLOOKUP(F54,Companies!$B$3:$M$1250,2,FALSE)<>\"\",VLOOKUP(F54,Companies!$B$3:$M$1250,2,FALSE),IF(VLOOKUP(F54,Companies!$B$3:$M$1250,4,FALSE)<>\"\",VLOOKUP(F54,Companies!$B$3:$M$1250,4,FALSE),IF(VLOOKUP(F54,Companies!$B$3:$M$1250,6,FALSE)<>\"\",VLOOKUP(F54,Companies!$B$3:$M$1250,6,FALSE),IF(VLOOKUP(F54,Companies!$B$3:$M$1250,8,FALSE)<>\"\",VLOOKUP(F54,Companies!$B$3:$M$1250,8,FALSE),IF(VLOOKUP(F54,Companies!$B$3:$M$1250,10,FALSE)<>\"\",VLOOKUP(F54,Companies!$B$3:$M$1250,10,FALSE),\"\")))))","v":""},{"$f":"IF(VLOOKUP(F54,Companies!$B$3:$M$1250,3,FALSE)<>\"\",VLOOKUP(F54,Companies!$B$3:$M$1250,3,FALSE),IF(VLOOKUP(F54,Companies!$B$3:$M$1250,5,FALSE)<>\"\",VLOOKUP(F54,Companies!$B$3:$M$1250,5,FALSE),IF(VLOOKUP(F54,Companies!$B$3:$M$1250,7,FALSE)<>\"\",VLOOKUP(F54,Companies!$B$3:$M$1250,7,FALSE),IF(VLOOKUP(F54,Companies!$B$3:$M$1250,9,FALSE)<>\"\",VLOOKUP(F54,Companies!$B$3:$M$1250,9,FALSE),IF(VLOOKUP(F54,Companies!$B$3:$M$1250,11,FALSE)<>\"\",VLOOKUP(F54,Companies!$B$3:$M$1250,11,FALSE),\"\")))))","v":""},{"$f":"IF(VLOOKUP(F54,Companies!$B$3:$M$1250,12,FALSE)<>\"\",VLOOKUP(F54,Companies!$B$3:$M$1250,12,FALSE),\"\")","v":""}]
[{"$nulls":3},"VSFR","411DEEZER","DEEZER","2019-01-15","2019-02-14","Invoice","19.01.0017",{"v":193.15,"d":"193.15 €"},{"$f":"IF(VLOOKUP(F55,Companies!$B$3:$M$1250,2,FALSE)<>\"\",VLOOKUP(F55,Companies!$B$3:$M$1250,2,FALSE),IF(VLOOKUP(F55,Companies!$B$3:$M$1250,4,FALSE)<>\"\",VLOOKUP(F55,Companies!$B$3:$M$1250,4,FALSE),IF(VLOOKUP(F55,Companies!$B$3:$M$1250,6,FALSE)<>\"\",VLOOKUP(F55,Companies!$B$3:$M$1250,6,FALSE),IF(VLOOKUP(F55,Companies!$B$3:$M$1250,8,FALSE)<>\"\",VLOOKUP(F55,Companies!$B$3:$M$1250,8,FALSE),IF(VLOOKUP(F55,Companies!$B$3:$M$1250,10,FALSE)<>\"\",VLOOKUP(F55,Companies!$B$3:$M$1250,10,FALSE),\"\")))))","v":""},{"$f":"IF(VLOOKUP(F55,Companies!$B$3:$M$1250,3,FALSE)<>\"\",VLOOKUP(F55,Companies!$B$3:$M$1250,3,FALSE),IF(VLOOKUP(F55,Companies!$B$3:$M$1250,5,FALSE)<>\"\",VLOOKUP(F55,Companies!$B$3:$M$1250,5,FALSE),IF(VLOOKUP(F55,Companies!$B$3:$M$1250,7,FALSE)<>\"\",VLOOKUP(F55,Companies!$B$3:$M$1250,7,FALSE),IF(VLOOKUP(F55,Companies!$B$3:$M$1250,9,FALSE)<>\"\",VLOOKUP(F55,Companies!$B$3:$M$1250,9,FALSE),IF(VLOOKUP(F55,Companies!$B$3:$M$1250,11,FALSE)<>\"\",VLOOKUP(F55,Companies!$B$3:$M$1250,11,FALSE),\"\")))))","v":""},{"$f":"IF(VLOOKUP(F55,Companies!$B$3:$M$1250,12,FALSE)<>\"\",VLOOKUP(F55,Companies!$B$3:$M$1250,12,FALSE),\"\")","v":""}]
[{"$nulls":3},"VSFR","411DEEZER","DEEZER","2019-03-19","2019-04-18","Invoice","19.03.0018",{"v":2854.64,"d":"2,854.64 €"},{"$f":"IF(VLOOKUP(F56,Companies!$B$3:$M$1250,2,FALSE)<>\"\",VLOOKUP(F56,Companies!$B$3:$M$1250,2,FALSE),IF(VLOOKUP(F56,Companies!$B$3:$M$1250,4,FALSE)<>\"\",VLOOKUP(F56,Companies!$B$3:$M$1250,4,FALSE),IF(VLOOKUP(F56,Companies!$B$3:$M$1250,6,FALSE)<>\"\",VLOOKUP(F56,Companies!$B$3:$M$1250,6,FALSE),IF(VLOOKUP(F56,Companies!$B$3:$M$1250,8,FALSE)<>\"\",VLOOKUP(F56,Companies!$B$3:$M$1250,8,FALSE),IF(VLOOKUP(F56,Companies!$B$3:$M$1250,10,FALSE)<>\"\",VLOOKUP(F56,Companies!$B$3:$M$1250,10,FALSE),\"\")))))","v":""},{"$f":"IF(VLOOKUP(F56,Companies!$B$3:$M$1250,3,FALSE)<>\"\",VLOOKUP(F56,Companies!$B$3:$M$1250,3,FALSE),IF(VLOOKUP(F56,Companies!$B$3:$M$1250,5,FALSE)<>\"\",VLOOKUP(F56,Companies!$B$3:$M$1250,5,FALSE),IF(VLOOKUP(F56,Companies!$B$3:$M$1250,7,FALSE)<>\"\",VLOOKUP(F56,Companies!$B$3:$M$1250,7,FALSE),IF(VLOOKUP(F56,Companies!$B$3:$M$1250,9,FALSE)<>\"\",VLOOKUP(F56,Companies!$B$3:$M$1250,9,FALSE),IF(VLOOKUP(F56,Companies!$B$3:$M$1250,11,FALSE)<>\"\",VLOOKUP(F56,Companies!$B$3:$M$1250,11,FALSE),\"\")))))","v":""},{"$f":"IF(VLOOKUP(F56,Companies!$B$3:$M$1250,12,FALSE)<>\"\",VLOOKUP(F56,Companies!$B$3:$M$1250,12,FALSE),\"\")","v":""}]
[{"$nulls":3},"VSFR","411DEEZER","DEEZER","2019-03-31","2019-04-30","Invoice","19.03.0068",{"v":360,"d":"360.00 €"},{"$f":"IF(VLOOKUP(F57,Companies!$B$3:$M$1250,2,FALSE)<>\"\",VLOOKUP(F57,Companies!$B$3:$M$1250,2,FALSE),IF(VLOOKUP(F57,Companies!$B$3:$M$1250,4,FALSE)<>\"\",VLOOKUP(F57,Companies!$B$3:$M$1250,4,FALSE),IF(VLOOKUP(F57,Companies!$B$3:$M$1250,6,FALSE)<>\"\",VLOOKUP(F57,Companies!$B$3:$M$1250,6,FALSE),IF(VLOOKUP(F57,Companies!$B$3:$M$1250,8,FALSE)<>\"\",VLOOKUP(F57,Companies!$B$3:$M$1250,8,FALSE),IF(VLOOKUP(F57,Companies!$B$3:$M$1250,10,FALSE)<>\"\",VLOOKUP(F57,Companies!$B$3:$M$1250,10,FALSE),\"\")))))","v":""},{"$f":"IF(VLOOKUP(F57,Companies!$B$3:$M$1250,3,FALSE)<>\"\",VLOOKUP(F57,Companies!$B$3:$M$1250,3,FALSE),IF(VLOOKUP(F57,Companies!$B$3:$M$1250,5,FALSE)<>\"\",VLOOKUP(F57,Companies!$B$3:$M$1250,5,FALSE),IF(VLOOKUP(F57,Companies!$B$3:$M$1250,7,FALSE)<>\"\",VLOOKUP(F57,Companies!$B$3:$M$1250,7,FALSE),IF(VLOOKUP(F57,Companies!$B$3:$M$1250,9,FALSE)<>\"\",VLOOKUP(F57,Companies!$B$3:$M$1250,9,FALSE),IF(VLOOKUP(F57,Companies!$B$3:$M$1250,11,FALSE)<>\"\",VLOOKUP(F57,Companies!$B$3:$M$1250,11,FALSE),\"\")))))","v":""},{"$f":"IF(VLOOKUP(F57,Companies!$B$3:$M$1250,12,FALSE)<>\"\",VLOOKUP(F57,Companies!$B$3:$M$1250,12,FALSE),\"\")","v":""}]
[{"$nulls":3},"VSFR","411DEEZER","DEEZER","2019-04-23","2019-05-23","Invoice","19.04.0015",{"v":84,"d":"84.00 €"},{"$f":"IF(VLOOKUP(F58,Companies!$B$3:$M$1250,2,FALSE)<>\"\",VLOOKUP(F58,Companies!$B$3:$M$1250,2,FALSE),IF(VLOOKUP(F58,Companies!$B$3:$M$1250,4,FALSE)<>\"\",VLOOKUP(F58,Companies!$B$3:$M$1250,4,FALSE),IF(VLOOKUP(F58,Companies!$B$3:$M$1250,6,FALSE)<>\"\",VLOOKUP(F58,Companies!$B$3:$M$1250,6,FALSE),IF(VLOOKUP(F58,Companies!$B$3:$M$1250,8,FALSE)<>\"\",VLOOKUP(F58,Companies!$B$3:$M$1250,8,FALSE),IF(VLOOKUP(F58,Companies!$B$3:$M$1250,10,FALSE)<>\"\",VLOOKUP(F58,Companies!$B$3:$M$1250,10,FALSE),\"\")))))","v":""},{"$f":"IF(VLOOKUP(F58,Companies!$B$3:$M$1250,3,FALSE)<>\"\",VLOOKUP(F58,Companies!$B$3:$M$1250,3,FALSE),IF(VLOOKUP(F58,Companies!$B$3:$M$1250,5,FALSE)<>\"\",VLOOKUP(F58,Companies!$B$3:$M$1250,5,FALSE),IF(VLOOKUP(F58,Companies!$B$3:$M$1250,7,FALSE)<>\"\",VLOOKUP(F58,Companies!$B$3:$M$1250,7,FALSE),IF(VLOOKUP(F58,Companies!$B$3:$M$1250,9,FALSE)<>\"\",VLOOKUP(F58,Companies!$B$3:$M$1250,9,FALSE),IF(VLOOKUP(F58,Companies!$B$3:$M$1250,11,FALSE)<>\"\",VLOOKUP(F58,Companies!$B$3:$M$1250,11,FALSE),\"\")))))","v":""},{"$f":"IF(VLOOKUP(F58,Companies!$B$3:$M$1250,12,FALSE)<>\"\",VLOOKUP(F58,Companies!$B$3:$M$1250,12,FALSE),\"\")","v":""}]
[{"$nulls":3},"VSFR","411DEEZER","DEEZER","2019-04-23","2019-05-23","Invoice","19.04.0016",{"v":235.63,"d":"235.63 €"},{"$f":"IF(VLOOKUP(F59,Companies!$B$3:$M$1250,2,FALSE)<>\"\",VLOOKUP(F59,Companies!$B$3:$M$1250,2,FALSE),IF(VLOOKUP(F59,Companies!$B$3:$M$1250,4,FALSE)<>\"\",VLOOKUP(F59,Companies!$B$3:$M$1250,4,FALSE),IF(VLOOKUP(F59,Companies!$B$3:$M$1250,6,FALSE)<>\"\",VLOOKUP(F59,Companies!$B$3:$M$1250,6,FALSE),IF(VLOOKUP(F59,Companies!$B$3:$M$1250,8,FALSE)<>\"\",VLOOKUP(F59,Companies!$B$3:$M$1250,8,FALSE),IF(VLOOKUP(F59,Companies!$B$3:$M$1250,10,FALSE)<>\"\",VLOOKUP(F59,Companies!$B$3:$M$1250,10,FALSE),\"\")))))","v":""},{"$f":"IF(VLOOKUP(F59,Companies!$B$3:$M$1250,3,FALSE)<>\"\",VLOOKUP(F59,Companies!$B$3:$M$1250,3,FALSE),IF(VLOOKUP(F59,Companies!$B$3:$M$1250,5,FALSE)<>\"\",VLOOKUP(F59,Companies!$B$3:$M$1250,5,FALSE),IF(VLOOKUP(F59,Companies!$B$3:$M$1250,7,FALSE)<>\"\",VLOOKUP(F59,Companies!$B$3:$M$1250,7,FALSE),IF(VLOOKUP(F59,Companies!$B$3:$M$1250,9,FALSE)<>\"\",VLOOKUP(F59,Companies!$B$3:$M$1250,9,FALSE),IF(VLOOKUP(F59,Companies!$B$3:$M$1250,11,FALSE)<>\"\",VLOOKUP(F59,Companies!$B$3:$M$1250,11,FALSE),\"\")))))","v":""},{"$f":"IF(VLOOKUP(F59,Companies!$B$3:$M$1250,12,FALSE)<>\"\",VLOOKUP(F59,Companies!$B$3:$M$1250,12,FALSE),\"\")","v":""}]
[{"$nulls":3},"VSFR","411DEEZER","DEEZER","2019-04-23","2019-05-23","Invoice","19.04.0018",{"v":210.79,"d":"210.79 €"},{"$f":"IF(VLOOKUP(F60,Companies!$B$3:$M$1250,2,FALSE)<>\"\",VLOOKUP(F60,Companies!$B$3:$M$1250,2,FALSE),IF(VLOOKUP(F60,Companies!$B$3:$M$1250,4,FALSE)<>\"\",VLOOKUP(F60,Companies!$B$3:$M$1250,4,FALSE),IF(VLOOKUP(F60,Companies!$B$3:$M$1250,6,FALSE)<>\"\",VLOOKUP(F60,Companies!$B$3:$M$1250,6,FALSE),IF(VLOOKUP(F60,Companies!$B$3:$M$1250,8,FALSE)<>\"\",VLOOKUP(F60,Companies!$B$3:$M$1250,8,FALSE),IF(VLOOKUP(F60,Companies!$B$3:$M$1250,10,FALSE)<>\"\",VLOOKUP(F60,Companies!$B$3:$M$1250,10,FALSE),\"\")))))","v":""},{"$f":"IF(VLOOKUP(F60,Companies!$B$3:$M$1250,3,FALSE)<>\"\",VLOOKUP(F60,Companies!$B$3:$M$1250,3,FALSE),IF(VLOOKUP(F60,Companies!$B$3:$M$1250,5,FALSE)<>\"\",VLOOKUP(F60,Companies!$B$3:$M$1250,5,FALSE),IF(VLOOKUP(F60,Companies!$B$3:$M$1250,7,FALSE)<>\"\",VLOOKUP(F60,Companies!$B$3:$M$1250,7,FALSE),IF(VLOOKUP(F60,Companies!$B$3:$M$1250,9,FALSE)<>\"\",VLOOKUP(F60,Companies!$B$3:$M$1250,9,FALSE),IF(VLOOKUP(F60,Companies!$B$3:$M$1250,11,FALSE)<>\"\",VLOOKUP(F60,Companies!$B$3:$M$1250,11,FALSE),\"\")))))","v":""},{"$f":"IF(VLOOKUP(F60,Companies!$B$3:$M$1250,12,FALSE)<>\"\",VLOOKUP(F60,Companies!$B$3:$M$1250,12,FALSE),\"\")","v":""}]
[{"$nulls":3},"VSFR","411DEEZER","DEEZER","2019-04-23","2019-05-23","Invoice","19.04.0022",{"v":4981.13,"d":"4,981.13 €"},{"$f":"IF(VLOOKUP(F61,Companies!$B$3:$M$1250,2,FALSE)<>\"\",VLOOKUP(F61,Companies!$B$3:$M$1250,2,FALSE),IF(VLOOKUP(F61,Companies!$B$3:$M$1250,4,FALSE)<>\"\",VLOOKUP(F61,Companies!$B$3:$M$1250,4,FALSE),IF(VLOOKUP(F61,Companies!$B$3:$M$1250,6,FALSE)<>\"\",VLOOKUP(F61,Companies!$B$3:$M$1250,6,FALSE),IF(VLOOKUP(F61,Companies!$B$3:$M$1250,8,FALSE)<>\"\",VLOOKUP(F61,Companies!$B$3:$M$1250,8,FALSE),IF(VLOOKUP(F61,Companies!$B$3:$M$1250,10,FALSE)<>\"\",VLOOKUP(F61,Companies!$B$3:$M$1250,10,FALSE),\"\")))))","v":""},{"$f":"IF(VLOOKUP(F61,Companies!$B$3:$M$1250,3,FALSE)<>\"\",VLOOKUP(F61,Companies!$B$3:$M$1250,3,FALSE),IF(VLOOKUP(F61,Companies!$B$3:$M$1250,5,FALSE)<>\"\",VLOOKUP(F61,Companies!$B$3:$M$1250,5,FALSE),IF(VLOOKUP(F61,Companies!$B$3:$M$1250,7,FALSE)<>\"\",VLOOKUP(F61,Companies!$B$3:$M$1250,7,FALSE),IF(VLOOKUP(F61,Companies!$B$3:$M$1250,9,FALSE)<>\"\",VLOOKUP(F61,Companies!$B$3:$M$1250,9,FALSE),IF(VLOOKUP(F61,Companies!$B$3:$M$1250,11,FALSE)<>\"\",VLOOKUP(F61,Companies!$B$3:$M$1250,11,FALSE),\"\")))))","v":""},{"$f":"IF(VLOOKUP(F61,Companies!$B$3:$M$1250,12,FALSE)<>\"\",VLOOKUP(F61,Companies!$B$3:$M$1250,12,FALSE),\"\")","v":""}]
[{"$nulls":3},"VSFR","411DEEZER","DEEZER","2019-04-30","2019-05-30","Invoice","19.04.0041",{"v":84,"d":"84.00 €"},{"$f":"IF(VLOOKUP(F62,Companies!$B$3:$M$1250,2,FALSE)<>\"\",VLOOKUP(F62,Companies!$B$3:$M$1250,2,FALSE),IF(VLOOKUP(F62,Companies!$B$3:$M$1250,4,FALSE)<>\"\",VLOOKUP(F62,Companies!$B$3:$M$1250,4,FALSE),IF(VLOOKUP(F62,Companies!$B$3:$M$1250,6,FALSE)<>\"\",VLOOKUP(F62,Companies!$B$3:$M$1250,6,FALSE),IF(VLOOKUP(F62,Companies!$B$3:$M$1250,8,FALSE)<>\"\",VLOOKUP(F62,Companies!$B$3:$M$1250,8,FALSE),IF(VLOOKUP(F62,Companies!$B$3:$M$1250,10,FALSE)<>\"\",VLOOKUP(F62,Companies!$B$3:$M$1250,10,FALSE),\"\")))))","v":""},{"$f":"IF(VLOOKUP(F62,Companies!$B$3:$M$1250,3,FALSE)<>\"\",VLOOKUP(F62,Companies!$B$3:$M$1250,3,FALSE),IF(VLOOKUP(F62,Companies!$B$3:$M$1250,5,FALSE)<>\"\",VLOOKUP(F62,Companies!$B$3:$M$1250,5,FALSE),IF(VLOOKUP(F62,Companies!$B$3:$M$1250,7,FALSE)<>\"\",VLOOKUP(F62,Companies!$B$3:$M$1250,7,FALSE),IF(VLOOKUP(F62,Companies!$B$3:$M$1250,9,FALSE)<>\"\",VLOOKUP(F62,Companies!$B$3:$M$1250,9,FALSE),IF(VLOOKUP(F62,Companies!$B$3:$M$1250,11,FALSE)<>\"\",VLOOKUP(F62,Companies!$B$3:$M$1250,11,FALSE),\"\")))))","v":""},{"$f":"IF(VLOOKUP(F62,Companies!$B$3:$M$1250,12,FALSE)<>\"\",VLOOKUP(F62,Companies!$B$3:$M$1250,12,FALSE),\"\")","v":""}]
[{"$nulls":3},"VSFR","411DEEZER","DEEZER","2019-04-30","2019-05-30","Invoice","19.04.0042",{"v":10.42,"d":"10.42 €"},{"$f":"IF(VLOOKUP(F63,Companies!$B$3:$M$1250,2,FALSE)<>\"\",VLOOKUP(F63,Companies!$B$3:$M$1250,2,FALSE),IF(VLOOKUP(F63,Companies!$B$3:$M$1250,4,FALSE)<>\"\",VLOOKUP(F63,Companies!$B$3:$M$1250,4,FALSE),IF(VLOOKUP(F63,Companies!$B$3:$M$1250,6,FALSE)<>\"\",VLOOKUP(F63,Companies!$B$3:$M$1250,6,FALSE),IF(VLOOKUP(F63,Companies!$B$3:$M$1250,8,FALSE)<>\"\",VLOOKUP(F63,Companies!$B$3:$M$1250,8,FALSE),IF(VLOOKUP(F63,Companies!$B$3:$M$1250,10,FALSE)<>\"\",VLOOKUP(F63,Companies!$B$3:$M$1250,10,FALSE),\"\")))))","v":""},{"$f":"IF(VLOOKUP(F63,Companies!$B$3:$M$1250,3,FALSE)<>\"\",VLOOKUP(F63,Companies!$B$3:$M$1250,3,FALSE),IF(VLOOKUP(F63,Companies!$B$3:$M$1250,5,FALSE)<>\"\",VLOOKUP(F63,Companies!$B$3:$M$1250,5,FALSE),IF(VLOOKUP(F63,Companies!$B$3:$M$1250,7,FALSE)<>\"\",VLOOKUP(F63,Companies!$B$3:$M$1250,7,FALSE),IF(VLOOKUP(F63,Companies!$B$3:$M$1250,9,FALSE)<>\"\",VLOOKUP(F63,Companies!$B$3:$M$1250,9,FALSE),IF(VLOOKUP(F63,Companies!$B$3:$M$1250,11,FALSE)<>\"\",VLOOKUP(F63,Companies!$B$3:$M$1250,11,FALSE),\"\")))))","v":""},{"$f":"IF(VLOOKUP(F63,Companies!$B$3:$M$1250,12,FALSE)<>\"\",VLOOKUP(F63,Companies!$B$3:$M$1250,12,FALSE),\"\")","v":""}]
[{"$nulls":3},"VSFR","411DEEZER","DEEZER","2019-04-30","2019-05-30","Invoice","19.04.0043",{"v":84,"d":"84.00 €"},{"$f":"IF(VLOOKUP(F64,Companies!$B$3:$M$1250,2,FALSE)<>\"\",VLOOKUP(F64,Companies!$B$3:$M$1250,2,FALSE),IF(VLOOKUP(F64,Companies!$B$3:$M$1250,4,FALSE)<>\"\",VLOOKUP(F64,Companies!$B$3:$M$1250,4,FALSE),IF(VLOOKUP(F64,Companies!$B$3:$M$1250,6,FALSE)<>\"\",VLOOKUP(F64,Companies!$B$3:$M$1250,6,FALSE),IF(VLOOKUP(F64,Companies!$B$3:$M$1250,8,FALSE)<>\"\",VLOOKUP(F64,Companies!$B$3:$M$1250,8,FALSE),IF(VLOOKUP(F64,Companies!$B$3:$M$1250,10,FALSE)<>\"\",VLOOKUP(F64,Companies!$B$3:$M$1250,10,FALSE),\"\")))))","v":""},{"$f":"IF(VLOOKUP(F64,Companies!$B$3:$M$1250,3,FALSE)<>\"\",VLOOKUP(F64,Companies!$B$3:$M$1250,3,FALSE),IF(VLOOKUP(F64,Companies!$B$3:$M$1250,5,FALSE)<>\"\",VLOOKUP(F64,Companies!$B$3:$M$1250,5,FALSE),IF(VLOOKUP(F64,Companies!$B$3:$M$1250,7,FALSE)<>\"\",VLOOKUP(F64,Companies!$B$3:$M$1250,7,FALSE),IF(VLOOKUP(F64,Companies!$B$3:$M$1250,9,FALSE)<>\"\",VLOOKUP(F64,Companies!$B$3:$M$1250,9,FALSE),IF(VLOOKUP(F64,Companies!$B$3:$M$1250,11,FALSE)<>\"\",VLOOKUP(F64,Companies!$B$3:$M$1250,11,FALSE),\"\")))))","v":""},{"$f":"IF(VLOOKUP(F64,Companies!$B$3:$M$1250,12,FALSE)<>\"\",VLOOKUP(F64,Companies!$B$3:$M$1250,12,FALSE),\"\")","v":""}]
[{"$nulls":3},"VSFR","411DEEZER","DEEZER","2019-05-31","2019-06-30","Invoice",{"$f":"\"19050012\"","v":"19050012"},{"v":89.22,"d":"89.22 €"},{"$f":"IF(VLOOKUP(F65,Companies!$B$3:$M$1250,2,FALSE)<>\"\",VLOOKUP(F65,Companies!$B$3:$M$1250,2,FALSE),IF(VLOOKUP(F65,Companies!$B$3:$M$1250,4,FALSE)<>\"\",VLOOKUP(F65,Companies!$B$3:$M$1250,4,FALSE),IF(VLOOKUP(F65,Companies!$B$3:$M$1250,6,FALSE)<>\"\",VLOOKUP(F65,Companies!$B$3:$M$1250,6,FALSE),IF(VLOOKUP(F65,Companies!$B$3:$M$1250,8,FALSE)<>\"\",VLOOKUP(F65,Companies!$B$3:$M$1250,8,FALSE),IF(VLOOKUP(F65,Companies!$B$3:$M$1250,10,FALSE)<>\"\",VLOOKUP(F65,Companies!$B$3:$M$1250,10,FALSE),\"\")))))","v":""},{"$f":"IF(VLOOKUP(F65,Companies!$B$3:$M$1250,3,FALSE)<>\"\",VLOOKUP(F65,Companies!$B$3:$M$1250,3,FALSE),IF(VLOOKUP(F65,Companies!$B$3:$M$1250,5,FALSE)<>\"\",VLOOKUP(F65,Companies!$B$3:$M$1250,5,FALSE),IF(VLOOKUP(F65,Companies!$B$3:$M$1250,7,FALSE)<>\"\",VLOOKUP(F65,Companies!$B$3:$M$1250,7,FALSE),IF(VLOOKUP(F65,Companies!$B$3:$M$1250,9,FALSE)<>\"\",VLOOKUP(F65,Companies!$B$3:$M$1250,9,FALSE),IF(VLOOKUP(F65,Companies!$B$3:$M$1250,11,FALSE)<>\"\",VLOOKUP(F65,Companies!$B$3:$M$1250,11,FALSE),\"\")))))","v":""},{"$f":"IF(VLOOKUP(F65,Companies!$B$3:$M$1250,12,FALSE)<>\"\",VLOOKUP(F65,Companies!$B$3:$M$1250,12,FALSE),\"\")","v":""}]
[{"$nulls":3},"VSFR","411DEEZER","DEEZER","2019-05-31","2019-06-30","Invoice",{"$f":"\"19050019\"","v":"19050019"},{"v":202.09,"d":"202.09 €"},{"$f":"IF(VLOOKUP(F66,Companies!$B$3:$M$1250,2,FALSE)<>\"\",VLOOKUP(F66,Companies!$B$3:$M$1250,2,FALSE),IF(VLOOKUP(F66,Companies!$B$3:$M$1250,4,FALSE)<>\"\",VLOOKUP(F66,Companies!$B$3:$M$1250,4,FALSE),IF(VLOOKUP(F66,Companies!$B$3:$M$1250,6,FALSE)<>\"\",VLOOKUP(F66,Companies!$B$3:$M$1250,6,FALSE),IF(VLOOKUP(F66,Companies!$B$3:$M$1250,8,FALSE)<>\"\",VLOOKUP(F66,Companies!$B$3:$M$1250,8,FALSE),IF(VLOOKUP(F66,Companies!$B$3:$M$1250,10,FALSE)<>\"\",VLOOKUP(F66,Companies!$B$3:$M$1250,10,FALSE),\"\")))))","v":""},{"$f":"IF(VLOOKUP(F66,Companies!$B$3:$M$1250,3,FALSE)<>\"\",VLOOKUP(F66,Companies!$B$3:$M$1250,3,FALSE),IF(VLOOKUP(F66,Companies!$B$3:$M$1250,5,FALSE)<>\"\",VLOOKUP(F66,Companies!$B$3:$M$1250,5,FALSE),IF(VLOOKUP(F66,Companies!$B$3:$M$1250,7,FALSE)<>\"\",VLOOKUP(F66,Companies!$B$3:$M$1250,7,FALSE),IF(VLOOKUP(F66,Companies!$B$3:$M$1250,9,FALSE)<>\"\",VLOOKUP(F66,Companies!$B$3:$M$1250,9,FALSE),IF(VLOOKUP(F66,Companies!$B$3:$M$1250,11,FALSE)<>\"\",VLOOKUP(F66,Companies!$B$3:$M$1250,11,FALSE),\"\")))))","v":""},{"$f":"IF(VLOOKUP(F66,Companies!$B$3:$M$1250,12,FALSE)<>\"\",VLOOKUP(F66,Companies!$B$3:$M$1250,12,FALSE),\"\")","v":""}]
[{"$nulls":3},"VSFR","411DEEZER","DEEZER","2019-05-31","2019-06-30","Invoice",{"$f":"\"19050020\"","v":"19050020"},{"v":84,"d":"84.00 €"},{"$f":"IF(VLOOKUP(F67,Companies!$B$3:$M$1250,2,FALSE)<>\"\",VLOOKUP(F67,Companies!$B$3:$M$1250,2,FALSE),IF(VLOOKUP(F67,Companies!$B$3:$M$1250,4,FALSE)<>\"\",VLOOKUP(F67,Companies!$B$3:$M$1250,4,FALSE),IF(VLOOKUP(F67,Companies!$B$3:$M$1250,6,FALSE)<>\"\",VLOOKUP(F67,Companies!$B$3:$M$1250,6,FALSE),IF(VLOOKUP(F67,Companies!$B$3:$M$1250,8,FALSE)<>\"\",VLOOKUP(F67,Companies!$B$3:$M$1250,8,FALSE),IF(VLOOKUP(F67,Companies!$B$3:$M$1250,10,FALSE)<>\"\",VLOOKUP(F67,Companies!$B$3:$M$1250,10,FALSE),\"\")))))","v":""},{"$f":"IF(VLOOKUP(F67,Companies!$B$3:$M$1250,3,FALSE)<>\"\",VLOOKUP(F67,Companies!$B$3:$M$1250,3,FALSE),IF(VLOOKUP(F67,Companies!$B$3:$M$1250,5,FALSE)<>\"\",VLOOKUP(F67,Companies!$B$3:$M$1250,5,FALSE),IF(VLOOKUP(F67,Companies!$B$3:$M$1250,7,FALSE)<>\"\",VLOOKUP(F67,Companies!$B$3:$M$1250,7,FALSE),IF(VLOOKUP(F67,Companies!$B$3:$M$1250,9,FALSE)<>\"\",VLOOKUP(F67,Companies!$B$3:$M$1250,9,FALSE),IF(VLOOKUP(F67,Companies!$B$3:$M$1250,11,FALSE)<>\"\",VLOOKUP(F67,Companies!$B$3:$M$1250,11,FALSE),\"\")))))","v":""},{"$f":"IF(VLOOKUP(F67,Companies!$B$3:$M$1250,12,FALSE)<>\"\",VLOOKUP(F67,Companies!$B$3:$M$1250,12,FALSE),\"\")","v":""}]
[{"$nulls":3},"VSFR","411DEEZER","DEEZER","2019-05-31","2019-06-30","Invoice",{"$f":"\"19050021\"","v":"19050021"},{"v":202.09,"d":"202.09 €"},{"$f":"IF(VLOOKUP(F68,Companies!$B$3:$M$1250,2,FALSE)<>\"\",VLOOKUP(F68,Companies!$B$3:$M$1250,2,FALSE),IF(VLOOKUP(F68,Companies!$B$3:$M$1250,4,FALSE)<>\"\",VLOOKUP(F68,Companies!$B$3:$M$1250,4,FALSE),IF(VLOOKUP(F68,Companies!$B$3:$M$1250,6,FALSE)<>\"\",VLOOKUP(F68,Companies!$B$3:$M$1250,6,FALSE),IF(VLOOKUP(F68,Companies!$B$3:$M$1250,8,FALSE)<>\"\",VLOOKUP(F68,Companies!$B$3:$M$1250,8,FALSE),IF(VLOOKUP(F68,Companies!$B$3:$M$1250,10,FALSE)<>\"\",VLOOKUP(F68,Companies!$B$3:$M$1250,10,FALSE),\"\")))))","v":""},{"$f":"IF(VLOOKUP(F68,Companies!$B$3:$M$1250,3,FALSE)<>\"\",VLOOKUP(F68,Companies!$B$3:$M$1250,3,FALSE),IF(VLOOKUP(F68,Companies!$B$3:$M$1250,5,FALSE)<>\"\",VLOOKUP(F68,Companies!$B$3:$M$1250,5,FALSE),IF(VLOOKUP(F68,Companies!$B$3:$M$1250,7,FALSE)<>\"\",VLOOKUP(F68,Companies!$B$3:$M$1250,7,FALSE),IF(VLOOKUP(F68,Companies!$B$3:$M$1250,9,FALSE)<>\"\",VLOOKUP(F68,Companies!$B$3:$M$1250,9,FALSE),IF(VLOOKUP(F68,Companies!$B$3:$M$1250,11,FALSE)<>\"\",VLOOKUP(F68,Companies!$B$3:$M$1250,11,FALSE),\"\")))))","v":""},{"$f":"IF(VLOOKUP(F68,Companies!$B$3:$M$1250,12,FALSE)<>\"\",VLOOKUP(F68,Companies!$B$3:$M$1250,12,FALSE),\"\")","v":""}]
[{"$nulls":3},"VSFR","411DEEZER","DEEZER","2019-05-31","2019-06-30","Invoice",{"$f":"\"19050022\"","v":"19050022"},{"v":26.46,"d":"26.46 €"},{"$f":"IF(VLOOKUP(F69,Companies!$B$3:$M$1250,2,FALSE)<>\"\",VLOOKUP(F69,Companies!$B$3:$M$1250,2,FALSE),IF(VLOOKUP(F69,Companies!$B$3:$M$1250,4,FALSE)<>\"\",VLOOKUP(F69,Companies!$B$3:$M$1250,4,FALSE),IF(VLOOKUP(F69,Companies!$B$3:$M$1250,6,FALSE)<>\"\",VLOOKUP(F69,Companies!$B$3:$M$1250,6,FALSE),IF(VLOOKUP(F69,Companies!$B$3:$M$1250,8,FALSE)<>\"\",VLOOKUP(F69,Companies!$B$3:$M$1250,8,FALSE),IF(VLOOKUP(F69,Companies!$B$3:$M$1250,10,FALSE)<>\"\",VLOOKUP(F69,Companies!$B$3:$M$1250,10,FALSE),\"\")))))","v":""},{"$f":"IF(VLOOKUP(F69,Companies!$B$3:$M$1250,3,FALSE)<>\"\",VLOOKUP(F69,Companies!$B$3:$M$1250,3,FALSE),IF(VLOOKUP(F69,Companies!$B$3:$M$1250,5,FALSE)<>\"\",VLOOKUP(F69,Companies!$B$3:$M$1250,5,FALSE),IF(VLOOKUP(F69,Companies!$B$3:$M$1250,7,FALSE)<>\"\",VLOOKUP(F69,Companies!$B$3:$M$1250,7,FALSE),IF(VLOOKUP(F69,Companies!$B$3:$M$1250,9,FALSE)<>\"\",VLOOKUP(F69,Companies!$B$3:$M$1250,9,FALSE),IF(VLOOKUP(F69,Companies!$B$3:$M$1250,11,FALSE)<>\"\",VLOOKUP(F69,Companies!$B$3:$M$1250,11,FALSE),\"\")))))","v":""},{"$f":"IF(VLOOKUP(F69,Companies!$B$3:$M$1250,12,FALSE)<>\"\",VLOOKUP(F69,Companies!$B$3:$M$1250,12,FALSE),\"\")","v":""}]
[{"$nulls":3},"VSFR","411DEEZER","DEEZER","2019-05-31","2019-06-30","Invoice",{"$f":"\"19050029\"","v":"19050029"},{"v":9.4,"d":"9.40 €"},{"$f":"IF(VLOOKUP(F70,Companies!$B$3:$M$1250,2,FALSE)<>\"\",VLOOKUP(F70,Companies!$B$3:$M$1250,2,FALSE),IF(VLOOKUP(F70,Companies!$B$3:$M$1250,4,FALSE)<>\"\",VLOOKUP(F70,Companies!$B$3:$M$1250,4,FALSE),IF(VLOOKUP(F70,Companies!$B$3:$M$1250,6,FALSE)<>\"\",VLOOKUP(F70,Companies!$B$3:$M$1250,6,FALSE),IF(VLOOKUP(F70,Companies!$B$3:$M$1250,8,FALSE)<>\"\",VLOOKUP(F70,Companies!$B$3:$M$1250,8,FALSE),IF(VLOOKUP(F70,Companies!$B$3:$M$1250,10,FALSE)<>\"\",VLOOKUP(F70,Companies!$B$3:$M$1250,10,FALSE),\"\")))))","v":""},{"$f":"IF(VLOOKUP(F70,Companies!$B$3:$M$1250,3,FALSE)<>\"\",VLOOKUP(F70,Companies!$B$3:$M$1250,3,FALSE),IF(VLOOKUP(F70,Companies!$B$3:$M$1250,5,FALSE)<>\"\",VLOOKUP(F70,Companies!$B$3:$M$1250,5,FALSE),IF(VLOOKUP(F70,Companies!$B$3:$M$1250,7,FALSE)<>\"\",VLOOKUP(F70,Companies!$B$3:$M$1250,7,FALSE),IF(VLOOKUP(F70,Companies!$B$3:$M$1250,9,FALSE)<>\"\",VLOOKUP(F70,Companies!$B$3:$M$1250,9,FALSE),IF(VLOOKUP(F70,Companies!$B$3:$M$1250,11,FALSE)<>\"\",VLOOKUP(F70,Companies!$B$3:$M$1250,11,FALSE),\"\")))))","v":""},{"$f":"IF(VLOOKUP(F70,Companies!$B$3:$M$1250,12,FALSE)<>\"\",VLOOKUP(F70,Companies!$B$3:$M$1250,12,FALSE),\"\")","v":""}]
[{"$nulls":3},"VSFR","411DISTRILAP","DISTRILAP","2019-04-30","2019-05-30","Invoice","19.04.0033",{"v":876.82,"d":"876.82 €"},{"$f":"IF(VLOOKUP(F71,Companies!$B$3:$M$1250,2,FALSE)<>\"\",VLOOKUP(F71,Companies!$B$3:$M$1250,2,FALSE),IF(VLOOKUP(F71,Companies!$B$3:$M$1250,4,FALSE)<>\"\",VLOOKUP(F71,Companies!$B$3:$M$1250,4,FALSE),IF(VLOOKUP(F71,Companies!$B$3:$M$1250,6,FALSE)<>\"\",VLOOKUP(F71,Companies!$B$3:$M$1250,6,FALSE),IF(VLOOKUP(F71,Companies!$B$3:$M$1250,8,FALSE)<>\"\",VLOOKUP(F71,Companies!$B$3:$M$1250,8,FALSE),IF(VLOOKUP(F71,Companies!$B$3:$M$1250,10,FALSE)<>\"\",VLOOKUP(F71,Companies!$B$3:$M$1250,10,FALSE),\"\")))))","v":""},{"$f":"IF(VLOOKUP(F71,Companies!$B$3:$M$1250,3,FALSE)<>\"\",VLOOKUP(F71,Companies!$B$3:$M$1250,3,FALSE),IF(VLOOKUP(F71,Companies!$B$3:$M$1250,5,FALSE)<>\"\",VLOOKUP(F71,Companies!$B$3:$M$1250,5,FALSE),IF(VLOOKUP(F71,Companies!$B$3:$M$1250,7,FALSE)<>\"\",VLOOKUP(F71,Companies!$B$3:$M$1250,7,FALSE),IF(VLOOKUP(F71,Companies!$B$3:$M$1250,9,FALSE)<>\"\",VLOOKUP(F71,Companies!$B$3:$M$1250,9,FALSE),IF(VLOOKUP(F71,Companies!$B$3:$M$1250,11,FALSE)<>\"\",VLOOKUP(F71,Companies!$B$3:$M$1250,11,FALSE),\"\")))))","v":""},{"$f":"IF(VLOOKUP(F71,Companies!$B$3:$M$1250,12,FALSE)<>\"\",VLOOKUP(F71,Companies!$B$3:$M$1250,12,FALSE),\"\")","v":""}]
[{"$nulls":3},"VSFR","411DRUVATECHNOLOGIES","Druva Technologies Pte. Ltd.","2019-04-30","2019-05-30","Invoice","19.04.0239",{"v":2060,"d":"2,060.00 €"},{"$f":"IF(VLOOKUP(F72,Companies!$B$3:$M$1250,2,FALSE)<>\"\",VLOOKUP(F72,Companies!$B$3:$M$1250,2,FALSE),IF(VLOOKUP(F72,Companies!$B$3:$M$1250,4,FALSE)<>\"\",VLOOKUP(F72,Companies!$B$3:$M$1250,4,FALSE),IF(VLOOKUP(F72,Companies!$B$3:$M$1250,6,FALSE)<>\"\",VLOOKUP(F72,Companies!$B$3:$M$1250,6,FALSE),IF(VLOOKUP(F72,Companies!$B$3:$M$1250,8,FALSE)<>\"\",VLOOKUP(F72,Companies!$B$3:$M$1250,8,FALSE),IF(VLOOKUP(F72,Companies!$B$3:$M$1250,10,FALSE)<>\"\",VLOOKUP(F72,Companies!$B$3:$M$1250,10,FALSE),\"\")))))","v":""},{"$f":"IF(VLOOKUP(F72,Companies!$B$3:$M$1250,3,FALSE)<>\"\",VLOOKUP(F72,Companies!$B$3:$M$1250,3,FALSE),IF(VLOOKUP(F72,Companies!$B$3:$M$1250,5,FALSE)<>\"\",VLOOKUP(F72,Companies!$B$3:$M$1250,5,FALSE),IF(VLOOKUP(F72,Companies!$B$3:$M$1250,7,FALSE)<>\"\",VLOOKUP(F72,Companies!$B$3:$M$1250,7,FALSE),IF(VLOOKUP(F72,Companies!$B$3:$M$1250,9,FALSE)<>\"\",VLOOKUP(F72,Companies!$B$3:$M$1250,9,FALSE),IF(VLOOKUP(F72,Companies!$B$3:$M$1250,11,FALSE)<>\"\",VLOOKUP(F72,Companies!$B$3:$M$1250,11,FALSE),\"\")))))","v":""},{"$f":"IF(VLOOKUP(F72,Companies!$B$3:$M$1250,12,FALSE)<>\"\",VLOOKUP(F72,Companies!$B$3:$M$1250,12,FALSE),\"\")","v":""}]
[{"$nulls":3},"VSFR","411DUFERCOTHIONVILLE","DUFERCO THIONVILLE","2019-05-31","2019-06-30","Invoice","FA19050088",{"v":960,"d":"960.00 €"},{"$f":"IF(VLOOKUP(F73,Companies!$B$3:$M$1250,2,FALSE)<>\"\",VLOOKUP(F73,Companies!$B$3:$M$1250,2,FALSE),IF(VLOOKUP(F73,Companies!$B$3:$M$1250,4,FALSE)<>\"\",VLOOKUP(F73,Companies!$B$3:$M$1250,4,FALSE),IF(VLOOKUP(F73,Companies!$B$3:$M$1250,6,FALSE)<>\"\",VLOOKUP(F73,Companies!$B$3:$M$1250,6,FALSE),IF(VLOOKUP(F73,Companies!$B$3:$M$1250,8,FALSE)<>\"\",VLOOKUP(F73,Companies!$B$3:$M$1250,8,FALSE),IF(VLOOKUP(F73,Companies!$B$3:$M$1250,10,FALSE)<>\"\",VLOOKUP(F73,Companies!$B$3:$M$1250,10,FALSE),\"\")))))","v":""},{"$f":"IF(VLOOKUP(F73,Companies!$B$3:$M$1250,3,FALSE)<>\"\",VLOOKUP(F73,Companies!$B$3:$M$1250,3,FALSE),IF(VLOOKUP(F73,Companies!$B$3:$M$1250,5,FALSE)<>\"\",VLOOKUP(F73,Companies!$B$3:$M$1250,5,FALSE),IF(VLOOKUP(F73,Companies!$B$3:$M$1250,7,FALSE)<>\"\",VLOOKUP(F73,Companies!$B$3:$M$1250,7,FALSE),IF(VLOOKUP(F73,Companies!$B$3:$M$1250,9,FALSE)<>\"\",VLOOKUP(F73,Companies!$B$3:$M$1250,9,FALSE),IF(VLOOKUP(F73,Companies!$B$3:$M$1250,11,FALSE)<>\"\",VLOOKUP(F73,Companies!$B$3:$M$1250,11,FALSE),\"\")))))","v":""},{"$f":"IF(VLOOKUP(F73,Companies!$B$3:$M$1250,12,FALSE)<>\"\",VLOOKUP(F73,Companies!$B$3:$M$1250,12,FALSE),\"\")","v":""}]
[{"$nulls":3},"VSFR","411ELECTRONICSFORLTD","Electronics for Imaging United Kingdom Ltd","2019-05-31","2019-06-30","Invoice",{"$f":"\"19050005\"","v":"19050005"},{"v":300,"d":"300.00 €"},{"$f":"IF(VLOOKUP(F74,Companies!$B$3:$M$1250,2,FALSE)<>\"\",VLOOKUP(F74,Companies!$B$3:$M$1250,2,FALSE),IF(VLOOKUP(F74,Companies!$B$3:$M$1250,4,FALSE)<>\"\",VLOOKUP(F74,Companies!$B$3:$M$1250,4,FALSE),IF(VLOOKUP(F74,Companies!$B$3:$M$1250,6,FALSE)<>\"\",VLOOKUP(F74,Companies!$B$3:$M$1250,6,FALSE),IF(VLOOKUP(F74,Companies!$B$3:$M$1250,8,FALSE)<>\"\",VLOOKUP(F74,Companies!$B$3:$M$1250,8,FALSE),IF(VLOOKUP(F74,Companies!$B$3:$M$1250,10,FALSE)<>\"\",VLOOKUP(F74,Companies!$B$3:$M$1250,10,FALSE),\"\")))))","v":""},{"$f":"IF(VLOOKUP(F74,Companies!$B$3:$M$1250,3,FALSE)<>\"\",VLOOKUP(F74,Companies!$B$3:$M$1250,3,FALSE),IF(VLOOKUP(F74,Companies!$B$3:$M$1250,5,FALSE)<>\"\",VLOOKUP(F74,Companies!$B$3:$M$1250,5,FALSE),IF(VLOOKUP(F74,Companies!$B$3:$M$1250,7,FALSE)<>\"\",VLOOKUP(F74,Companies!$B$3:$M$1250,7,FALSE),IF(VLOOKUP(F74,Companies!$B$3:$M$1250,9,FALSE)<>\"\",VLOOKUP(F74,Companies!$B$3:$M$1250,9,FALSE),IF(VLOOKUP(F74,Companies!$B$3:$M$1250,11,FALSE)<>\"\",VLOOKUP(F74,Companies!$B$3:$M$1250,11,FALSE),\"\")))))","v":""},{"$f":"IF(VLOOKUP(F74,Companies!$B$3:$M$1250,12,FALSE)<>\"\",VLOOKUP(F74,Companies!$B$3:$M$1250,12,FALSE),\"\")","v":""}]
[{"$nulls":3},"VSFR","411D2T","FEV SOFTWARE AND TESTING SOLUTIONS","2018-12-26","2019-01-25","Invoice","18.12.0065",{"v":360,"d":"360.00 €"},{"$f":"IF(VLOOKUP(F75,Companies!$B$3:$M$1250,2,FALSE)<>\"\",VLOOKUP(F75,Companies!$B$3:$M$1250,2,FALSE),IF(VLOOKUP(F75,Companies!$B$3:$M$1250,4,FALSE)<>\"\",VLOOKUP(F75,Companies!$B$3:$M$1250,4,FALSE),IF(VLOOKUP(F75,Companies!$B$3:$M$1250,6,FALSE)<>\"\",VLOOKUP(F75,Companies!$B$3:$M$1250,6,FALSE),IF(VLOOKUP(F75,Companies!$B$3:$M$1250,8,FALSE)<>\"\",VLOOKUP(F75,Companies!$B$3:$M$1250,8,FALSE),IF(VLOOKUP(F75,Companies!$B$3:$M$1250,10,FALSE)<>\"\",VLOOKUP(F75,Companies!$B$3:$M$1250,10,FALSE),\"\")))))","v":""},{"$f":"IF(VLOOKUP(F75,Companies!$B$3:$M$1250,3,FALSE)<>\"\",VLOOKUP(F75,Companies!$B$3:$M$1250,3,FALSE),IF(VLOOKUP(F75,Companies!$B$3:$M$1250,5,FALSE)<>\"\",VLOOKUP(F75,Companies!$B$3:$M$1250,5,FALSE),IF(VLOOKUP(F75,Companies!$B$3:$M$1250,7,FALSE)<>\"\",VLOOKUP(F75,Companies!$B$3:$M$1250,7,FALSE),IF(VLOOKUP(F75,Companies!$B$3:$M$1250,9,FALSE)<>\"\",VLOOKUP(F75,Companies!$B$3:$M$1250,9,FALSE),IF(VLOOKUP(F75,Companies!$B$3:$M$1250,11,FALSE)<>\"\",VLOOKUP(F75,Companies!$B$3:$M$1250,11,FALSE),\"\")))))","v":""},{"$f":"IF(VLOOKUP(F75,Companies!$B$3:$M$1250,12,FALSE)<>\"\",VLOOKUP(F75,Companies!$B$3:$M$1250,12,FALSE),\"\")","v":""}]
[{"$nulls":3},"VSFR","411FOCUSONVAT","FocusonVAT","2019-05-31","2019-06-30","Invoice","FA19050158",{"v":440,"d":"440.00 €"},{"$f":"IF(VLOOKUP(F76,Companies!$B$3:$M$1250,2,FALSE)<>\"\",VLOOKUP(F76,Companies!$B$3:$M$1250,2,FALSE),IF(VLOOKUP(F76,Companies!$B$3:$M$1250,4,FALSE)<>\"\",VLOOKUP(F76,Companies!$B$3:$M$1250,4,FALSE),IF(VLOOKUP(F76,Companies!$B$3:$M$1250,6,FALSE)<>\"\",VLOOKUP(F76,Companies!$B$3:$M$1250,6,FALSE),IF(VLOOKUP(F76,Companies!$B$3:$M$1250,8,FALSE)<>\"\",VLOOKUP(F76,Companies!$B$3:$M$1250,8,FALSE),IF(VLOOKUP(F76,Companies!$B$3:$M$1250,10,FALSE)<>\"\",VLOOKUP(F76,Companies!$B$3:$M$1250,10,FALSE),\"\")))))","v":""},{"$f":"IF(VLOOKUP(F76,Companies!$B$3:$M$1250,3,FALSE)<>\"\",VLOOKUP(F76,Companies!$B$3:$M$1250,3,FALSE),IF(VLOOKUP(F76,Companies!$B$3:$M$1250,5,FALSE)<>\"\",VLOOKUP(F76,Companies!$B$3:$M$1250,5,FALSE),IF(VLOOKUP(F76,Companies!$B$3:$M$1250,7,FALSE)<>\"\",VLOOKUP(F76,Companies!$B$3:$M$1250,7,FALSE),IF(VLOOKUP(F76,Companies!$B$3:$M$1250,9,FALSE)<>\"\",VLOOKUP(F76,Companies!$B$3:$M$1250,9,FALSE),IF(VLOOKUP(F76,Companies!$B$3:$M$1250,11,FALSE)<>\"\",VLOOKUP(F76,Companies!$B$3:$M$1250,11,FALSE),\"\")))))","v":""},{"$f":"IF(VLOOKUP(F76,Companies!$B$3:$M$1250,12,FALSE)<>\"\",VLOOKUP(F76,Companies!$B$3:$M$1250,12,FALSE),\"\")","v":""}]
[{"$nulls":3},"VSFR","411GEMALTOSA","GEMALTO SA","2018-11-30","2018-12-30","Invoice","18.11.0124",{"v":1817.33,"d":"1,817.33 €"},{"$f":"IF(VLOOKUP(F77,Companies!$B$3:$M$1250,2,FALSE)<>\"\",VLOOKUP(F77,Companies!$B$3:$M$1250,2,FALSE),IF(VLOOKUP(F77,Companies!$B$3:$M$1250,4,FALSE)<>\"\",VLOOKUP(F77,Companies!$B$3:$M$1250,4,FALSE),IF(VLOOKUP(F77,Companies!$B$3:$M$1250,6,FALSE)<>\"\",VLOOKUP(F77,Companies!$B$3:$M$1250,6,FALSE),IF(VLOOKUP(F77,Companies!$B$3:$M$1250,8,FALSE)<>\"\",VLOOKUP(F77,Companies!$B$3:$M$1250,8,FALSE),IF(VLOOKUP(F77,Companies!$B$3:$M$1250,10,FALSE)<>\"\",VLOOKUP(F77,Companies!$B$3:$M$1250,10,FALSE),\"\")))))","v":""},{"$f":"IF(VLOOKUP(F77,Companies!$B$3:$M$1250,3,FALSE)<>\"\",VLOOKUP(F77,Companies!$B$3:$M$1250,3,FALSE),IF(VLOOKUP(F77,Companies!$B$3:$M$1250,5,FALSE)<>\"\",VLOOKUP(F77,Companies!$B$3:$M$1250,5,FALSE),IF(VLOOKUP(F77,Companies!$B$3:$M$1250,7,FALSE)<>\"\",VLOOKUP(F77,Companies!$B$3:$M$1250,7,FALSE),IF(VLOOKUP(F77,Companies!$B$3:$M$1250,9,FALSE)<>\"\",VLOOKUP(F77,Companies!$B$3:$M$1250,9,FALSE),IF(VLOOKUP(F77,Companies!$B$3:$M$1250,11,FALSE)<>\"\",VLOOKUP(F77,Companies!$B$3:$M$1250,11,FALSE),\"\")))))","v":""},{"$f":"IF(VLOOKUP(F77,Companies!$B$3:$M$1250,12,FALSE)<>\"\",VLOOKUP(F77,Companies!$B$3:$M$1250,12,FALSE),\"\")","v":""}]
[{"$nulls":3},"VSFR","411GEMALTOSA","GEMALTO SA","2018-12-31","2019-01-30","Invoice","18.12.0157",{"v":216.4,"d":"216.40 €"},{"$f":"IF(VLOOKUP(F78,Companies!$B$3:$M$1250,2,FALSE)<>\"\",VLOOKUP(F78,Companies!$B$3:$M$1250,2,FALSE),IF(VLOOKUP(F78,Companies!$B$3:$M$1250,4,FALSE)<>\"\",VLOOKUP(F78,Companies!$B$3:$M$1250,4,FALSE),IF(VLOOKUP(F78,Companies!$B$3:$M$1250,6,FALSE)<>\"\",VLOOKUP(F78,Companies!$B$3:$M$1250,6,FALSE),IF(VLOOKUP(F78,Companies!$B$3:$M$1250,8,FALSE)<>\"\",VLOOKUP(F78,Companies!$B$3:$M$1250,8,FALSE),IF(VLOOKUP(F78,Companies!$B$3:$M$1250,10,FALSE)<>\"\",VLOOKUP(F78,Companies!$B$3:$M$1250,10,FALSE),\"\")))))","v":""},{"$f":"IF(VLOOKUP(F78,Companies!$B$3:$M$1250,3,FALSE)<>\"\",VLOOKUP(F78,Companies!$B$3:$M$1250,3,FALSE),IF(VLOOKUP(F78,Companies!$B$3:$M$1250,5,FALSE)<>\"\",VLOOKUP(F78,Companies!$B$3:$M$1250,5,FALSE),IF(VLOOKUP(F78,Companies!$B$3:$M$1250,7,FALSE)<>\"\",VLOOKUP(F78,Companies!$B$3:$M$1250,7,FALSE),IF(VLOOKUP(F78,Companies!$B$3:$M$1250,9,FALSE)<>\"\",VLOOKUP(F78,Companies!$B$3:$M$1250,9,FALSE),IF(VLOOKUP(F78,Companies!$B$3:$M$1250,11,FALSE)<>\"\",VLOOKUP(F78,Companies!$B$3:$M$1250,11,FALSE),\"\")))))","v":""},{"$f":"IF(VLOOKUP(F78,Companies!$B$3:$M$1250,12,FALSE)<>\"\",VLOOKUP(F78,Companies!$B$3:$M$1250,12,FALSE),\"\")","v":""}]
[{"$nulls":3},"VSFR","411GEMINICORPORATION","GEMINI CORPORATION NV","2019-05-31","2019-06-30","Invoice","FA19050164",{"v":423.34,"d":"423.34 €"},{"$f":"IF(VLOOKUP(F79,Companies!$B$3:$M$1250,2,FALSE)<>\"\",VLOOKUP(F79,Companies!$B$3:$M$1250,2,FALSE),IF(VLOOKUP(F79,Companies!$B$3:$M$1250,4,FALSE)<>\"\",VLOOKUP(F79,Companies!$B$3:$M$1250,4,FALSE),IF(VLOOKUP(F79,Companies!$B$3:$M$1250,6,FALSE)<>\"\",VLOOKUP(F79,Companies!$B$3:$M$1250,6,FALSE),IF(VLOOKUP(F79,Companies!$B$3:$M$1250,8,FALSE)<>\"\",VLOOKUP(F79,Companies!$B$3:$M$1250,8,FALSE),IF(VLOOKUP(F79,Companies!$B$3:$M$1250,10,FALSE)<>\"\",VLOOKUP(F79,Companies!$B$3:$M$1250,10,FALSE),\"\")))))","v":""},{"$f":"IF(VLOOKUP(F79,Companies!$B$3:$M$1250,3,FALSE)<>\"\",VLOOKUP(F79,Companies!$B$3:$M$1250,3,FALSE),IF(VLOOKUP(F79,Companies!$B$3:$M$1250,5,FALSE)<>\"\",VLOOKUP(F79,Companies!$B$3:$M$1250,5,FALSE),IF(VLOOKUP(F79,Companies!$B$3:$M$1250,7,FALSE)<>\"\",VLOOKUP(F79,Companies!$B$3:$M$1250,7,FALSE),IF(VLOOKUP(F79,Companies!$B$3:$M$1250,9,FALSE)<>\"\",VLOOKUP(F79,Companies!$B$3:$M$1250,9,FALSE),IF(VLOOKUP(F79,Companies!$B$3:$M$1250,11,FALSE)<>\"\",VLOOKUP(F79,Companies!$B$3:$M$1250,11,FALSE),\"\")))))","v":""},{"$f":"IF(VLOOKUP(F79,Companies!$B$3:$M$1250,12,FALSE)<>\"\",VLOOKUP(F79,Companies!$B$3:$M$1250,12,FALSE),\"\")","v":""}]
[{"$nulls":3},"VSFR","411GRAINCOMGMBH","GRAINCOM GMBH","2019-02-28","2019-03-30","Invoice","19.02.0115",{"v":1105.01,"d":"1,105.01 €"},{"$f":"IF(VLOOKUP(F80,Companies!$B$3:$M$1250,2,FALSE)<>\"\",VLOOKUP(F80,Companies!$B$3:$M$1250,2,FALSE),IF(VLOOKUP(F80,Companies!$B$3:$M$1250,4,FALSE)<>\"\",VLOOKUP(F80,Companies!$B$3:$M$1250,4,FALSE),IF(VLOOKUP(F80,Companies!$B$3:$M$1250,6,FALSE)<>\"\",VLOOKUP(F80,Companies!$B$3:$M$1250,6,FALSE),IF(VLOOKUP(F80,Companies!$B$3:$M$1250,8,FALSE)<>\"\",VLOOKUP(F80,Companies!$B$3:$M$1250,8,FALSE),IF(VLOOKUP(F80,Companies!$B$3:$M$1250,10,FALSE)<>\"\",VLOOKUP(F80,Companies!$B$3:$M$1250,10,FALSE),\"\")))))","v":""},{"$f":"IF(VLOOKUP(F80,Companies!$B$3:$M$1250,3,FALSE)<>\"\",VLOOKUP(F80,Companies!$B$3:$M$1250,3,FALSE),IF(VLOOKUP(F80,Companies!$B$3:$M$1250,5,FALSE)<>\"\",VLOOKUP(F80,Companies!$B$3:$M$1250,5,FALSE),IF(VLOOKUP(F80,Companies!$B$3:$M$1250,7,FALSE)<>\"\",VLOOKUP(F80,Companies!$B$3:$M$1250,7,FALSE),IF(VLOOKUP(F80,Companies!$B$3:$M$1250,9,FALSE)<>\"\",VLOOKUP(F80,Companies!$B$3:$M$1250,9,FALSE),IF(VLOOKUP(F80,Companies!$B$3:$M$1250,11,FALSE)<>\"\",VLOOKUP(F80,Companies!$B$3:$M$1250,11,FALSE),\"\")))))","v":""},{"$f":"IF(VLOOKUP(F80,Companies!$B$3:$M$1250,12,FALSE)<>\"\",VLOOKUP(F80,Companies!$B$3:$M$1250,12,FALSE),\"\")","v":""}]
[{"$nulls":3},"VSFR","411GRAINCOMGMBH","GRAINCOM GMBH","2019-05-31","2019-06-30","Invoice","FA19050073",{"v":871.67,"d":"871.67 €"},{"$f":"IF(VLOOKUP(F81,Companies!$B$3:$M$1250,2,FALSE)<>\"\",VLOOKUP(F81,Companies!$B$3:$M$1250,2,FALSE),IF(VLOOKUP(F81,Companies!$B$3:$M$1250,4,FALSE)<>\"\",VLOOKUP(F81,Companies!$B$3:$M$1250,4,FALSE),IF(VLOOKUP(F81,Companies!$B$3:$M$1250,6,FALSE)<>\"\",VLOOKUP(F81,Companies!$B$3:$M$1250,6,FALSE),IF(VLOOKUP(F81,Companies!$B$3:$M$1250,8,FALSE)<>\"\",VLOOKUP(F81,Companies!$B$3:$M$1250,8,FALSE),IF(VLOOKUP(F81,Companies!$B$3:$M$1250,10,FALSE)<>\"\",VLOOKUP(F81,Companies!$B$3:$M$1250,10,FALSE),\"\")))))","v":""},{"$f":"IF(VLOOKUP(F81,Companies!$B$3:$M$1250,3,FALSE)<>\"\",VLOOKUP(F81,Companies!$B$3:$M$1250,3,FALSE),IF(VLOOKUP(F81,Companies!$B$3:$M$1250,5,FALSE)<>\"\",VLOOKUP(F81,Companies!$B$3:$M$1250,5,FALSE),IF(VLOOKUP(F81,Companies!$B$3:$M$1250,7,FALSE)<>\"\",VLOOKUP(F81,Companies!$B$3:$M$1250,7,FALSE),IF(VLOOKUP(F81,Companies!$B$3:$M$1250,9,FALSE)<>\"\",VLOOKUP(F81,Companies!$B$3:$M$1250,9,FALSE),IF(VLOOKUP(F81,Companies!$B$3:$M$1250,11,FALSE)<>\"\",VLOOKUP(F81,Companies!$B$3:$M$1250,11,FALSE),\"\")))))","v":""},{"$f":"IF(VLOOKUP(F81,Companies!$B$3:$M$1250,12,FALSE)<>\"\",VLOOKUP(F81,Companies!$B$3:$M$1250,12,FALSE),\"\")","v":""}]
[{"$nulls":3},"VSUK","411HGCREATIONS","Groupe F. Guarino Design SAS","2019-04-18","2019-04-18","Invoice","04.19.0003",{"v":118.34,"d":"118.34 €"},{"$f":"IF(VLOOKUP(F82,Companies!$B$3:$M$1250,2,FALSE)<>\"\",VLOOKUP(F82,Companies!$B$3:$M$1250,2,FALSE),IF(VLOOKUP(F82,Companies!$B$3:$M$1250,4,FALSE)<>\"\",VLOOKUP(F82,Companies!$B$3:$M$1250,4,FALSE),IF(VLOOKUP(F82,Companies!$B$3:$M$1250,6,FALSE)<>\"\",VLOOKUP(F82,Companies!$B$3:$M$1250,6,FALSE),IF(VLOOKUP(F82,Companies!$B$3:$M$1250,8,FALSE)<>\"\",VLOOKUP(F82,Companies!$B$3:$M$1250,8,FALSE),IF(VLOOKUP(F82,Companies!$B$3:$M$1250,10,FALSE)<>\"\",VLOOKUP(F82,Companies!$B$3:$M$1250,10,FALSE),\"\")))))","v":""},{"$f":"IF(VLOOKUP(F82,Companies!$B$3:$M$1250,3,FALSE)<>\"\",VLOOKUP(F82,Companies!$B$3:$M$1250,3,FALSE),IF(VLOOKUP(F82,Companies!$B$3:$M$1250,5,FALSE)<>\"\",VLOOKUP(F82,Companies!$B$3:$M$1250,5,FALSE),IF(VLOOKUP(F82,Companies!$B$3:$M$1250,7,FALSE)<>\"\",VLOOKUP(F82,Companies!$B$3:$M$1250,7,FALSE),IF(VLOOKUP(F82,Companies!$B$3:$M$1250,9,FALSE)<>\"\",VLOOKUP(F82,Companies!$B$3:$M$1250,9,FALSE),IF(VLOOKUP(F82,Companies!$B$3:$M$1250,11,FALSE)<>\"\",VLOOKUP(F82,Companies!$B$3:$M$1250,11,FALSE),\"\")))))","v":""},{"$f":"IF(VLOOKUP(F82,Companies!$B$3:$M$1250,12,FALSE)<>\"\",VLOOKUP(F82,Companies!$B$3:$M$1250,12,FALSE),\"\")","v":""}]
[{"$nulls":3},"VSFR","411GUERBETSA","Guerbet SA","2019-04-30","2019-05-30","Invoice","19.04.0103",{"v":44,"d":"44.00 €"},{"$f":"IF(VLOOKUP(F83,Companies!$B$3:$M$1250,2,FALSE)<>\"\",VLOOKUP(F83,Companies!$B$3:$M$1250,2,FALSE),IF(VLOOKUP(F83,Companies!$B$3:$M$1250,4,FALSE)<>\"\",VLOOKUP(F83,Companies!$B$3:$M$1250,4,FALSE),IF(VLOOKUP(F83,Companies!$B$3:$M$1250,6,FALSE)<>\"\",VLOOKUP(F83,Companies!$B$3:$M$1250,6,FALSE),IF(VLOOKUP(F83,Companies!$B$3:$M$1250,8,FALSE)<>\"\",VLOOKUP(F83,Companies!$B$3:$M$1250,8,FALSE),IF(VLOOKUP(F83,Companies!$B$3:$M$1250,10,FALSE)<>\"\",VLOOKUP(F83,Companies!$B$3:$M$1250,10,FALSE),\"\")))))","v":""},{"$f":"IF(VLOOKUP(F83,Companies!$B$3:$M$1250,3,FALSE)<>\"\",VLOOKUP(F83,Companies!$B$3:$M$1250,3,FALSE),IF(VLOOKUP(F83,Companies!$B$3:$M$1250,5,FALSE)<>\"\",VLOOKUP(F83,Companies!$B$3:$M$1250,5,FALSE),IF(VLOOKUP(F83,Companies!$B$3:$M$1250,7,FALSE)<>\"\",VLOOKUP(F83,Companies!$B$3:$M$1250,7,FALSE),IF(VLOOKUP(F83,Companies!$B$3:$M$1250,9,FALSE)<>\"\",VLOOKUP(F83,Companies!$B$3:$M$1250,9,FALSE),IF(VLOOKUP(F83,Companies!$B$3:$M$1250,11,FALSE)<>\"\",VLOOKUP(F83,Companies!$B$3:$M$1250,11,FALSE),\"\")))))","v":""},{"$f":"IF(VLOOKUP(F83,Companies!$B$3:$M$1250,12,FALSE)<>\"\",VLOOKUP(F83,Companies!$B$3:$M$1250,12,FALSE),\"\")","v":""}]
[{"$nulls":3},"VSFR","411GULFPOLYMERSDISTR","Gulf Polymers Distribution Company FZCO","2019-05-31","2019-06-30","Invoice","FA19050139",{"v":676.97,"d":"676.97 €"},{"$f":"IF(VLOOKUP(F84,Companies!$B$3:$M$1250,2,FALSE)<>\"\",VLOOKUP(F84,Companies!$B$3:$M$1250,2,FALSE),IF(VLOOKUP(F84,Companies!$B$3:$M$1250,4,FALSE)<>\"\",VLOOKUP(F84,Companies!$B$3:$M$1250,4,FALSE),IF(VLOOKUP(F84,Companies!$B$3:$M$1250,6,FALSE)<>\"\",VLOOKUP(F84,Companies!$B$3:$M$1250,6,FALSE),IF(VLOOKUP(F84,Companies!$B$3:$M$1250,8,FALSE)<>\"\",VLOOKUP(F84,Companies!$B$3:$M$1250,8,FALSE),IF(VLOOKUP(F84,Companies!$B$3:$M$1250,10,FALSE)<>\"\",VLOOKUP(F84,Companies!$B$3:$M$1250,10,FALSE),\"\")))))","v":""},{"$f":"IF(VLOOKUP(F84,Companies!$B$3:$M$1250,3,FALSE)<>\"\",VLOOKUP(F84,Companies!$B$3:$M$1250,3,FALSE),IF(VLOOKUP(F84,Companies!$B$3:$M$1250,5,FALSE)<>\"\",VLOOKUP(F84,Companies!$B$3:$M$1250,5,FALSE),IF(VLOOKUP(F84,Companies!$B$3:$M$1250,7,FALSE)<>\"\",VLOOKUP(F84,Companies!$B$3:$M$1250,7,FALSE),IF(VLOOKUP(F84,Companies!$B$3:$M$1250,9,FALSE)<>\"\",VLOOKUP(F84,Companies!$B$3:$M$1250,9,FALSE),IF(VLOOKUP(F84,Companies!$B$3:$M$1250,11,FALSE)<>\"\",VLOOKUP(F84,Companies!$B$3:$M$1250,11,FALSE),\"\")))))","v":""},{"$f":"IF(VLOOKUP(F84,Companies!$B$3:$M$1250,12,FALSE)<>\"\",VLOOKUP(F84,Companies!$B$3:$M$1250,12,FALSE),\"\")","v":""}]
[{"$nulls":3},"VSFR","411GULFPOLYMERSDISTR","Gulf Polymers Distribution Company FZCO","2019-05-31","2019-06-30","Invoice","FA19050144",{"v":1121.33,"d":"1,121.33 €"},{"$f":"IF(VLOOKUP(F85,Companies!$B$3:$M$1250,2,FALSE)<>\"\",VLOOKUP(F85,Companies!$B$3:$M$1250,2,FALSE),IF(VLOOKUP(F85,Companies!$B$3:$M$1250,4,FALSE)<>\"\",VLOOKUP(F85,Companies!$B$3:$M$1250,4,FALSE),IF(VLOOKUP(F85,Companies!$B$3:$M$1250,6,FALSE)<>\"\",VLOOKUP(F85,Companies!$B$3:$M$1250,6,FALSE),IF(VLOOKUP(F85,Companies!$B$3:$M$1250,8,FALSE)<>\"\",VLOOKUP(F85,Companies!$B$3:$M$1250,8,FALSE),IF(VLOOKUP(F85,Companies!$B$3:$M$1250,10,FALSE)<>\"\",VLOOKUP(F85,Companies!$B$3:$M$1250,10,FALSE),\"\")))))","v":""},{"$f":"IF(VLOOKUP(F85,Companies!$B$3:$M$1250,3,FALSE)<>\"\",VLOOKUP(F85,Companies!$B$3:$M$1250,3,FALSE),IF(VLOOKUP(F85,Companies!$B$3:$M$1250,5,FALSE)<>\"\",VLOOKUP(F85,Companies!$B$3:$M$1250,5,FALSE),IF(VLOOKUP(F85,Companies!$B$3:$M$1250,7,FALSE)<>\"\",VLOOKUP(F85,Companies!$B$3:$M$1250,7,FALSE),IF(VLOOKUP(F85,Companies!$B$3:$M$1250,9,FALSE)<>\"\",VLOOKUP(F85,Companies!$B$3:$M$1250,9,FALSE),IF(VLOOKUP(F85,Companies!$B$3:$M$1250,11,FALSE)<>\"\",VLOOKUP(F85,Companies!$B$3:$M$1250,11,FALSE),\"\")))))","v":""},{"$f":"IF(VLOOKUP(F85,Companies!$B$3:$M$1250,12,FALSE)<>\"\",VLOOKUP(F85,Companies!$B$3:$M$1250,12,FALSE),\"\")","v":""}]
[{"$nulls":3},"VSFR","411GULFPOLYMERSDISTR","Gulf Polymers Distribution Company FZCO","2019-05-31","2019-06-30","Invoice","FA19050145",{"v":2785.01,"d":"2,785.01 €"},{"$f":"IF(VLOOKUP(F86,Companies!$B$3:$M$1250,2,FALSE)<>\"\",VLOOKUP(F86,Companies!$B$3:$M$1250,2,FALSE),IF(VLOOKUP(F86,Companies!$B$3:$M$1250,4,FALSE)<>\"\",VLOOKUP(F86,Companies!$B$3:$M$1250,4,FALSE),IF(VLOOKUP(F86,Companies!$B$3:$M$1250,6,FALSE)<>\"\",VLOOKUP(F86,Companies!$B$3:$M$1250,6,FALSE),IF(VLOOKUP(F86,Companies!$B$3:$M$1250,8,FALSE)<>\"\",VLOOKUP(F86,Companies!$B$3:$M$1250,8,FALSE),IF(VLOOKUP(F86,Companies!$B$3:$M$1250,10,FALSE)<>\"\",VLOOKUP(F86,Companies!$B$3:$M$1250,10,FALSE),\"\")))))","v":""},{"$f":"IF(VLOOKUP(F86,Companies!$B$3:$M$1250,3,FALSE)<>\"\",VLOOKUP(F86,Companies!$B$3:$M$1250,3,FALSE),IF(VLOOKUP(F86,Companies!$B$3:$M$1250,5,FALSE)<>\"\",VLOOKUP(F86,Companies!$B$3:$M$1250,5,FALSE),IF(VLOOKUP(F86,Companies!$B$3:$M$1250,7,FALSE)<>\"\",VLOOKUP(F86,Companies!$B$3:$M$1250,7,FALSE),IF(VLOOKUP(F86,Companies!$B$3:$M$1250,9,FALSE)<>\"\",VLOOKUP(F86,Companies!$B$3:$M$1250,9,FALSE),IF(VLOOKUP(F86,Companies!$B$3:$M$1250,11,FALSE)<>\"\",VLOOKUP(F86,Companies!$B$3:$M$1250,11,FALSE),\"\")))))","v":""},{"$f":"IF(VLOOKUP(F86,Companies!$B$3:$M$1250,12,FALSE)<>\"\",VLOOKUP(F86,Companies!$B$3:$M$1250,12,FALSE),\"\")","v":""}]
[{"$nulls":3},"VSPT","C000381083","H.B. Fuller Adhesives France SAS ","2019-05-31","2019-06-30","Invoice","FA 2019/61",{"v":18629.94,"d":"18,629.94 €"},{"$f":"IF(VLOOKUP(F87,Companies!$B$3:$M$1250,2,FALSE)<>\"\",VLOOKUP(F87,Companies!$B$3:$M$1250,2,FALSE),IF(VLOOKUP(F87,Companies!$B$3:$M$1250,4,FALSE)<>\"\",VLOOKUP(F87,Companies!$B$3:$M$1250,4,FALSE),IF(VLOOKUP(F87,Companies!$B$3:$M$1250,6,FALSE)<>\"\",VLOOKUP(F87,Companies!$B$3:$M$1250,6,FALSE),IF(VLOOKUP(F87,Companies!$B$3:$M$1250,8,FALSE)<>\"\",VLOOKUP(F87,Companies!$B$3:$M$1250,8,FALSE),IF(VLOOKUP(F87,Companies!$B$3:$M$1250,10,FALSE)<>\"\",VLOOKUP(F87,Companies!$B$3:$M$1250,10,FALSE),\"\")))))","v":""},{"$f":"IF(VLOOKUP(F87,Companies!$B$3:$M$1250,3,FALSE)<>\"\",VLOOKUP(F87,Companies!$B$3:$M$1250,3,FALSE),IF(VLOOKUP(F87,Companies!$B$3:$M$1250,5,FALSE)<>\"\",VLOOKUP(F87,Companies!$B$3:$M$1250,5,FALSE),IF(VLOOKUP(F87,Companies!$B$3:$M$1250,7,FALSE)<>\"\",VLOOKUP(F87,Companies!$B$3:$M$1250,7,FALSE),IF(VLOOKUP(F87,Companies!$B$3:$M$1250,9,FALSE)<>\"\",VLOOKUP(F87,Companies!$B$3:$M$1250,9,FALSE),IF(VLOOKUP(F87,Companies!$B$3:$M$1250,11,FALSE)<>\"\",VLOOKUP(F87,Companies!$B$3:$M$1250,11,FALSE),\"\")))))","v":""},{"$f":"IF(VLOOKUP(F87,Companies!$B$3:$M$1250,12,FALSE)<>\"\",VLOOKUP(F87,Companies!$B$3:$M$1250,12,FALSE),\"\")","v":""}]
[{"$nulls":3},"VSPT","C000381080","H.B. Fuller France SAS","2019-03-31","2019-04-30","Invoice","FA 2019/36",{"v":3209.34,"d":"3,209.34 €"},{"$f":"IF(VLOOKUP(F88,Companies!$B$3:$M$1250,2,FALSE)<>\"\",VLOOKUP(F88,Companies!$B$3:$M$1250,2,FALSE),IF(VLOOKUP(F88,Companies!$B$3:$M$1250,4,FALSE)<>\"\",VLOOKUP(F88,Companies!$B$3:$M$1250,4,FALSE),IF(VLOOKUP(F88,Companies!$B$3:$M$1250,6,FALSE)<>\"\",VLOOKUP(F88,Companies!$B$3:$M$1250,6,FALSE),IF(VLOOKUP(F88,Companies!$B$3:$M$1250,8,FALSE)<>\"\",VLOOKUP(F88,Companies!$B$3:$M$1250,8,FALSE),IF(VLOOKUP(F88,Companies!$B$3:$M$1250,10,FALSE)<>\"\",VLOOKUP(F88,Companies!$B$3:$M$1250,10,FALSE),\"\")))))","v":""},{"$f":"IF(VLOOKUP(F88,Companies!$B$3:$M$1250,3,FALSE)<>\"\",VLOOKUP(F88,Companies!$B$3:$M$1250,3,FALSE),IF(VLOOKUP(F88,Companies!$B$3:$M$1250,5,FALSE)<>\"\",VLOOKUP(F88,Companies!$B$3:$M$1250,5,FALSE),IF(VLOOKUP(F88,Companies!$B$3:$M$1250,7,FALSE)<>\"\",VLOOKUP(F88,Companies!$B$3:$M$1250,7,FALSE),IF(VLOOKUP(F88,Companies!$B$3:$M$1250,9,FALSE)<>\"\",VLOOKUP(F88,Companies!$B$3:$M$1250,9,FALSE),IF(VLOOKUP(F88,Companies!$B$3:$M$1250,11,FALSE)<>\"\",VLOOKUP(F88,Companies!$B$3:$M$1250,11,FALSE),\"\")))))","v":""},{"$f":"IF(VLOOKUP(F88,Companies!$B$3:$M$1250,12,FALSE)<>\"\",VLOOKUP(F88,Companies!$B$3:$M$1250,12,FALSE),\"\")","v":""}]
[{"$nulls":3},"VSPT","C000381080","H.B. Fuller France SAS","2019-04-30","2019-05-30","Invoice","FA 2019/45",{"v":6200.55,"d":"6,200.55 €"},{"$f":"IF(VLOOKUP(F89,Companies!$B$3:$M$1250,2,FALSE)<>\"\",VLOOKUP(F89,Companies!$B$3:$M$1250,2,FALSE),IF(VLOOKUP(F89,Companies!$B$3:$M$1250,4,FALSE)<>\"\",VLOOKUP(F89,Companies!$B$3:$M$1250,4,FALSE),IF(VLOOKUP(F89,Companies!$B$3:$M$1250,6,FALSE)<>\"\",VLOOKUP(F89,Companies!$B$3:$M$1250,6,FALSE),IF(VLOOKUP(F89,Companies!$B$3:$M$1250,8,FALSE)<>\"\",VLOOKUP(F89,Companies!$B$3:$M$1250,8,FALSE),IF(VLOOKUP(F89,Companies!$B$3:$M$1250,10,FALSE)<>\"\",VLOOKUP(F89,Companies!$B$3:$M$1250,10,FALSE),\"\")))))","v":""},{"$f":"IF(VLOOKUP(F89,Companies!$B$3:$M$1250,3,FALSE)<>\"\",VLOOKUP(F89,Companies!$B$3:$M$1250,3,FALSE),IF(VLOOKUP(F89,Companies!$B$3:$M$1250,5,FALSE)<>\"\",VLOOKUP(F89,Companies!$B$3:$M$1250,5,FALSE),IF(VLOOKUP(F89,Companies!$B$3:$M$1250,7,FALSE)<>\"\",VLOOKUP(F89,Companies!$B$3:$M$1250,7,FALSE),IF(VLOOKUP(F89,Companies!$B$3:$M$1250,9,FALSE)<>\"\",VLOOKUP(F89,Companies!$B$3:$M$1250,9,FALSE),IF(VLOOKUP(F89,Companies!$B$3:$M$1250,11,FALSE)<>\"\",VLOOKUP(F89,Companies!$B$3:$M$1250,11,FALSE),\"\")))))","v":""},{"$f":"IF(VLOOKUP(F89,Companies!$B$3:$M$1250,12,FALSE)<>\"\",VLOOKUP(F89,Companies!$B$3:$M$1250,12,FALSE),\"\")","v":""}]
[{"$nulls":3},"VSPT","C000381080","H.B. Fuller France SAS","2019-05-22","2019-05-22","Credit Note","NC 2019/7",{"v":-677.69,"d":"-677.69 €"},{"$f":"IF(VLOOKUP(F90,Companies!$B$3:$M$1250,2,FALSE)<>\"\",VLOOKUP(F90,Companies!$B$3:$M$1250,2,FALSE),IF(VLOOKUP(F90,Companies!$B$3:$M$1250,4,FALSE)<>\"\",VLOOKUP(F90,Companies!$B$3:$M$1250,4,FALSE),IF(VLOOKUP(F90,Companies!$B$3:$M$1250,6,FALSE)<>\"\",VLOOKUP(F90,Companies!$B$3:$M$1250,6,FALSE),IF(VLOOKUP(F90,Companies!$B$3:$M$1250,8,FALSE)<>\"\",VLOOKUP(F90,Companies!$B$3:$M$1250,8,FALSE),IF(VLOOKUP(F90,Companies!$B$3:$M$1250,10,FALSE)<>\"\",VLOOKUP(F90,Companies!$B$3:$M$1250,10,FALSE),\"\")))))","v":""},{"$f":"IF(VLOOKUP(F90,Companies!$B$3:$M$1250,3,FALSE)<>\"\",VLOOKUP(F90,Companies!$B$3:$M$1250,3,FALSE),IF(VLOOKUP(F90,Companies!$B$3:$M$1250,5,FALSE)<>\"\",VLOOKUP(F90,Companies!$B$3:$M$1250,5,FALSE),IF(VLOOKUP(F90,Companies!$B$3:$M$1250,7,FALSE)<>\"\",VLOOKUP(F90,Companies!$B$3:$M$1250,7,FALSE),IF(VLOOKUP(F90,Companies!$B$3:$M$1250,9,FALSE)<>\"\",VLOOKUP(F90,Companies!$B$3:$M$1250,9,FALSE),IF(VLOOKUP(F90,Companies!$B$3:$M$1250,11,FALSE)<>\"\",VLOOKUP(F90,Companies!$B$3:$M$1250,11,FALSE),\"\")))))","v":""},{"$f":"IF(VLOOKUP(F90,Companies!$B$3:$M$1250,12,FALSE)<>\"\",VLOOKUP(F90,Companies!$B$3:$M$1250,12,FALSE),\"\")","v":""}]
[{"$nulls":3},"VSUK","411HOMEDESIGNINTERNA","Home Design international  Ltd","2018-06-30","2018-07-30","Invoice","06.18.0042",{"v":1800,"d":"1,800.00 €"},{"$f":"IF(VLOOKUP(F91,Companies!$B$3:$M$1250,2,FALSE)<>\"\",VLOOKUP(F91,Companies!$B$3:$M$1250,2,FALSE),IF(VLOOKUP(F91,Companies!$B$3:$M$1250,4,FALSE)<>\"\",VLOOKUP(F91,Companies!$B$3:$M$1250,4,FALSE),IF(VLOOKUP(F91,Companies!$B$3:$M$1250,6,FALSE)<>\"\",VLOOKUP(F91,Companies!$B$3:$M$1250,6,FALSE),IF(VLOOKUP(F91,Companies!$B$3:$M$1250,8,FALSE)<>\"\",VLOOKUP(F91,Companies!$B$3:$M$1250,8,FALSE),IF(VLOOKUP(F91,Companies!$B$3:$M$1250,10,FALSE)<>\"\",VLOOKUP(F91,Companies!$B$3:$M$1250,10,FALSE),\"\")))))","v":""},{"$f":"IF(VLOOKUP(F91,Companies!$B$3:$M$1250,3,FALSE)<>\"\",VLOOKUP(F91,Companies!$B$3:$M$1250,3,FALSE),IF(VLOOKUP(F91,Companies!$B$3:$M$1250,5,FALSE)<>\"\",VLOOKUP(F91,Companies!$B$3:$M$1250,5,FALSE),IF(VLOOKUP(F91,Companies!$B$3:$M$1250,7,FALSE)<>\"\",VLOOKUP(F91,Companies!$B$3:$M$1250,7,FALSE),IF(VLOOKUP(F91,Companies!$B$3:$M$1250,9,FALSE)<>\"\",VLOOKUP(F91,Companies!$B$3:$M$1250,9,FALSE),IF(VLOOKUP(F91,Companies!$B$3:$M$1250,11,FALSE)<>\"\",VLOOKUP(F91,Companies!$B$3:$M$1250,11,FALSE),\"\")))))","v":""},{"$f":"IF(VLOOKUP(F91,Companies!$B$3:$M$1250,12,FALSE)<>\"\",VLOOKUP(F91,Companies!$B$3:$M$1250,12,FALSE),\"\")","v":""}]
[{"$nulls":3},"VSUK","411HOMEDESIGNINTERNA","Home Design international  Ltd","2018-07-31","2018-08-30","Invoice","07.18.0018",{"v":126,"d":"126.00 €"},{"$f":"IF(VLOOKUP(F92,Companies!$B$3:$M$1250,2,FALSE)<>\"\",VLOOKUP(F92,Companies!$B$3:$M$1250,2,FALSE),IF(VLOOKUP(F92,Companies!$B$3:$M$1250,4,FALSE)<>\"\",VLOOKUP(F92,Companies!$B$3:$M$1250,4,FALSE),IF(VLOOKUP(F92,Companies!$B$3:$M$1250,6,FALSE)<>\"\",VLOOKUP(F92,Companies!$B$3:$M$1250,6,FALSE),IF(VLOOKUP(F92,Companies!$B$3:$M$1250,8,FALSE)<>\"\",VLOOKUP(F92,Companies!$B$3:$M$1250,8,FALSE),IF(VLOOKUP(F92,Companies!$B$3:$M$1250,10,FALSE)<>\"\",VLOOKUP(F92,Companies!$B$3:$M$1250,10,FALSE),\"\")))))","v":""},{"$f":"IF(VLOOKUP(F92,Companies!$B$3:$M$1250,3,FALSE)<>\"\",VLOOKUP(F92,Companies!$B$3:$M$1250,3,FALSE),IF(VLOOKUP(F92,Companies!$B$3:$M$1250,5,FALSE)<>\"\",VLOOKUP(F92,Companies!$B$3:$M$1250,5,FALSE),IF(VLOOKUP(F92,Companies!$B$3:$M$1250,7,FALSE)<>\"\",VLOOKUP(F92,Companies!$B$3:$M$1250,7,FALSE),IF(VLOOKUP(F92,Companies!$B$3:$M$1250,9,FALSE)<>\"\",VLOOKUP(F92,Companies!$B$3:$M$1250,9,FALSE),IF(VLOOKUP(F92,Companies!$B$3:$M$1250,11,FALSE)<>\"\",VLOOKUP(F92,Companies!$B$3:$M$1250,11,FALSE),\"\")))))","v":""},{"$f":"IF(VLOOKUP(F92,Companies!$B$3:$M$1250,12,FALSE)<>\"\",VLOOKUP(F92,Companies!$B$3:$M$1250,12,FALSE),\"\")","v":""}]
[{"$nulls":3},"VSUK","411HOMEDESIGNINTERNA","Home Design international  Ltd","2018-08-31","2018-09-30","Invoice","08.18.0051",{"v":176.95,"d":"176.95 €"},{"$f":"IF(VLOOKUP(F93,Companies!$B$3:$M$1250,2,FALSE)<>\"\",VLOOKUP(F93,Companies!$B$3:$M$1250,2,FALSE),IF(VLOOKUP(F93,Companies!$B$3:$M$1250,4,FALSE)<>\"\",VLOOKUP(F93,Companies!$B$3:$M$1250,4,FALSE),IF(VLOOKUP(F93,Companies!$B$3:$M$1250,6,FALSE)<>\"\",VLOOKUP(F93,Companies!$B$3:$M$1250,6,FALSE),IF(VLOOKUP(F93,Companies!$B$3:$M$1250,8,FALSE)<>\"\",VLOOKUP(F93,Companies!$B$3:$M$1250,8,FALSE),IF(VLOOKUP(F93,Companies!$B$3:$M$1250,10,FALSE)<>\"\",VLOOKUP(F93,Companies!$B$3:$M$1250,10,FALSE),\"\")))))","v":""},{"$f":"IF(VLOOKUP(F93,Companies!$B$3:$M$1250,3,FALSE)<>\"\",VLOOKUP(F93,Companies!$B$3:$M$1250,3,FALSE),IF(VLOOKUP(F93,Companies!$B$3:$M$1250,5,FALSE)<>\"\",VLOOKUP(F93,Companies!$B$3:$M$1250,5,FALSE),IF(VLOOKUP(F93,Companies!$B$3:$M$1250,7,FALSE)<>\"\",VLOOKUP(F93,Companies!$B$3:$M$1250,7,FALSE),IF(VLOOKUP(F93,Companies!$B$3:$M$1250,9,FALSE)<>\"\",VLOOKUP(F93,Companies!$B$3:$M$1250,9,FALSE),IF(VLOOKUP(F93,Companies!$B$3:$M$1250,11,FALSE)<>\"\",VLOOKUP(F93,Companies!$B$3:$M$1250,11,FALSE),\"\")))))","v":""},{"$f":"IF(VLOOKUP(F93,Companies!$B$3:$M$1250,12,FALSE)<>\"\",VLOOKUP(F93,Companies!$B$3:$M$1250,12,FALSE),\"\")","v":""}]
[{"$nulls":3},"VSUK","411HOMEDESIGNINTERNA","Home Design international  Ltd","2018-10-31","2018-11-30","Invoice","10.18.0021",{"v":420,"d":"420.00 €"},{"$f":"IF(VLOOKUP(F94,Companies!$B$3:$M$1250,2,FALSE)<>\"\",VLOOKUP(F94,Companies!$B$3:$M$1250,2,FALSE),IF(VLOOKUP(F94,Companies!$B$3:$M$1250,4,FALSE)<>\"\",VLOOKUP(F94,Companies!$B$3:$M$1250,4,FALSE),IF(VLOOKUP(F94,Companies!$B$3:$M$1250,6,FALSE)<>\"\",VLOOKUP(F94,Companies!$B$3:$M$1250,6,FALSE),IF(VLOOKUP(F94,Companies!$B$3:$M$1250,8,FALSE)<>\"\",VLOOKUP(F94,Companies!$B$3:$M$1250,8,FALSE),IF(VLOOKUP(F94,Companies!$B$3:$M$1250,10,FALSE)<>\"\",VLOOKUP(F94,Companies!$B$3:$M$1250,10,FALSE),\"\")))))","v":""},{"$f":"IF(VLOOKUP(F94,Companies!$B$3:$M$1250,3,FALSE)<>\"\",VLOOKUP(F94,Companies!$B$3:$M$1250,3,FALSE),IF(VLOOKUP(F94,Companies!$B$3:$M$1250,5,FALSE)<>\"\",VLOOKUP(F94,Companies!$B$3:$M$1250,5,FALSE),IF(VLOOKUP(F94,Companies!$B$3:$M$1250,7,FALSE)<>\"\",VLOOKUP(F94,Companies!$B$3:$M$1250,7,FALSE),IF(VLOOKUP(F94,Companies!$B$3:$M$1250,9,FALSE)<>\"\",VLOOKUP(F94,Companies!$B$3:$M$1250,9,FALSE),IF(VLOOKUP(F94,Companies!$B$3:$M$1250,11,FALSE)<>\"\",VLOOKUP(F94,Companies!$B$3:$M$1250,11,FALSE),\"\")))))","v":""},{"$f":"IF(VLOOKUP(F94,Companies!$B$3:$M$1250,12,FALSE)<>\"\",VLOOKUP(F94,Companies!$B$3:$M$1250,12,FALSE),\"\")","v":""}]
[{"$nulls":3},"VSUK","411HOMEDESIGNINTERNA","Home Design international  Ltd","2018-11-30","2018-12-30","Invoice","11.18.0046",{"v":683.41,"d":"683.41 €"},{"$f":"IF(VLOOKUP(F95,Companies!$B$3:$M$1250,2,FALSE)<>\"\",VLOOKUP(F95,Companies!$B$3:$M$1250,2,FALSE),IF(VLOOKUP(F95,Companies!$B$3:$M$1250,4,FALSE)<>\"\",VLOOKUP(F95,Companies!$B$3:$M$1250,4,FALSE),IF(VLOOKUP(F95,Companies!$B$3:$M$1250,6,FALSE)<>\"\",VLOOKUP(F95,Companies!$B$3:$M$1250,6,FALSE),IF(VLOOKUP(F95,Companies!$B$3:$M$1250,8,FALSE)<>\"\",VLOOKUP(F95,Companies!$B$3:$M$1250,8,FALSE),IF(VLOOKUP(F95,Companies!$B$3:$M$1250,10,FALSE)<>\"\",VLOOKUP(F95,Companies!$B$3:$M$1250,10,FALSE),\"\")))))","v":""},{"$f":"IF(VLOOKUP(F95,Companies!$B$3:$M$1250,3,FALSE)<>\"\",VLOOKUP(F95,Companies!$B$3:$M$1250,3,FALSE),IF(VLOOKUP(F95,Companies!$B$3:$M$1250,5,FALSE)<>\"\",VLOOKUP(F95,Companies!$B$3:$M$1250,5,FALSE),IF(VLOOKUP(F95,Companies!$B$3:$M$1250,7,FALSE)<>\"\",VLOOKUP(F95,Companies!$B$3:$M$1250,7,FALSE),IF(VLOOKUP(F95,Companies!$B$3:$M$1250,9,FALSE)<>\"\",VLOOKUP(F95,Companies!$B$3:$M$1250,9,FALSE),IF(VLOOKUP(F95,Companies!$B$3:$M$1250,11,FALSE)<>\"\",VLOOKUP(F95,Companies!$B$3:$M$1250,11,FALSE),\"\")))))","v":""},{"$f":"IF(VLOOKUP(F95,Companies!$B$3:$M$1250,12,FALSE)<>\"\",VLOOKUP(F95,Companies!$B$3:$M$1250,12,FALSE),\"\")","v":""}]
[{"$nulls":3},"VSUK","411HOMEDESIGNINTERNA","Home Design international  Ltd","2018-12-31","2019-01-30","Invoice","12.18.0045",{"v":508.01,"d":"508.01 €"},{"$f":"IF(VLOOKUP(F96,Companies!$B$3:$M$1250,2,FALSE)<>\"\",VLOOKUP(F96,Companies!$B$3:$M$1250,2,FALSE),IF(VLOOKUP(F96,Companies!$B$3:$M$1250,4,FALSE)<>\"\",VLOOKUP(F96,Companies!$B$3:$M$1250,4,FALSE),IF(VLOOKUP(F96,Companies!$B$3:$M$1250,6,FALSE)<>\"\",VLOOKUP(F96,Companies!$B$3:$M$1250,6,FALSE),IF(VLOOKUP(F96,Companies!$B$3:$M$1250,8,FALSE)<>\"\",VLOOKUP(F96,Companies!$B$3:$M$1250,8,FALSE),IF(VLOOKUP(F96,Companies!$B$3:$M$1250,10,FALSE)<>\"\",VLOOKUP(F96,Companies!$B$3:$M$1250,10,FALSE),\"\")))))","v":""},{"$f":"IF(VLOOKUP(F96,Companies!$B$3:$M$1250,3,FALSE)<>\"\",VLOOKUP(F96,Companies!$B$3:$M$1250,3,FALSE),IF(VLOOKUP(F96,Companies!$B$3:$M$1250,5,FALSE)<>\"\",VLOOKUP(F96,Companies!$B$3:$M$1250,5,FALSE),IF(VLOOKUP(F96,Companies!$B$3:$M$1250,7,FALSE)<>\"\",VLOOKUP(F96,Companies!$B$3:$M$1250,7,FALSE),IF(VLOOKUP(F96,Companies!$B$3:$M$1250,9,FALSE)<>\"\",VLOOKUP(F96,Companies!$B$3:$M$1250,9,FALSE),IF(VLOOKUP(F96,Companies!$B$3:$M$1250,11,FALSE)<>\"\",VLOOKUP(F96,Companies!$B$3:$M$1250,11,FALSE),\"\")))))","v":""},{"$f":"IF(VLOOKUP(F96,Companies!$B$3:$M$1250,12,FALSE)<>\"\",VLOOKUP(F96,Companies!$B$3:$M$1250,12,FALSE),\"\")","v":""}]
[{"$nulls":3},"VSUK","411HOMEDESIGNINTERNA","Home Design international  Ltd","2019-01-31","2019-01-31","      ","OD-19-0051",{"v":60.78,"d":"60.78 €"},{"$f":"IF(VLOOKUP(F97,Companies!$B$3:$M$1250,2,FALSE)<>\"\",VLOOKUP(F97,Companies!$B$3:$M$1250,2,FALSE),IF(VLOOKUP(F97,Companies!$B$3:$M$1250,4,FALSE)<>\"\",VLOOKUP(F97,Companies!$B$3:$M$1250,4,FALSE),IF(VLOOKUP(F97,Companies!$B$3:$M$1250,6,FALSE)<>\"\",VLOOKUP(F97,Companies!$B$3:$M$1250,6,FALSE),IF(VLOOKUP(F97,Companies!$B$3:$M$1250,8,FALSE)<>\"\",VLOOKUP(F97,Companies!$B$3:$M$1250,8,FALSE),IF(VLOOKUP(F97,Companies!$B$3:$M$1250,10,FALSE)<>\"\",VLOOKUP(F97,Companies!$B$3:$M$1250,10,FALSE),\"\")))))","v":""},{"$f":"IF(VLOOKUP(F97,Companies!$B$3:$M$1250,3,FALSE)<>\"\",VLOOKUP(F97,Companies!$B$3:$M$1250,3,FALSE),IF(VLOOKUP(F97,Companies!$B$3:$M$1250,5,FALSE)<>\"\",VLOOKUP(F97,Companies!$B$3:$M$1250,5,FALSE),IF(VLOOKUP(F97,Companies!$B$3:$M$1250,7,FALSE)<>\"\",VLOOKUP(F97,Companies!$B$3:$M$1250,7,FALSE),IF(VLOOKUP(F97,Companies!$B$3:$M$1250,9,FALSE)<>\"\",VLOOKUP(F97,Companies!$B$3:$M$1250,9,FALSE),IF(VLOOKUP(F97,Companies!$B$3:$M$1250,11,FALSE)<>\"\",VLOOKUP(F97,Companies!$B$3:$M$1250,11,FALSE),\"\")))))","v":""},{"$f":"IF(VLOOKUP(F97,Companies!$B$3:$M$1250,12,FALSE)<>\"\",VLOOKUP(F97,Companies!$B$3:$M$1250,12,FALSE),\"\")","v":""}]
[{"$nulls":3},"VSFR","411HUBERTRICOTGESELL","Huber Tricot Gesellschaft GmbH","2019-03-31","2019-04-30","Invoice","19.03.0051",{"v":420,"d":"420.00 €"},{"$f":"IF(VLOOKUP(F98,Companies!$B$3:$M$1250,2,FALSE)<>\"\",VLOOKUP(F98,Companies!$B$3:$M$1250,2,FALSE),IF(VLOOKUP(F98,Companies!$B$3:$M$1250,4,FALSE)<>\"\",VLOOKUP(F98,Companies!$B$3:$M$1250,4,FALSE),IF(VLOOKUP(F98,Companies!$B$3:$M$1250,6,FALSE)<>\"\",VLOOKUP(F98,Companies!$B$3:$M$1250,6,FALSE),IF(VLOOKUP(F98,Companies!$B$3:$M$1250,8,FALSE)<>\"\",VLOOKUP(F98,Companies!$B$3:$M$1250,8,FALSE),IF(VLOOKUP(F98,Companies!$B$3:$M$1250,10,FALSE)<>\"\",VLOOKUP(F98,Companies!$B$3:$M$1250,10,FALSE),\"\")))))","v":""},{"$f":"IF(VLOOKUP(F98,Companies!$B$3:$M$1250,3,FALSE)<>\"\",VLOOKUP(F98,Companies!$B$3:$M$1250,3,FALSE),IF(VLOOKUP(F98,Companies!$B$3:$M$1250,5,FALSE)<>\"\",VLOOKUP(F98,Companies!$B$3:$M$1250,5,FALSE),IF(VLOOKUP(F98,Companies!$B$3:$M$1250,7,FALSE)<>\"\",VLOOKUP(F98,Companies!$B$3:$M$1250,7,FALSE),IF(VLOOKUP(F98,Companies!$B$3:$M$1250,9,FALSE)<>\"\",VLOOKUP(F98,Companies!$B$3:$M$1250,9,FALSE),IF(VLOOKUP(F98,Companies!$B$3:$M$1250,11,FALSE)<>\"\",VLOOKUP(F98,Companies!$B$3:$M$1250,11,FALSE),\"\")))))","v":""},{"$f":"IF(VLOOKUP(F98,Companies!$B$3:$M$1250,12,FALSE)<>\"\",VLOOKUP(F98,Companies!$B$3:$M$1250,12,FALSE),\"\")","v":""}]
[{"$nulls":3},"VSFR","411HUBER-SHOPGMBH","Huber-Shop GmbH","2019-05-31","2019-06-30","Invoice","FA19050176",{"v":2045.83,"d":"2,045.83 €"},{"$f":"IF(VLOOKUP(F99,Companies!$B$3:$M$1250,2,FALSE)<>\"\",VLOOKUP(F99,Companies!$B$3:$M$1250,2,FALSE),IF(VLOOKUP(F99,Companies!$B$3:$M$1250,4,FALSE)<>\"\",VLOOKUP(F99,Companies!$B$3:$M$1250,4,FALSE),IF(VLOOKUP(F99,Companies!$B$3:$M$1250,6,FALSE)<>\"\",VLOOKUP(F99,Companies!$B$3:$M$1250,6,FALSE),IF(VLOOKUP(F99,Companies!$B$3:$M$1250,8,FALSE)<>\"\",VLOOKUP(F99,Companies!$B$3:$M$1250,8,FALSE),IF(VLOOKUP(F99,Companies!$B$3:$M$1250,10,FALSE)<>\"\",VLOOKUP(F99,Companies!$B$3:$M$1250,10,FALSE),\"\")))))","v":""},{"$f":"IF(VLOOKUP(F99,Companies!$B$3:$M$1250,3,FALSE)<>\"\",VLOOKUP(F99,Companies!$B$3:$M$1250,3,FALSE),IF(VLOOKUP(F99,Companies!$B$3:$M$1250,5,FALSE)<>\"\",VLOOKUP(F99,Companies!$B$3:$M$1250,5,FALSE),IF(VLOOKUP(F99,Companies!$B$3:$M$1250,7,FALSE)<>\"\",VLOOKUP(F99,Companies!$B$3:$M$1250,7,FALSE),IF(VLOOKUP(F99,Companies!$B$3:$M$1250,9,FALSE)<>\"\",VLOOKUP(F99,Companies!$B$3:$M$1250,9,FALSE),IF(VLOOKUP(F99,Companies!$B$3:$M$1250,11,FALSE)<>\"\",VLOOKUP(F99,Companies!$B$3:$M$1250,11,FALSE),\"\")))))","v":""},{"$f":"IF(VLOOKUP(F99,Companies!$B$3:$M$1250,12,FALSE)<>\"\",VLOOKUP(F99,Companies!$B$3:$M$1250,12,FALSE),\"\")","v":""}]
[{"$nulls":3},"VSFR","411JEBSEN&JESSEN","Jebsen & Jessen (GmbH & Co.) KG","2018-12-31","2019-01-30","Invoice","18.12.0198",{"v":11522.01,"d":"11,522.01 €"},{"$f":"IF(VLOOKUP(F100,Companies!$B$3:$M$1250,2,FALSE)<>\"\",VLOOKUP(F100,Companies!$B$3:$M$1250,2,FALSE),IF(VLOOKUP(F100,Companies!$B$3:$M$1250,4,FALSE)<>\"\",VLOOKUP(F100,Companies!$B$3:$M$1250,4,FALSE),IF(VLOOKUP(F100,Companies!$B$3:$M$1250,6,FALSE)<>\"\",VLOOKUP(F100,Companies!$B$3:$M$1250,6,FALSE),IF(VLOOKUP(F100,Companies!$B$3:$M$1250,8,FALSE)<>\"\",VLOOKUP(F100,Companies!$B$3:$M$1250,8,FALSE),IF(VLOOKUP(F100,Companies!$B$3:$M$1250,10,FALSE)<>\"\",VLOOKUP(F100,Companies!$B$3:$M$1250,10,FALSE),\"\")))))","v":""},{"$f":"IF(VLOOKUP(F100,Companies!$B$3:$M$1250,3,FALSE)<>\"\",VLOOKUP(F100,Companies!$B$3:$M$1250,3,FALSE),IF(VLOOKUP(F100,Companies!$B$3:$M$1250,5,FALSE)<>\"\",VLOOKUP(F100,Companies!$B$3:$M$1250,5,FALSE),IF(VLOOKUP(F100,Companies!$B$3:$M$1250,7,FALSE)<>\"\",VLOOKUP(F100,Companies!$B$3:$M$1250,7,FALSE),IF(VLOOKUP(F100,Companies!$B$3:$M$1250,9,FALSE)<>\"\",VLOOKUP(F100,Companies!$B$3:$M$1250,9,FALSE),IF(VLOOKUP(F100,Companies!$B$3:$M$1250,11,FALSE)<>\"\",VLOOKUP(F100,Companies!$B$3:$M$1250,11,FALSE),\"\")))))","v":""},{"$f":"IF(VLOOKUP(F100,Companies!$B$3:$M$1250,12,FALSE)<>\"\",VLOOKUP(F100,Companies!$B$3:$M$1250,12,FALSE),\"\")","v":""}]
[{"$nulls":3},"VSFR","411JPMOLUNEUXSTUDIOL","JP Molyneux Studio Ltd","2018-10-31","2018-11-30","Invoice","18.10.0153",{"v":880.01,"d":"880.01 €"},{"$f":"IF(VLOOKUP(F101,Companies!$B$3:$M$1250,2,FALSE)<>\"\",VLOOKUP(F101,Companies!$B$3:$M$1250,2,FALSE),IF(VLOOKUP(F101,Companies!$B$3:$M$1250,4,FALSE)<>\"\",VLOOKUP(F101,Companies!$B$3:$M$1250,4,FALSE),IF(VLOOKUP(F101,Companies!$B$3:$M$1250,6,FALSE)<>\"\",VLOOKUP(F101,Companies!$B$3:$M$1250,6,FALSE),IF(VLOOKUP(F101,Companies!$B$3:$M$1250,8,FALSE)<>\"\",VLOOKUP(F101,Companies!$B$3:$M$1250,8,FALSE),IF(VLOOKUP(F101,Companies!$B$3:$M$1250,10,FALSE)<>\"\",VLOOKUP(F101,Companies!$B$3:$M$1250,10,FALSE),\"\")))))","v":""},{"$f":"IF(VLOOKUP(F101,Companies!$B$3:$M$1250,3,FALSE)<>\"\",VLOOKUP(F101,Companies!$B$3:$M$1250,3,FALSE),IF(VLOOKUP(F101,Companies!$B$3:$M$1250,5,FALSE)<>\"\",VLOOKUP(F101,Companies!$B$3:$M$1250,5,FALSE),IF(VLOOKUP(F101,Companies!$B$3:$M$1250,7,FALSE)<>\"\",VLOOKUP(F101,Companies!$B$3:$M$1250,7,FALSE),IF(VLOOKUP(F101,Companies!$B$3:$M$1250,9,FALSE)<>\"\",VLOOKUP(F101,Companies!$B$3:$M$1250,9,FALSE),IF(VLOOKUP(F101,Companies!$B$3:$M$1250,11,FALSE)<>\"\",VLOOKUP(F101,Companies!$B$3:$M$1250,11,FALSE),\"\")))))","v":""},{"$f":"IF(VLOOKUP(F101,Companies!$B$3:$M$1250,12,FALSE)<>\"\",VLOOKUP(F101,Companies!$B$3:$M$1250,12,FALSE),\"\")","v":""}]
[{"$nulls":3},"VSFR","411JPMOLUNEUXSTUDIOL","JP Molyneux Studio Ltd","2018-11-30","2018-12-30","Invoice","18.11.0143",{"v":1063.48,"d":"1,063.48 €"},{"$f":"IF(VLOOKUP(F102,Companies!$B$3:$M$1250,2,FALSE)<>\"\",VLOOKUP(F102,Companies!$B$3:$M$1250,2,FALSE),IF(VLOOKUP(F102,Companies!$B$3:$M$1250,4,FALSE)<>\"\",VLOOKUP(F102,Companies!$B$3:$M$1250,4,FALSE),IF(VLOOKUP(F102,Companies!$B$3:$M$1250,6,FALSE)<>\"\",VLOOKUP(F102,Companies!$B$3:$M$1250,6,FALSE),IF(VLOOKUP(F102,Companies!$B$3:$M$1250,8,FALSE)<>\"\",VLOOKUP(F102,Companies!$B$3:$M$1250,8,FALSE),IF(VLOOKUP(F102,Companies!$B$3:$M$1250,10,FALSE)<>\"\",VLOOKUP(F102,Companies!$B$3:$M$1250,10,FALSE),\"\")))))","v":""},{"$f":"IF(VLOOKUP(F102,Companies!$B$3:$M$1250,3,FALSE)<>\"\",VLOOKUP(F102,Companies!$B$3:$M$1250,3,FALSE),IF(VLOOKUP(F102,Companies!$B$3:$M$1250,5,FALSE)<>\"\",VLOOKUP(F102,Companies!$B$3:$M$1250,5,FALSE),IF(VLOOKUP(F102,Companies!$B$3:$M$1250,7,FALSE)<>\"\",VLOOKUP(F102,Companies!$B$3:$M$1250,7,FALSE),IF(VLOOKUP(F102,Companies!$B$3:$M$1250,9,FALSE)<>\"\",VLOOKUP(F102,Companies!$B$3:$M$1250,9,FALSE),IF(VLOOKUP(F102,Companies!$B$3:$M$1250,11,FALSE)<>\"\",VLOOKUP(F102,Companies!$B$3:$M$1250,11,FALSE),\"\")))))","v":""},{"$f":"IF(VLOOKUP(F102,Companies!$B$3:$M$1250,12,FALSE)<>\"\",VLOOKUP(F102,Companies!$B$3:$M$1250,12,FALSE),\"\")","v":""}]
[{"$nulls":3},"VSFR","411JPMOLUNEUXSTUDIOL","JP Molyneux Studio Ltd","2018-12-31","2019-01-30","Invoice","18.12.0231",{"v":996,"d":"996.00 €"},{"$f":"IF(VLOOKUP(F103,Companies!$B$3:$M$1250,2,FALSE)<>\"\",VLOOKUP(F103,Companies!$B$3:$M$1250,2,FALSE),IF(VLOOKUP(F103,Companies!$B$3:$M$1250,4,FALSE)<>\"\",VLOOKUP(F103,Companies!$B$3:$M$1250,4,FALSE),IF(VLOOKUP(F103,Companies!$B$3:$M$1250,6,FALSE)<>\"\",VLOOKUP(F103,Companies!$B$3:$M$1250,6,FALSE),IF(VLOOKUP(F103,Companies!$B$3:$M$1250,8,FALSE)<>\"\",VLOOKUP(F103,Companies!$B$3:$M$1250,8,FALSE),IF(VLOOKUP(F103,Companies!$B$3:$M$1250,10,FALSE)<>\"\",VLOOKUP(F103,Companies!$B$3:$M$1250,10,FALSE),\"\")))))","v":""},{"$f":"IF(VLOOKUP(F103,Companies!$B$3:$M$1250,3,FALSE)<>\"\",VLOOKUP(F103,Companies!$B$3:$M$1250,3,FALSE),IF(VLOOKUP(F103,Companies!$B$3:$M$1250,5,FALSE)<>\"\",VLOOKUP(F103,Companies!$B$3:$M$1250,5,FALSE),IF(VLOOKUP(F103,Companies!$B$3:$M$1250,7,FALSE)<>\"\",VLOOKUP(F103,Companies!$B$3:$M$1250,7,FALSE),IF(VLOOKUP(F103,Companies!$B$3:$M$1250,9,FALSE)<>\"\",VLOOKUP(F103,Companies!$B$3:$M$1250,9,FALSE),IF(VLOOKUP(F103,Companies!$B$3:$M$1250,11,FALSE)<>\"\",VLOOKUP(F103,Companies!$B$3:$M$1250,11,FALSE),\"\")))))","v":""},{"$f":"IF(VLOOKUP(F103,Companies!$B$3:$M$1250,12,FALSE)<>\"\",VLOOKUP(F103,Companies!$B$3:$M$1250,12,FALSE),\"\")","v":""}]
[{"$nulls":3},"VSFR","411JPMOLUNEUXSTUDIOL","JP Molyneux Studio Ltd","2019-01-31","2019-03-02","Invoice","19.01.0193",{"v":642.4,"d":"642.40 €"},{"$f":"IF(VLOOKUP(F104,Companies!$B$3:$M$1250,2,FALSE)<>\"\",VLOOKUP(F104,Companies!$B$3:$M$1250,2,FALSE),IF(VLOOKUP(F104,Companies!$B$3:$M$1250,4,FALSE)<>\"\",VLOOKUP(F104,Companies!$B$3:$M$1250,4,FALSE),IF(VLOOKUP(F104,Companies!$B$3:$M$1250,6,FALSE)<>\"\",VLOOKUP(F104,Companies!$B$3:$M$1250,6,FALSE),IF(VLOOKUP(F104,Companies!$B$3:$M$1250,8,FALSE)<>\"\",VLOOKUP(F104,Companies!$B$3:$M$1250,8,FALSE),IF(VLOOKUP(F104,Companies!$B$3:$M$1250,10,FALSE)<>\"\",VLOOKUP(F104,Companies!$B$3:$M$1250,10,FALSE),\"\")))))","v":""},{"$f":"IF(VLOOKUP(F104,Companies!$B$3:$M$1250,3,FALSE)<>\"\",VLOOKUP(F104,Companies!$B$3:$M$1250,3,FALSE),IF(VLOOKUP(F104,Companies!$B$3:$M$1250,5,FALSE)<>\"\",VLOOKUP(F104,Companies!$B$3:$M$1250,5,FALSE),IF(VLOOKUP(F104,Companies!$B$3:$M$1250,7,FALSE)<>\"\",VLOOKUP(F104,Companies!$B$3:$M$1250,7,FALSE),IF(VLOOKUP(F104,Companies!$B$3:$M$1250,9,FALSE)<>\"\",VLOOKUP(F104,Companies!$B$3:$M$1250,9,FALSE),IF(VLOOKUP(F104,Companies!$B$3:$M$1250,11,FALSE)<>\"\",VLOOKUP(F104,Companies!$B$3:$M$1250,11,FALSE),\"\")))))","v":""},{"$f":"IF(VLOOKUP(F104,Companies!$B$3:$M$1250,12,FALSE)<>\"\",VLOOKUP(F104,Companies!$B$3:$M$1250,12,FALSE),\"\")","v":""}]
[{"$nulls":3},"VSFR","411JPMOLUNEUXSTUDIOL","JP Molyneux Studio Ltd","2019-02-28","2019-03-30","Invoice","19.02.0060",{"v":1062,"d":"1,062.00 €"},{"$f":"IF(VLOOKUP(F105,Companies!$B$3:$M$1250,2,FALSE)<>\"\",VLOOKUP(F105,Companies!$B$3:$M$1250,2,FALSE),IF(VLOOKUP(F105,Companies!$B$3:$M$1250,4,FALSE)<>\"\",VLOOKUP(F105,Companies!$B$3:$M$1250,4,FALSE),IF(VLOOKUP(F105,Companies!$B$3:$M$1250,6,FALSE)<>\"\",VLOOKUP(F105,Companies!$B$3:$M$1250,6,FALSE),IF(VLOOKUP(F105,Companies!$B$3:$M$1250,8,FALSE)<>\"\",VLOOKUP(F105,Companies!$B$3:$M$1250,8,FALSE),IF(VLOOKUP(F105,Companies!$B$3:$M$1250,10,FALSE)<>\"\",VLOOKUP(F105,Companies!$B$3:$M$1250,10,FALSE),\"\")))))","v":""},{"$f":"IF(VLOOKUP(F105,Companies!$B$3:$M$1250,3,FALSE)<>\"\",VLOOKUP(F105,Companies!$B$3:$M$1250,3,FALSE),IF(VLOOKUP(F105,Companies!$B$3:$M$1250,5,FALSE)<>\"\",VLOOKUP(F105,Companies!$B$3:$M$1250,5,FALSE),IF(VLOOKUP(F105,Companies!$B$3:$M$1250,7,FALSE)<>\"\",VLOOKUP(F105,Companies!$B$3:$M$1250,7,FALSE),IF(VLOOKUP(F105,Companies!$B$3:$M$1250,9,FALSE)<>\"\",VLOOKUP(F105,Companies!$B$3:$M$1250,9,FALSE),IF(VLOOKUP(F105,Companies!$B$3:$M$1250,11,FALSE)<>\"\",VLOOKUP(F105,Companies!$B$3:$M$1250,11,FALSE),\"\")))))","v":""},{"$f":"IF(VLOOKUP(F105,Companies!$B$3:$M$1250,12,FALSE)<>\"\",VLOOKUP(F105,Companies!$B$3:$M$1250,12,FALSE),\"\")","v":""}]
[{"$nulls":3},"VSFR","411JPMOLUNEUXSTUDIOL","JP Molyneux Studio Ltd","2019-03-31","2019-04-30","Invoice","19.03.0110",{"v":396,"d":"396.00 €"},{"$f":"IF(VLOOKUP(F106,Companies!$B$3:$M$1250,2,FALSE)<>\"\",VLOOKUP(F106,Companies!$B$3:$M$1250,2,FALSE),IF(VLOOKUP(F106,Companies!$B$3:$M$1250,4,FALSE)<>\"\",VLOOKUP(F106,Companies!$B$3:$M$1250,4,FALSE),IF(VLOOKUP(F106,Companies!$B$3:$M$1250,6,FALSE)<>\"\",VLOOKUP(F106,Companies!$B$3:$M$1250,6,FALSE),IF(VLOOKUP(F106,Companies!$B$3:$M$1250,8,FALSE)<>\"\",VLOOKUP(F106,Companies!$B$3:$M$1250,8,FALSE),IF(VLOOKUP(F106,Companies!$B$3:$M$1250,10,FALSE)<>\"\",VLOOKUP(F106,Companies!$B$3:$M$1250,10,FALSE),\"\")))))","v":""},{"$f":"IF(VLOOKUP(F106,Companies!$B$3:$M$1250,3,FALSE)<>\"\",VLOOKUP(F106,Companies!$B$3:$M$1250,3,FALSE),IF(VLOOKUP(F106,Companies!$B$3:$M$1250,5,FALSE)<>\"\",VLOOKUP(F106,Companies!$B$3:$M$1250,5,FALSE),IF(VLOOKUP(F106,Companies!$B$3:$M$1250,7,FALSE)<>\"\",VLOOKUP(F106,Companies!$B$3:$M$1250,7,FALSE),IF(VLOOKUP(F106,Companies!$B$3:$M$1250,9,FALSE)<>\"\",VLOOKUP(F106,Companies!$B$3:$M$1250,9,FALSE),IF(VLOOKUP(F106,Companies!$B$3:$M$1250,11,FALSE)<>\"\",VLOOKUP(F106,Companies!$B$3:$M$1250,11,FALSE),\"\")))))","v":""},{"$f":"IF(VLOOKUP(F106,Companies!$B$3:$M$1250,12,FALSE)<>\"\",VLOOKUP(F106,Companies!$B$3:$M$1250,12,FALSE),\"\")","v":""}]
[{"$nulls":3},"VSFR","411JPMOLUNEUXSTUDIOL","JP Molyneux Studio Ltd","2019-04-30","2019-05-30","Invoice","19.04.0151",{"v":968,"d":"968.00 €"},{"$f":"IF(VLOOKUP(F107,Companies!$B$3:$M$1250,2,FALSE)<>\"\",VLOOKUP(F107,Companies!$B$3:$M$1250,2,FALSE),IF(VLOOKUP(F107,Companies!$B$3:$M$1250,4,FALSE)<>\"\",VLOOKUP(F107,Companies!$B$3:$M$1250,4,FALSE),IF(VLOOKUP(F107,Companies!$B$3:$M$1250,6,FALSE)<>\"\",VLOOKUP(F107,Companies!$B$3:$M$1250,6,FALSE),IF(VLOOKUP(F107,Companies!$B$3:$M$1250,8,FALSE)<>\"\",VLOOKUP(F107,Companies!$B$3:$M$1250,8,FALSE),IF(VLOOKUP(F107,Companies!$B$3:$M$1250,10,FALSE)<>\"\",VLOOKUP(F107,Companies!$B$3:$M$1250,10,FALSE),\"\")))))","v":""},{"$f":"IF(VLOOKUP(F107,Companies!$B$3:$M$1250,3,FALSE)<>\"\",VLOOKUP(F107,Companies!$B$3:$M$1250,3,FALSE),IF(VLOOKUP(F107,Companies!$B$3:$M$1250,5,FALSE)<>\"\",VLOOKUP(F107,Companies!$B$3:$M$1250,5,FALSE),IF(VLOOKUP(F107,Companies!$B$3:$M$1250,7,FALSE)<>\"\",VLOOKUP(F107,Companies!$B$3:$M$1250,7,FALSE),IF(VLOOKUP(F107,Companies!$B$3:$M$1250,9,FALSE)<>\"\",VLOOKUP(F107,Companies!$B$3:$M$1250,9,FALSE),IF(VLOOKUP(F107,Companies!$B$3:$M$1250,11,FALSE)<>\"\",VLOOKUP(F107,Companies!$B$3:$M$1250,11,FALSE),\"\")))))","v":""},{"$f":"IF(VLOOKUP(F107,Companies!$B$3:$M$1250,12,FALSE)<>\"\",VLOOKUP(F107,Companies!$B$3:$M$1250,12,FALSE),\"\")","v":""}]
[{"$nulls":3},"VSFR","411JPMOLUNEUXSTUDIOL","JP Molyneux Studio Ltd","2019-05-31","2019-06-30","Invoice","FA19050119",{"v":1328.81,"d":"1,328.81 €"},{"$f":"IF(VLOOKUP(F108,Companies!$B$3:$M$1250,2,FALSE)<>\"\",VLOOKUP(F108,Companies!$B$3:$M$1250,2,FALSE),IF(VLOOKUP(F108,Companies!$B$3:$M$1250,4,FALSE)<>\"\",VLOOKUP(F108,Companies!$B$3:$M$1250,4,FALSE),IF(VLOOKUP(F108,Companies!$B$3:$M$1250,6,FALSE)<>\"\",VLOOKUP(F108,Companies!$B$3:$M$1250,6,FALSE),IF(VLOOKUP(F108,Companies!$B$3:$M$1250,8,FALSE)<>\"\",VLOOKUP(F108,Companies!$B$3:$M$1250,8,FALSE),IF(VLOOKUP(F108,Companies!$B$3:$M$1250,10,FALSE)<>\"\",VLOOKUP(F108,Companies!$B$3:$M$1250,10,FALSE),\"\")))))","v":""},{"$f":"IF(VLOOKUP(F108,Companies!$B$3:$M$1250,3,FALSE)<>\"\",VLOOKUP(F108,Companies!$B$3:$M$1250,3,FALSE),IF(VLOOKUP(F108,Companies!$B$3:$M$1250,5,FALSE)<>\"\",VLOOKUP(F108,Companies!$B$3:$M$1250,5,FALSE),IF(VLOOKUP(F108,Companies!$B$3:$M$1250,7,FALSE)<>\"\",VLOOKUP(F108,Companies!$B$3:$M$1250,7,FALSE),IF(VLOOKUP(F108,Companies!$B$3:$M$1250,9,FALSE)<>\"\",VLOOKUP(F108,Companies!$B$3:$M$1250,9,FALSE),IF(VLOOKUP(F108,Companies!$B$3:$M$1250,11,FALSE)<>\"\",VLOOKUP(F108,Companies!$B$3:$M$1250,11,FALSE),\"\")))))","v":""},{"$f":"IF(VLOOKUP(F108,Companies!$B$3:$M$1250,12,FALSE)<>\"\",VLOOKUP(F108,Companies!$B$3:$M$1250,12,FALSE),\"\")","v":""}]
[{"$nulls":3},"VSFR","411KERAMIK-LAUFEN","Keramik Laufen AG","2019-05-31","2019-06-30","Invoice",{"$f":"\"19050008\"","v":"19050008"},{"v":300,"d":"300.00 €"},{"$f":"IF(VLOOKUP(F109,Companies!$B$3:$M$1250,2,FALSE)<>\"\",VLOOKUP(F109,Companies!$B$3:$M$1250,2,FALSE),IF(VLOOKUP(F109,Companies!$B$3:$M$1250,4,FALSE)<>\"\",VLOOKUP(F109,Companies!$B$3:$M$1250,4,FALSE),IF(VLOOKUP(F109,Companies!$B$3:$M$1250,6,FALSE)<>\"\",VLOOKUP(F109,Companies!$B$3:$M$1250,6,FALSE),IF(VLOOKUP(F109,Companies!$B$3:$M$1250,8,FALSE)<>\"\",VLOOKUP(F109,Companies!$B$3:$M$1250,8,FALSE),IF(VLOOKUP(F109,Companies!$B$3:$M$1250,10,FALSE)<>\"\",VLOOKUP(F109,Companies!$B$3:$M$1250,10,FALSE),\"\")))))","v":""},{"$f":"IF(VLOOKUP(F109,Companies!$B$3:$M$1250,3,FALSE)<>\"\",VLOOKUP(F109,Companies!$B$3:$M$1250,3,FALSE),IF(VLOOKUP(F109,Companies!$B$3:$M$1250,5,FALSE)<>\"\",VLOOKUP(F109,Companies!$B$3:$M$1250,5,FALSE),IF(VLOOKUP(F109,Companies!$B$3:$M$1250,7,FALSE)<>\"\",VLOOKUP(F109,Companies!$B$3:$M$1250,7,FALSE),IF(VLOOKUP(F109,Companies!$B$3:$M$1250,9,FALSE)<>\"\",VLOOKUP(F109,Companies!$B$3:$M$1250,9,FALSE),IF(VLOOKUP(F109,Companies!$B$3:$M$1250,11,FALSE)<>\"\",VLOOKUP(F109,Companies!$B$3:$M$1250,11,FALSE),\"\")))))","v":""},{"$f":"IF(VLOOKUP(F109,Companies!$B$3:$M$1250,12,FALSE)<>\"\",VLOOKUP(F109,Companies!$B$3:$M$1250,12,FALSE),\"\")","v":""}]
[{"$nulls":3},"VSFR","411KILARGOSP.Z.O.O.","KILARGO SP. Z.O.O.","2019-05-31","2019-06-30","Invoice","FA19050081",{"v":149.24,"d":"149.24 €"},{"$f":"IF(VLOOKUP(F110,Companies!$B$3:$M$1250,2,FALSE)<>\"\",VLOOKUP(F110,Companies!$B$3:$M$1250,2,FALSE),IF(VLOOKUP(F110,Companies!$B$3:$M$1250,4,FALSE)<>\"\",VLOOKUP(F110,Companies!$B$3:$M$1250,4,FALSE),IF(VLOOKUP(F110,Companies!$B$3:$M$1250,6,FALSE)<>\"\",VLOOKUP(F110,Companies!$B$3:$M$1250,6,FALSE),IF(VLOOKUP(F110,Companies!$B$3:$M$1250,8,FALSE)<>\"\",VLOOKUP(F110,Companies!$B$3:$M$1250,8,FALSE),IF(VLOOKUP(F110,Companies!$B$3:$M$1250,10,FALSE)<>\"\",VLOOKUP(F110,Companies!$B$3:$M$1250,10,FALSE),\"\")))))","v":""},{"$f":"IF(VLOOKUP(F110,Companies!$B$3:$M$1250,3,FALSE)<>\"\",VLOOKUP(F110,Companies!$B$3:$M$1250,3,FALSE),IF(VLOOKUP(F110,Companies!$B$3:$M$1250,5,FALSE)<>\"\",VLOOKUP(F110,Companies!$B$3:$M$1250,5,FALSE),IF(VLOOKUP(F110,Companies!$B$3:$M$1250,7,FALSE)<>\"\",VLOOKUP(F110,Companies!$B$3:$M$1250,7,FALSE),IF(VLOOKUP(F110,Companies!$B$3:$M$1250,9,FALSE)<>\"\",VLOOKUP(F110,Companies!$B$3:$M$1250,9,FALSE),IF(VLOOKUP(F110,Companies!$B$3:$M$1250,11,FALSE)<>\"\",VLOOKUP(F110,Companies!$B$3:$M$1250,11,FALSE),\"\")))))","v":""},{"$f":"IF(VLOOKUP(F110,Companies!$B$3:$M$1250,12,FALSE)<>\"\",VLOOKUP(F110,Companies!$B$3:$M$1250,12,FALSE),\"\")","v":""}]
[{"$nulls":3},"VSFR","411KIRCHHOFFPOLSKASP","KIRCHHOFF POLSKA SP ZOO","2019-05-31","2019-06-30","Invoice","FA19050030",{"v":1302.5,"d":"1,302.50 €"},{"$f":"IF(VLOOKUP(F111,Companies!$B$3:$M$1250,2,FALSE)<>\"\",VLOOKUP(F111,Companies!$B$3:$M$1250,2,FALSE),IF(VLOOKUP(F111,Companies!$B$3:$M$1250,4,FALSE)<>\"\",VLOOKUP(F111,Companies!$B$3:$M$1250,4,FALSE),IF(VLOOKUP(F111,Companies!$B$3:$M$1250,6,FALSE)<>\"\",VLOOKUP(F111,Companies!$B$3:$M$1250,6,FALSE),IF(VLOOKUP(F111,Companies!$B$3:$M$1250,8,FALSE)<>\"\",VLOOKUP(F111,Companies!$B$3:$M$1250,8,FALSE),IF(VLOOKUP(F111,Companies!$B$3:$M$1250,10,FALSE)<>\"\",VLOOKUP(F111,Companies!$B$3:$M$1250,10,FALSE),\"\")))))","v":""},{"$f":"IF(VLOOKUP(F111,Companies!$B$3:$M$1250,3,FALSE)<>\"\",VLOOKUP(F111,Companies!$B$3:$M$1250,3,FALSE),IF(VLOOKUP(F111,Companies!$B$3:$M$1250,5,FALSE)<>\"\",VLOOKUP(F111,Companies!$B$3:$M$1250,5,FALSE),IF(VLOOKUP(F111,Companies!$B$3:$M$1250,7,FALSE)<>\"\",VLOOKUP(F111,Companies!$B$3:$M$1250,7,FALSE),IF(VLOOKUP(F111,Companies!$B$3:$M$1250,9,FALSE)<>\"\",VLOOKUP(F111,Companies!$B$3:$M$1250,9,FALSE),IF(VLOOKUP(F111,Companies!$B$3:$M$1250,11,FALSE)<>\"\",VLOOKUP(F111,Companies!$B$3:$M$1250,11,FALSE),\"\")))))","v":""},{"$f":"IF(VLOOKUP(F111,Companies!$B$3:$M$1250,12,FALSE)<>\"\",VLOOKUP(F111,Companies!$B$3:$M$1250,12,FALSE),\"\")","v":""}]
[{"$nulls":3},"VSUK","411KPN B.V.","KPN B.V","2019-04-30","2019-05-30","Invoice","04.19.0021",{"v":836.67,"d":"836.67 €"},{"$f":"IF(VLOOKUP(F112,Companies!$B$3:$M$1250,2,FALSE)<>\"\",VLOOKUP(F112,Companies!$B$3:$M$1250,2,FALSE),IF(VLOOKUP(F112,Companies!$B$3:$M$1250,4,FALSE)<>\"\",VLOOKUP(F112,Companies!$B$3:$M$1250,4,FALSE),IF(VLOOKUP(F112,Companies!$B$3:$M$1250,6,FALSE)<>\"\",VLOOKUP(F112,Companies!$B$3:$M$1250,6,FALSE),IF(VLOOKUP(F112,Companies!$B$3:$M$1250,8,FALSE)<>\"\",VLOOKUP(F112,Companies!$B$3:$M$1250,8,FALSE),IF(VLOOKUP(F112,Companies!$B$3:$M$1250,10,FALSE)<>\"\",VLOOKUP(F112,Companies!$B$3:$M$1250,10,FALSE),\"\")))))","v":""},{"$f":"IF(VLOOKUP(F112,Companies!$B$3:$M$1250,3,FALSE)<>\"\",VLOOKUP(F112,Companies!$B$3:$M$1250,3,FALSE),IF(VLOOKUP(F112,Companies!$B$3:$M$1250,5,FALSE)<>\"\",VLOOKUP(F112,Companies!$B$3:$M$1250,5,FALSE),IF(VLOOKUP(F112,Companies!$B$3:$M$1250,7,FALSE)<>\"\",VLOOKUP(F112,Companies!$B$3:$M$1250,7,FALSE),IF(VLOOKUP(F112,Companies!$B$3:$M$1250,9,FALSE)<>\"\",VLOOKUP(F112,Companies!$B$3:$M$1250,9,FALSE),IF(VLOOKUP(F112,Companies!$B$3:$M$1250,11,FALSE)<>\"\",VLOOKUP(F112,Companies!$B$3:$M$1250,11,FALSE),\"\")))))","v":""},{"$f":"IF(VLOOKUP(F112,Companies!$B$3:$M$1250,12,FALSE)<>\"\",VLOOKUP(F112,Companies!$B$3:$M$1250,12,FALSE),\"\")","v":""}]
[{"$nulls":3},"VSUK","411KPNEURORINGSBV","KPN EURORINGS BV","2019-04-23","2019-05-23","Invoice","04.19.0004",{"v":70,"d":"70.00 €"},{"$f":"IF(VLOOKUP(F113,Companies!$B$3:$M$1250,2,FALSE)<>\"\",VLOOKUP(F113,Companies!$B$3:$M$1250,2,FALSE),IF(VLOOKUP(F113,Companies!$B$3:$M$1250,4,FALSE)<>\"\",VLOOKUP(F113,Companies!$B$3:$M$1250,4,FALSE),IF(VLOOKUP(F113,Companies!$B$3:$M$1250,6,FALSE)<>\"\",VLOOKUP(F113,Companies!$B$3:$M$1250,6,FALSE),IF(VLOOKUP(F113,Companies!$B$3:$M$1250,8,FALSE)<>\"\",VLOOKUP(F113,Companies!$B$3:$M$1250,8,FALSE),IF(VLOOKUP(F113,Companies!$B$3:$M$1250,10,FALSE)<>\"\",VLOOKUP(F113,Companies!$B$3:$M$1250,10,FALSE),\"\")))))","v":""},{"$f":"IF(VLOOKUP(F113,Companies!$B$3:$M$1250,3,FALSE)<>\"\",VLOOKUP(F113,Companies!$B$3:$M$1250,3,FALSE),IF(VLOOKUP(F113,Companies!$B$3:$M$1250,5,FALSE)<>\"\",VLOOKUP(F113,Companies!$B$3:$M$1250,5,FALSE),IF(VLOOKUP(F113,Companies!$B$3:$M$1250,7,FALSE)<>\"\",VLOOKUP(F113,Companies!$B$3:$M$1250,7,FALSE),IF(VLOOKUP(F113,Companies!$B$3:$M$1250,9,FALSE)<>\"\",VLOOKUP(F113,Companies!$B$3:$M$1250,9,FALSE),IF(VLOOKUP(F113,Companies!$B$3:$M$1250,11,FALSE)<>\"\",VLOOKUP(F113,Companies!$B$3:$M$1250,11,FALSE),\"\")))))","v":""},{"$f":"IF(VLOOKUP(F113,Companies!$B$3:$M$1250,12,FALSE)<>\"\",VLOOKUP(F113,Companies!$B$3:$M$1250,12,FALSE),\"\")","v":""}]
[{"$nulls":3},"VSUK","411KPNEURORINGSBV","KPN EURORINGS BV","2019-04-30","2019-05-30","Invoice","04.19.0010",{"v":370.05,"d":"370.05 €"},{"$f":"IF(VLOOKUP(F114,Companies!$B$3:$M$1250,2,FALSE)<>\"\",VLOOKUP(F114,Companies!$B$3:$M$1250,2,FALSE),IF(VLOOKUP(F114,Companies!$B$3:$M$1250,4,FALSE)<>\"\",VLOOKUP(F114,Companies!$B$3:$M$1250,4,FALSE),IF(VLOOKUP(F114,Companies!$B$3:$M$1250,6,FALSE)<>\"\",VLOOKUP(F114,Companies!$B$3:$M$1250,6,FALSE),IF(VLOOKUP(F114,Companies!$B$3:$M$1250,8,FALSE)<>\"\",VLOOKUP(F114,Companies!$B$3:$M$1250,8,FALSE),IF(VLOOKUP(F114,Companies!$B$3:$M$1250,10,FALSE)<>\"\",VLOOKUP(F114,Companies!$B$3:$M$1250,10,FALSE),\"\")))))","v":""},{"$f":"IF(VLOOKUP(F114,Companies!$B$3:$M$1250,3,FALSE)<>\"\",VLOOKUP(F114,Companies!$B$3:$M$1250,3,FALSE),IF(VLOOKUP(F114,Companies!$B$3:$M$1250,5,FALSE)<>\"\",VLOOKUP(F114,Companies!$B$3:$M$1250,5,FALSE),IF(VLOOKUP(F114,Companies!$B$3:$M$1250,7,FALSE)<>\"\",VLOOKUP(F114,Companies!$B$3:$M$1250,7,FALSE),IF(VLOOKUP(F114,Companies!$B$3:$M$1250,9,FALSE)<>\"\",VLOOKUP(F114,Companies!$B$3:$M$1250,9,FALSE),IF(VLOOKUP(F114,Companies!$B$3:$M$1250,11,FALSE)<>\"\",VLOOKUP(F114,Companies!$B$3:$M$1250,11,FALSE),\"\")))))","v":""},{"$f":"IF(VLOOKUP(F114,Companies!$B$3:$M$1250,12,FALSE)<>\"\",VLOOKUP(F114,Companies!$B$3:$M$1250,12,FALSE),\"\")","v":""}]
[{"$nulls":3},"VSFR","411KRONOSINTERNATION","KRONOS INTERNATIONAL, INC.","2019-05-31","2019-06-30","Invoice","FA19050083",{"v":5112.83,"d":"5,112.83 €"},{"$f":"IF(VLOOKUP(F115,Companies!$B$3:$M$1250,2,FALSE)<>\"\",VLOOKUP(F115,Companies!$B$3:$M$1250,2,FALSE),IF(VLOOKUP(F115,Companies!$B$3:$M$1250,4,FALSE)<>\"\",VLOOKUP(F115,Companies!$B$3:$M$1250,4,FALSE),IF(VLOOKUP(F115,Companies!$B$3:$M$1250,6,FALSE)<>\"\",VLOOKUP(F115,Companies!$B$3:$M$1250,6,FALSE),IF(VLOOKUP(F115,Companies!$B$3:$M$1250,8,FALSE)<>\"\",VLOOKUP(F115,Companies!$B$3:$M$1250,8,FALSE),IF(VLOOKUP(F115,Companies!$B$3:$M$1250,10,FALSE)<>\"\",VLOOKUP(F115,Companies!$B$3:$M$1250,10,FALSE),\"\")))))","v":""},{"$f":"IF(VLOOKUP(F115,Companies!$B$3:$M$1250,3,FALSE)<>\"\",VLOOKUP(F115,Companies!$B$3:$M$1250,3,FALSE),IF(VLOOKUP(F115,Companies!$B$3:$M$1250,5,FALSE)<>\"\",VLOOKUP(F115,Companies!$B$3:$M$1250,5,FALSE),IF(VLOOKUP(F115,Companies!$B$3:$M$1250,7,FALSE)<>\"\",VLOOKUP(F115,Companies!$B$3:$M$1250,7,FALSE),IF(VLOOKUP(F115,Companies!$B$3:$M$1250,9,FALSE)<>\"\",VLOOKUP(F115,Companies!$B$3:$M$1250,9,FALSE),IF(VLOOKUP(F115,Companies!$B$3:$M$1250,11,FALSE)<>\"\",VLOOKUP(F115,Companies!$B$3:$M$1250,11,FALSE),\"\")))))","v":""},{"$f":"IF(VLOOKUP(F115,Companies!$B$3:$M$1250,12,FALSE)<>\"\",VLOOKUP(F115,Companies!$B$3:$M$1250,12,FALSE),\"\")","v":""}]
[{"$nulls":3},"VSFR","411KSBSERVICECOTUMER","KSB SERVICE COTUMER SAS","2019-05-31","2019-06-30","Invoice","FA19050045",{"v":690,"d":"690.00 €"},{"$f":"IF(VLOOKUP(F116,Companies!$B$3:$M$1250,2,FALSE)<>\"\",VLOOKUP(F116,Companies!$B$3:$M$1250,2,FALSE),IF(VLOOKUP(F116,Companies!$B$3:$M$1250,4,FALSE)<>\"\",VLOOKUP(F116,Companies!$B$3:$M$1250,4,FALSE),IF(VLOOKUP(F116,Companies!$B$3:$M$1250,6,FALSE)<>\"\",VLOOKUP(F116,Companies!$B$3:$M$1250,6,FALSE),IF(VLOOKUP(F116,Companies!$B$3:$M$1250,8,FALSE)<>\"\",VLOOKUP(F116,Companies!$B$3:$M$1250,8,FALSE),IF(VLOOKUP(F116,Companies!$B$3:$M$1250,10,FALSE)<>\"\",VLOOKUP(F116,Companies!$B$3:$M$1250,10,FALSE),\"\")))))","v":""},{"$f":"IF(VLOOKUP(F116,Companies!$B$3:$M$1250,3,FALSE)<>\"\",VLOOKUP(F116,Companies!$B$3:$M$1250,3,FALSE),IF(VLOOKUP(F116,Companies!$B$3:$M$1250,5,FALSE)<>\"\",VLOOKUP(F116,Companies!$B$3:$M$1250,5,FALSE),IF(VLOOKUP(F116,Companies!$B$3:$M$1250,7,FALSE)<>\"\",VLOOKUP(F116,Companies!$B$3:$M$1250,7,FALSE),IF(VLOOKUP(F116,Companies!$B$3:$M$1250,9,FALSE)<>\"\",VLOOKUP(F116,Companies!$B$3:$M$1250,9,FALSE),IF(VLOOKUP(F116,Companies!$B$3:$M$1250,11,FALSE)<>\"\",VLOOKUP(F116,Companies!$B$3:$M$1250,11,FALSE),\"\")))))","v":""},{"$f":"IF(VLOOKUP(F116,Companies!$B$3:$M$1250,12,FALSE)<>\"\",VLOOKUP(F116,Companies!$B$3:$M$1250,12,FALSE),\"\")","v":""}]
[{"$nulls":3},"VSFR","411LABORATOIRESTHÉA","LABORATOIRES THEA","2019-05-31","2019-06-30","Invoice","FA19050117",{"v":2251,"d":"2,251.00 €"},{"$f":"IF(VLOOKUP(F117,Companies!$B$3:$M$1250,2,FALSE)<>\"\",VLOOKUP(F117,Companies!$B$3:$M$1250,2,FALSE),IF(VLOOKUP(F117,Companies!$B$3:$M$1250,4,FALSE)<>\"\",VLOOKUP(F117,Companies!$B$3:$M$1250,4,FALSE),IF(VLOOKUP(F117,Companies!$B$3:$M$1250,6,FALSE)<>\"\",VLOOKUP(F117,Companies!$B$3:$M$1250,6,FALSE),IF(VLOOKUP(F117,Companies!$B$3:$M$1250,8,FALSE)<>\"\",VLOOKUP(F117,Companies!$B$3:$M$1250,8,FALSE),IF(VLOOKUP(F117,Companies!$B$3:$M$1250,10,FALSE)<>\"\",VLOOKUP(F117,Companies!$B$3:$M$1250,10,FALSE),\"\")))))","v":""},{"$f":"IF(VLOOKUP(F117,Companies!$B$3:$M$1250,3,FALSE)<>\"\",VLOOKUP(F117,Companies!$B$3:$M$1250,3,FALSE),IF(VLOOKUP(F117,Companies!$B$3:$M$1250,5,FALSE)<>\"\",VLOOKUP(F117,Companies!$B$3:$M$1250,5,FALSE),IF(VLOOKUP(F117,Companies!$B$3:$M$1250,7,FALSE)<>\"\",VLOOKUP(F117,Companies!$B$3:$M$1250,7,FALSE),IF(VLOOKUP(F117,Companies!$B$3:$M$1250,9,FALSE)<>\"\",VLOOKUP(F117,Companies!$B$3:$M$1250,9,FALSE),IF(VLOOKUP(F117,Companies!$B$3:$M$1250,11,FALSE)<>\"\",VLOOKUP(F117,Companies!$B$3:$M$1250,11,FALSE),\"\")))))","v":""},{"$f":"IF(VLOOKUP(F117,Companies!$B$3:$M$1250,12,FALSE)<>\"\",VLOOKUP(F117,Companies!$B$3:$M$1250,12,FALSE),\"\")","v":""}]
[{"$nulls":3},"VSFR","411LAPEYRESERVICES","LAPEYRE SERVICES","2019-04-30","2019-05-30","Invoice","19.04.0034",{"v":612.18,"d":"612.18 €"},{"$f":"IF(VLOOKUP(F118,Companies!$B$3:$M$1250,2,FALSE)<>\"\",VLOOKUP(F118,Companies!$B$3:$M$1250,2,FALSE),IF(VLOOKUP(F118,Companies!$B$3:$M$1250,4,FALSE)<>\"\",VLOOKUP(F118,Companies!$B$3:$M$1250,4,FALSE),IF(VLOOKUP(F118,Companies!$B$3:$M$1250,6,FALSE)<>\"\",VLOOKUP(F118,Companies!$B$3:$M$1250,6,FALSE),IF(VLOOKUP(F118,Companies!$B$3:$M$1250,8,FALSE)<>\"\",VLOOKUP(F118,Companies!$B$3:$M$1250,8,FALSE),IF(VLOOKUP(F118,Companies!$B$3:$M$1250,10,FALSE)<>\"\",VLOOKUP(F118,Companies!$B$3:$M$1250,10,FALSE),\"\")))))","v":""},{"$f":"IF(VLOOKUP(F118,Companies!$B$3:$M$1250,3,FALSE)<>\"\",VLOOKUP(F118,Companies!$B$3:$M$1250,3,FALSE),IF(VLOOKUP(F118,Companies!$B$3:$M$1250,5,FALSE)<>\"\",VLOOKUP(F118,Companies!$B$3:$M$1250,5,FALSE),IF(VLOOKUP(F118,Companies!$B$3:$M$1250,7,FALSE)<>\"\",VLOOKUP(F118,Companies!$B$3:$M$1250,7,FALSE),IF(VLOOKUP(F118,Companies!$B$3:$M$1250,9,FALSE)<>\"\",VLOOKUP(F118,Companies!$B$3:$M$1250,9,FALSE),IF(VLOOKUP(F118,Companies!$B$3:$M$1250,11,FALSE)<>\"\",VLOOKUP(F118,Companies!$B$3:$M$1250,11,FALSE),\"\")))))","v":""},{"$f":"IF(VLOOKUP(F118,Companies!$B$3:$M$1250,12,FALSE)<>\"\",VLOOKUP(F118,Companies!$B$3:$M$1250,12,FALSE),\"\")","v":""}]
[{"$nulls":3},"VSFR","411LAUFEN-BATHROOMS","LAUFEN BATHROOMS AG","2019-03-31","2019-04-30","Invoice","19.03.0136",{"v":9908.01,"d":"9,908.01 €"},{"$f":"IF(VLOOKUP(F119,Companies!$B$3:$M$1250,2,FALSE)<>\"\",VLOOKUP(F119,Companies!$B$3:$M$1250,2,FALSE),IF(VLOOKUP(F119,Companies!$B$3:$M$1250,4,FALSE)<>\"\",VLOOKUP(F119,Companies!$B$3:$M$1250,4,FALSE),IF(VLOOKUP(F119,Companies!$B$3:$M$1250,6,FALSE)<>\"\",VLOOKUP(F119,Companies!$B$3:$M$1250,6,FALSE),IF(VLOOKUP(F119,Companies!$B$3:$M$1250,8,FALSE)<>\"\",VLOOKUP(F119,Companies!$B$3:$M$1250,8,FALSE),IF(VLOOKUP(F119,Companies!$B$3:$M$1250,10,FALSE)<>\"\",VLOOKUP(F119,Companies!$B$3:$M$1250,10,FALSE),\"\")))))","v":""},{"$f":"IF(VLOOKUP(F119,Companies!$B$3:$M$1250,3,FALSE)<>\"\",VLOOKUP(F119,Companies!$B$3:$M$1250,3,FALSE),IF(VLOOKUP(F119,Companies!$B$3:$M$1250,5,FALSE)<>\"\",VLOOKUP(F119,Companies!$B$3:$M$1250,5,FALSE),IF(VLOOKUP(F119,Companies!$B$3:$M$1250,7,FALSE)<>\"\",VLOOKUP(F119,Companies!$B$3:$M$1250,7,FALSE),IF(VLOOKUP(F119,Companies!$B$3:$M$1250,9,FALSE)<>\"\",VLOOKUP(F119,Companies!$B$3:$M$1250,9,FALSE),IF(VLOOKUP(F119,Companies!$B$3:$M$1250,11,FALSE)<>\"\",VLOOKUP(F119,Companies!$B$3:$M$1250,11,FALSE),\"\")))))","v":""},{"$f":"IF(VLOOKUP(F119,Companies!$B$3:$M$1250,12,FALSE)<>\"\",VLOOKUP(F119,Companies!$B$3:$M$1250,12,FALSE),\"\")","v":""}]
[{"$nulls":3},"VSUK","411LEBELIERMAGYARORS","LE BELIER MAGYARORSZAG FORMAÖNTÖDE ZRT.","2019-04-30","2019-05-30","Invoice","04.19.0027",{"v":1225,"d":"1,225.00 €"},{"$f":"IF(VLOOKUP(F120,Companies!$B$3:$M$1250,2,FALSE)<>\"\",VLOOKUP(F120,Companies!$B$3:$M$1250,2,FALSE),IF(VLOOKUP(F120,Companies!$B$3:$M$1250,4,FALSE)<>\"\",VLOOKUP(F120,Companies!$B$3:$M$1250,4,FALSE),IF(VLOOKUP(F120,Companies!$B$3:$M$1250,6,FALSE)<>\"\",VLOOKUP(F120,Companies!$B$3:$M$1250,6,FALSE),IF(VLOOKUP(F120,Companies!$B$3:$M$1250,8,FALSE)<>\"\",VLOOKUP(F120,Companies!$B$3:$M$1250,8,FALSE),IF(VLOOKUP(F120,Companies!$B$3:$M$1250,10,FALSE)<>\"\",VLOOKUP(F120,Companies!$B$3:$M$1250,10,FALSE),\"\")))))","v":""},{"$f":"IF(VLOOKUP(F120,Companies!$B$3:$M$1250,3,FALSE)<>\"\",VLOOKUP(F120,Companies!$B$3:$M$1250,3,FALSE),IF(VLOOKUP(F120,Companies!$B$3:$M$1250,5,FALSE)<>\"\",VLOOKUP(F120,Companies!$B$3:$M$1250,5,FALSE),IF(VLOOKUP(F120,Companies!$B$3:$M$1250,7,FALSE)<>\"\",VLOOKUP(F120,Companies!$B$3:$M$1250,7,FALSE),IF(VLOOKUP(F120,Companies!$B$3:$M$1250,9,FALSE)<>\"\",VLOOKUP(F120,Companies!$B$3:$M$1250,9,FALSE),IF(VLOOKUP(F120,Companies!$B$3:$M$1250,11,FALSE)<>\"\",VLOOKUP(F120,Companies!$B$3:$M$1250,11,FALSE),\"\")))))","v":""},{"$f":"IF(VLOOKUP(F120,Companies!$B$3:$M$1250,12,FALSE)<>\"\",VLOOKUP(F120,Companies!$B$3:$M$1250,12,FALSE),\"\")","v":""}]
[{"$nulls":3},"VSFR","411LVDCOMPANYN.V.","LVD Company NV","2019-04-30","2019-05-30","Invoice","19.04.0086",{"v":100,"d":"100.00 €"},{"$f":"IF(VLOOKUP(F121,Companies!$B$3:$M$1250,2,FALSE)<>\"\",VLOOKUP(F121,Companies!$B$3:$M$1250,2,FALSE),IF(VLOOKUP(F121,Companies!$B$3:$M$1250,4,FALSE)<>\"\",VLOOKUP(F121,Companies!$B$3:$M$1250,4,FALSE),IF(VLOOKUP(F121,Companies!$B$3:$M$1250,6,FALSE)<>\"\",VLOOKUP(F121,Companies!$B$3:$M$1250,6,FALSE),IF(VLOOKUP(F121,Companies!$B$3:$M$1250,8,FALSE)<>\"\",VLOOKUP(F121,Companies!$B$3:$M$1250,8,FALSE),IF(VLOOKUP(F121,Companies!$B$3:$M$1250,10,FALSE)<>\"\",VLOOKUP(F121,Companies!$B$3:$M$1250,10,FALSE),\"\")))))","v":""},{"$f":"IF(VLOOKUP(F121,Companies!$B$3:$M$1250,3,FALSE)<>\"\",VLOOKUP(F121,Companies!$B$3:$M$1250,3,FALSE),IF(VLOOKUP(F121,Companies!$B$3:$M$1250,5,FALSE)<>\"\",VLOOKUP(F121,Companies!$B$3:$M$1250,5,FALSE),IF(VLOOKUP(F121,Companies!$B$3:$M$1250,7,FALSE)<>\"\",VLOOKUP(F121,Companies!$B$3:$M$1250,7,FALSE),IF(VLOOKUP(F121,Companies!$B$3:$M$1250,9,FALSE)<>\"\",VLOOKUP(F121,Companies!$B$3:$M$1250,9,FALSE),IF(VLOOKUP(F121,Companies!$B$3:$M$1250,11,FALSE)<>\"\",VLOOKUP(F121,Companies!$B$3:$M$1250,11,FALSE),\"\")))))","v":""},{"$f":"IF(VLOOKUP(F121,Companies!$B$3:$M$1250,12,FALSE)<>\"\",VLOOKUP(F121,Companies!$B$3:$M$1250,12,FALSE),\"\")","v":""}]
[{"$nulls":3},"VSFR","411LVDCOMPANYN.V.","LVD Company NV","2019-05-31","2019-06-30","Invoice","FA19050054",{"v":100,"d":"100.00 €"},{"$f":"IF(VLOOKUP(F122,Companies!$B$3:$M$1250,2,FALSE)<>\"\",VLOOKUP(F122,Companies!$B$3:$M$1250,2,FALSE),IF(VLOOKUP(F122,Companies!$B$3:$M$1250,4,FALSE)<>\"\",VLOOKUP(F122,Companies!$B$3:$M$1250,4,FALSE),IF(VLOOKUP(F122,Companies!$B$3:$M$1250,6,FALSE)<>\"\",VLOOKUP(F122,Companies!$B$3:$M$1250,6,FALSE),IF(VLOOKUP(F122,Companies!$B$3:$M$1250,8,FALSE)<>\"\",VLOOKUP(F122,Companies!$B$3:$M$1250,8,FALSE),IF(VLOOKUP(F122,Companies!$B$3:$M$1250,10,FALSE)<>\"\",VLOOKUP(F122,Companies!$B$3:$M$1250,10,FALSE),\"\")))))","v":""},{"$f":"IF(VLOOKUP(F122,Companies!$B$3:$M$1250,3,FALSE)<>\"\",VLOOKUP(F122,Companies!$B$3:$M$1250,3,FALSE),IF(VLOOKUP(F122,Companies!$B$3:$M$1250,5,FALSE)<>\"\",VLOOKUP(F122,Companies!$B$3:$M$1250,5,FALSE),IF(VLOOKUP(F122,Companies!$B$3:$M$1250,7,FALSE)<>\"\",VLOOKUP(F122,Companies!$B$3:$M$1250,7,FALSE),IF(VLOOKUP(F122,Companies!$B$3:$M$1250,9,FALSE)<>\"\",VLOOKUP(F122,Companies!$B$3:$M$1250,9,FALSE),IF(VLOOKUP(F122,Companies!$B$3:$M$1250,11,FALSE)<>\"\",VLOOKUP(F122,Companies!$B$3:$M$1250,11,FALSE),\"\")))))","v":""},{"$f":"IF(VLOOKUP(F122,Companies!$B$3:$M$1250,12,FALSE)<>\"\",VLOOKUP(F122,Companies!$B$3:$M$1250,12,FALSE),\"\")","v":""}]
[{"$nulls":3},"VSFR","411MAGNAPOWERTRAINAG","MAGNA Powertrain GmbH & Co KG","2019-05-31","2019-06-30","Invoice","FA19050146",{"v":2120,"d":"2,120.00 €"},{"$f":"IF(VLOOKUP(F123,Companies!$B$3:$M$1250,2,FALSE)<>\"\",VLOOKUP(F123,Companies!$B$3:$M$1250,2,FALSE),IF(VLOOKUP(F123,Companies!$B$3:$M$1250,4,FALSE)<>\"\",VLOOKUP(F123,Companies!$B$3:$M$1250,4,FALSE),IF(VLOOKUP(F123,Companies!$B$3:$M$1250,6,FALSE)<>\"\",VLOOKUP(F123,Companies!$B$3:$M$1250,6,FALSE),IF(VLOOKUP(F123,Companies!$B$3:$M$1250,8,FALSE)<>\"\",VLOOKUP(F123,Companies!$B$3:$M$1250,8,FALSE),IF(VLOOKUP(F123,Companies!$B$3:$M$1250,10,FALSE)<>\"\",VLOOKUP(F123,Companies!$B$3:$M$1250,10,FALSE),\"\")))))","v":""},{"$f":"IF(VLOOKUP(F123,Companies!$B$3:$M$1250,3,FALSE)<>\"\",VLOOKUP(F123,Companies!$B$3:$M$1250,3,FALSE),IF(VLOOKUP(F123,Companies!$B$3:$M$1250,5,FALSE)<>\"\",VLOOKUP(F123,Companies!$B$3:$M$1250,5,FALSE),IF(VLOOKUP(F123,Companies!$B$3:$M$1250,7,FALSE)<>\"\",VLOOKUP(F123,Companies!$B$3:$M$1250,7,FALSE),IF(VLOOKUP(F123,Companies!$B$3:$M$1250,9,FALSE)<>\"\",VLOOKUP(F123,Companies!$B$3:$M$1250,9,FALSE),IF(VLOOKUP(F123,Companies!$B$3:$M$1250,11,FALSE)<>\"\",VLOOKUP(F123,Companies!$B$3:$M$1250,11,FALSE),\"\")))))","v":"bianca.macher@magna.com"},{"$f":"IF(VLOOKUP(F123,Companies!$B$3:$M$1250,12,FALSE)<>\"\",VLOOKUP(F123,Companies!$B$3:$M$1250,12,FALSE),\"\")","v":""}]
[{"$nulls":3},"VSFR","411MAGNASTEYRFAHRZEU","MAGNA STEYR FAHRZEUGTECHNIK AG & CO KG","2019-04-30","2019-05-30","Invoice","19.04.0056",{"v":300,"d":"300.00 €"},{"$f":"IF(VLOOKUP(F124,Companies!$B$3:$M$1250,2,FALSE)<>\"\",VLOOKUP(F124,Companies!$B$3:$M$1250,2,FALSE),IF(VLOOKUP(F124,Companies!$B$3:$M$1250,4,FALSE)<>\"\",VLOOKUP(F124,Companies!$B$3:$M$1250,4,FALSE),IF(VLOOKUP(F124,Companies!$B$3:$M$1250,6,FALSE)<>\"\",VLOOKUP(F124,Companies!$B$3:$M$1250,6,FALSE),IF(VLOOKUP(F124,Companies!$B$3:$M$1250,8,FALSE)<>\"\",VLOOKUP(F124,Companies!$B$3:$M$1250,8,FALSE),IF(VLOOKUP(F124,Companies!$B$3:$M$1250,10,FALSE)<>\"\",VLOOKUP(F124,Companies!$B$3:$M$1250,10,FALSE),\"\")))))","v":""},{"$f":"IF(VLOOKUP(F124,Companies!$B$3:$M$1250,3,FALSE)<>\"\",VLOOKUP(F124,Companies!$B$3:$M$1250,3,FALSE),IF(VLOOKUP(F124,Companies!$B$3:$M$1250,5,FALSE)<>\"\",VLOOKUP(F124,Companies!$B$3:$M$1250,5,FALSE),IF(VLOOKUP(F124,Companies!$B$3:$M$1250,7,FALSE)<>\"\",VLOOKUP(F124,Companies!$B$3:$M$1250,7,FALSE),IF(VLOOKUP(F124,Companies!$B$3:$M$1250,9,FALSE)<>\"\",VLOOKUP(F124,Companies!$B$3:$M$1250,9,FALSE),IF(VLOOKUP(F124,Companies!$B$3:$M$1250,11,FALSE)<>\"\",VLOOKUP(F124,Companies!$B$3:$M$1250,11,FALSE),\"\")))))","v":"manfred.zatsch@magna.com"},{"$f":"IF(VLOOKUP(F124,Companies!$B$3:$M$1250,12,FALSE)<>\"\",VLOOKUP(F124,Companies!$B$3:$M$1250,12,FALSE),\"\")","v":""}]
[{"$nulls":3},"VSFR","411MAGNASTEYRFAHRZEU","MAGNA STEYR FAHRZEUGTECHNIK AG & CO KG","2019-05-31","2019-06-30","Invoice","FA19050130",{"v":59685.37,"d":"59,685.37 €"},{"$f":"IF(VLOOKUP(F125,Companies!$B$3:$M$1250,2,FALSE)<>\"\",VLOOKUP(F125,Companies!$B$3:$M$1250,2,FALSE),IF(VLOOKUP(F125,Companies!$B$3:$M$1250,4,FALSE)<>\"\",VLOOKUP(F125,Companies!$B$3:$M$1250,4,FALSE),IF(VLOOKUP(F125,Companies!$B$3:$M$1250,6,FALSE)<>\"\",VLOOKUP(F125,Companies!$B$3:$M$1250,6,FALSE),IF(VLOOKUP(F125,Companies!$B$3:$M$1250,8,FALSE)<>\"\",VLOOKUP(F125,Companies!$B$3:$M$1250,8,FALSE),IF(VLOOKUP(F125,Companies!$B$3:$M$1250,10,FALSE)<>\"\",VLOOKUP(F125,Companies!$B$3:$M$1250,10,FALSE),\"\")))))","v":""},{"$f":"IF(VLOOKUP(F125,Companies!$B$3:$M$1250,3,FALSE)<>\"\",VLOOKUP(F125,Companies!$B$3:$M$1250,3,FALSE),IF(VLOOKUP(F125,Companies!$B$3:$M$1250,5,FALSE)<>\"\",VLOOKUP(F125,Companies!$B$3:$M$1250,5,FALSE),IF(VLOOKUP(F125,Companies!$B$3:$M$1250,7,FALSE)<>\"\",VLOOKUP(F125,Companies!$B$3:$M$1250,7,FALSE),IF(VLOOKUP(F125,Companies!$B$3:$M$1250,9,FALSE)<>\"\",VLOOKUP(F125,Companies!$B$3:$M$1250,9,FALSE),IF(VLOOKUP(F125,Companies!$B$3:$M$1250,11,FALSE)<>\"\",VLOOKUP(F125,Companies!$B$3:$M$1250,11,FALSE),\"\")))))","v":"manfred.zatsch@magna.com"},{"$f":"IF(VLOOKUP(F125,Companies!$B$3:$M$1250,12,FALSE)<>\"\",VLOOKUP(F125,Companies!$B$3:$M$1250,12,FALSE),\"\")","v":""}]
[{"$nulls":3},"VSFR","411MANNENTERPRISESLT","MANN ENTERPRISES LTD","2019-05-31","2019-06-30","Invoice","FA19050040",{"v":36.67,"d":"36.67 €"},{"$f":"IF(VLOOKUP(F126,Companies!$B$3:$M$1250,2,FALSE)<>\"\",VLOOKUP(F126,Companies!$B$3:$M$1250,2,FALSE),IF(VLOOKUP(F126,Companies!$B$3:$M$1250,4,FALSE)<>\"\",VLOOKUP(F126,Companies!$B$3:$M$1250,4,FALSE),IF(VLOOKUP(F126,Companies!$B$3:$M$1250,6,FALSE)<>\"\",VLOOKUP(F126,Companies!$B$3:$M$1250,6,FALSE),IF(VLOOKUP(F126,Companies!$B$3:$M$1250,8,FALSE)<>\"\",VLOOKUP(F126,Companies!$B$3:$M$1250,8,FALSE),IF(VLOOKUP(F126,Companies!$B$3:$M$1250,10,FALSE)<>\"\",VLOOKUP(F126,Companies!$B$3:$M$1250,10,FALSE),\"\")))))","v":""},{"$f":"IF(VLOOKUP(F126,Companies!$B$3:$M$1250,3,FALSE)<>\"\",VLOOKUP(F126,Companies!$B$3:$M$1250,3,FALSE),IF(VLOOKUP(F126,Companies!$B$3:$M$1250,5,FALSE)<>\"\",VLOOKUP(F126,Companies!$B$3:$M$1250,5,FALSE),IF(VLOOKUP(F126,Companies!$B$3:$M$1250,7,FALSE)<>\"\",VLOOKUP(F126,Companies!$B$3:$M$1250,7,FALSE),IF(VLOOKUP(F126,Companies!$B$3:$M$1250,9,FALSE)<>\"\",VLOOKUP(F126,Companies!$B$3:$M$1250,9,FALSE),IF(VLOOKUP(F126,Companies!$B$3:$M$1250,11,FALSE)<>\"\",VLOOKUP(F126,Companies!$B$3:$M$1250,11,FALSE),\"\")))))","v":""},{"$f":"IF(VLOOKUP(F126,Companies!$B$3:$M$1250,12,FALSE)<>\"\",VLOOKUP(F126,Companies!$B$3:$M$1250,12,FALSE),\"\")","v":""}]
[{"$nulls":3},"VSPT","C000340615","MDS - Corretor de Seguros SA","2019-02-28","2019-03-30","Invoice","FA 2019/23",{"v":2814.95,"d":"2,814.95 €"},{"$f":"IF(VLOOKUP(F127,Companies!$B$3:$M$1250,2,FALSE)<>\"\",VLOOKUP(F127,Companies!$B$3:$M$1250,2,FALSE),IF(VLOOKUP(F127,Companies!$B$3:$M$1250,4,FALSE)<>\"\",VLOOKUP(F127,Companies!$B$3:$M$1250,4,FALSE),IF(VLOOKUP(F127,Companies!$B$3:$M$1250,6,FALSE)<>\"\",VLOOKUP(F127,Companies!$B$3:$M$1250,6,FALSE),IF(VLOOKUP(F127,Companies!$B$3:$M$1250,8,FALSE)<>\"\",VLOOKUP(F127,Companies!$B$3:$M$1250,8,FALSE),IF(VLOOKUP(F127,Companies!$B$3:$M$1250,10,FALSE)<>\"\",VLOOKUP(F127,Companies!$B$3:$M$1250,10,FALSE),\"\")))))","v":""},{"$f":"IF(VLOOKUP(F127,Companies!$B$3:$M$1250,3,FALSE)<>\"\",VLOOKUP(F127,Companies!$B$3:$M$1250,3,FALSE),IF(VLOOKUP(F127,Companies!$B$3:$M$1250,5,FALSE)<>\"\",VLOOKUP(F127,Companies!$B$3:$M$1250,5,FALSE),IF(VLOOKUP(F127,Companies!$B$3:$M$1250,7,FALSE)<>\"\",VLOOKUP(F127,Companies!$B$3:$M$1250,7,FALSE),IF(VLOOKUP(F127,Companies!$B$3:$M$1250,9,FALSE)<>\"\",VLOOKUP(F127,Companies!$B$3:$M$1250,9,FALSE),IF(VLOOKUP(F127,Companies!$B$3:$M$1250,11,FALSE)<>\"\",VLOOKUP(F127,Companies!$B$3:$M$1250,11,FALSE),\"\")))))","v":""},{"$f":"IF(VLOOKUP(F127,Companies!$B$3:$M$1250,12,FALSE)<>\"\",VLOOKUP(F127,Companies!$B$3:$M$1250,12,FALSE),\"\")","v":""}]
[{"$nulls":3},"VSPT","C000340615","MDS - Corretor de Seguros SA","2019-05-31","2019-05-31","Credit Note","NC 2019/8",{"v":-76.32,"d":"-76.32 €"},{"$f":"IF(VLOOKUP(F128,Companies!$B$3:$M$1250,2,FALSE)<>\"\",VLOOKUP(F128,Companies!$B$3:$M$1250,2,FALSE),IF(VLOOKUP(F128,Companies!$B$3:$M$1250,4,FALSE)<>\"\",VLOOKUP(F128,Companies!$B$3:$M$1250,4,FALSE),IF(VLOOKUP(F128,Companies!$B$3:$M$1250,6,FALSE)<>\"\",VLOOKUP(F128,Companies!$B$3:$M$1250,6,FALSE),IF(VLOOKUP(F128,Companies!$B$3:$M$1250,8,FALSE)<>\"\",VLOOKUP(F128,Companies!$B$3:$M$1250,8,FALSE),IF(VLOOKUP(F128,Companies!$B$3:$M$1250,10,FALSE)<>\"\",VLOOKUP(F128,Companies!$B$3:$M$1250,10,FALSE),\"\")))))","v":""},{"$f":"IF(VLOOKUP(F128,Companies!$B$3:$M$1250,3,FALSE)<>\"\",VLOOKUP(F128,Companies!$B$3:$M$1250,3,FALSE),IF(VLOOKUP(F128,Companies!$B$3:$M$1250,5,FALSE)<>\"\",VLOOKUP(F128,Companies!$B$3:$M$1250,5,FALSE),IF(VLOOKUP(F128,Companies!$B$3:$M$1250,7,FALSE)<>\"\",VLOOKUP(F128,Companies!$B$3:$M$1250,7,FALSE),IF(VLOOKUP(F128,Companies!$B$3:$M$1250,9,FALSE)<>\"\",VLOOKUP(F128,Companies!$B$3:$M$1250,9,FALSE),IF(VLOOKUP(F128,Companies!$B$3:$M$1250,11,FALSE)<>\"\",VLOOKUP(F128,Companies!$B$3:$M$1250,11,FALSE),\"\")))))","v":""},{"$f":"IF(VLOOKUP(F128,Companies!$B$3:$M$1250,12,FALSE)<>\"\",VLOOKUP(F128,Companies!$B$3:$M$1250,12,FALSE),\"\")","v":""}]
[{"$nulls":3},"VSFR","411MEDICALANDHEALTHE","MEDICAL AND HEALTHCARE","2019-04-30","2019-05-30","Invoice","19.04.0057",{"v":176.4,"d":"176.40 €"},{"$f":"IF(VLOOKUP(F129,Companies!$B$3:$M$1250,2,FALSE)<>\"\",VLOOKUP(F129,Companies!$B$3:$M$1250,2,FALSE),IF(VLOOKUP(F129,Companies!$B$3:$M$1250,4,FALSE)<>\"\",VLOOKUP(F129,Companies!$B$3:$M$1250,4,FALSE),IF(VLOOKUP(F129,Companies!$B$3:$M$1250,6,FALSE)<>\"\",VLOOKUP(F129,Companies!$B$3:$M$1250,6,FALSE),IF(VLOOKUP(F129,Companies!$B$3:$M$1250,8,FALSE)<>\"\",VLOOKUP(F129,Companies!$B$3:$M$1250,8,FALSE),IF(VLOOKUP(F129,Companies!$B$3:$M$1250,10,FALSE)<>\"\",VLOOKUP(F129,Companies!$B$3:$M$1250,10,FALSE),\"\")))))","v":""},{"$f":"IF(VLOOKUP(F129,Companies!$B$3:$M$1250,3,FALSE)<>\"\",VLOOKUP(F129,Companies!$B$3:$M$1250,3,FALSE),IF(VLOOKUP(F129,Companies!$B$3:$M$1250,5,FALSE)<>\"\",VLOOKUP(F129,Companies!$B$3:$M$1250,5,FALSE),IF(VLOOKUP(F129,Companies!$B$3:$M$1250,7,FALSE)<>\"\",VLOOKUP(F129,Companies!$B$3:$M$1250,7,FALSE),IF(VLOOKUP(F129,Companies!$B$3:$M$1250,9,FALSE)<>\"\",VLOOKUP(F129,Companies!$B$3:$M$1250,9,FALSE),IF(VLOOKUP(F129,Companies!$B$3:$M$1250,11,FALSE)<>\"\",VLOOKUP(F129,Companies!$B$3:$M$1250,11,FALSE),\"\")))))","v":""},{"$f":"IF(VLOOKUP(F129,Companies!$B$3:$M$1250,12,FALSE)<>\"\",VLOOKUP(F129,Companies!$B$3:$M$1250,12,FALSE),\"\")","v":""}]
[{"$nulls":3},"VSFR","411MEURA","MEURA","2019-05-31","2019-06-30","Invoice","FA19050179",{"v":3758.01,"d":"3,758.01 €"},{"$f":"IF(VLOOKUP(F130,Companies!$B$3:$M$1250,2,FALSE)<>\"\",VLOOKUP(F130,Companies!$B$3:$M$1250,2,FALSE),IF(VLOOKUP(F130,Companies!$B$3:$M$1250,4,FALSE)<>\"\",VLOOKUP(F130,Companies!$B$3:$M$1250,4,FALSE),IF(VLOOKUP(F130,Companies!$B$3:$M$1250,6,FALSE)<>\"\",VLOOKUP(F130,Companies!$B$3:$M$1250,6,FALSE),IF(VLOOKUP(F130,Companies!$B$3:$M$1250,8,FALSE)<>\"\",VLOOKUP(F130,Companies!$B$3:$M$1250,8,FALSE),IF(VLOOKUP(F130,Companies!$B$3:$M$1250,10,FALSE)<>\"\",VLOOKUP(F130,Companies!$B$3:$M$1250,10,FALSE),\"\")))))","v":""},{"$f":"IF(VLOOKUP(F130,Companies!$B$3:$M$1250,3,FALSE)<>\"\",VLOOKUP(F130,Companies!$B$3:$M$1250,3,FALSE),IF(VLOOKUP(F130,Companies!$B$3:$M$1250,5,FALSE)<>\"\",VLOOKUP(F130,Companies!$B$3:$M$1250,5,FALSE),IF(VLOOKUP(F130,Companies!$B$3:$M$1250,7,FALSE)<>\"\",VLOOKUP(F130,Companies!$B$3:$M$1250,7,FALSE),IF(VLOOKUP(F130,Companies!$B$3:$M$1250,9,FALSE)<>\"\",VLOOKUP(F130,Companies!$B$3:$M$1250,9,FALSE),IF(VLOOKUP(F130,Companies!$B$3:$M$1250,11,FALSE)<>\"\",VLOOKUP(F130,Companies!$B$3:$M$1250,11,FALSE),\"\")))))","v":""},{"$f":"IF(VLOOKUP(F130,Companies!$B$3:$M$1250,12,FALSE)<>\"\",VLOOKUP(F130,Companies!$B$3:$M$1250,12,FALSE),\"\")","v":""}]
[{"$nulls":3},"VSFR","411AGLIMPORT","MILIBOO","2019-02-28","2019-03-30","Invoice","19.02.0187",{"v":1347.98,"d":"1,347.98 €"},{"$f":"IF(VLOOKUP(F131,Companies!$B$3:$M$1250,2,FALSE)<>\"\",VLOOKUP(F131,Companies!$B$3:$M$1250,2,FALSE),IF(VLOOKUP(F131,Companies!$B$3:$M$1250,4,FALSE)<>\"\",VLOOKUP(F131,Companies!$B$3:$M$1250,4,FALSE),IF(VLOOKUP(F131,Companies!$B$3:$M$1250,6,FALSE)<>\"\",VLOOKUP(F131,Companies!$B$3:$M$1250,6,FALSE),IF(VLOOKUP(F131,Companies!$B$3:$M$1250,8,FALSE)<>\"\",VLOOKUP(F131,Companies!$B$3:$M$1250,8,FALSE),IF(VLOOKUP(F131,Companies!$B$3:$M$1250,10,FALSE)<>\"\",VLOOKUP(F131,Companies!$B$3:$M$1250,10,FALSE),\"\")))))","v":""},{"$f":"IF(VLOOKUP(F131,Companies!$B$3:$M$1250,3,FALSE)<>\"\",VLOOKUP(F131,Companies!$B$3:$M$1250,3,FALSE),IF(VLOOKUP(F131,Companies!$B$3:$M$1250,5,FALSE)<>\"\",VLOOKUP(F131,Companies!$B$3:$M$1250,5,FALSE),IF(VLOOKUP(F131,Companies!$B$3:$M$1250,7,FALSE)<>\"\",VLOOKUP(F131,Companies!$B$3:$M$1250,7,FALSE),IF(VLOOKUP(F131,Companies!$B$3:$M$1250,9,FALSE)<>\"\",VLOOKUP(F131,Companies!$B$3:$M$1250,9,FALSE),IF(VLOOKUP(F131,Companies!$B$3:$M$1250,11,FALSE)<>\"\",VLOOKUP(F131,Companies!$B$3:$M$1250,11,FALSE),\"\")))))","v":""},{"$f":"IF(VLOOKUP(F131,Companies!$B$3:$M$1250,12,FALSE)<>\"\",VLOOKUP(F131,Companies!$B$3:$M$1250,12,FALSE),\"\")","v":""}]
[{"$nulls":3},"VSFR","411AGLIMPORT","MILIBOO","2019-03-31","2019-04-30","Invoice","19.03.0048",{"v":448,"d":"448.00 €"},{"$f":"IF(VLOOKUP(F132,Companies!$B$3:$M$1250,2,FALSE)<>\"\",VLOOKUP(F132,Companies!$B$3:$M$1250,2,FALSE),IF(VLOOKUP(F132,Companies!$B$3:$M$1250,4,FALSE)<>\"\",VLOOKUP(F132,Companies!$B$3:$M$1250,4,FALSE),IF(VLOOKUP(F132,Companies!$B$3:$M$1250,6,FALSE)<>\"\",VLOOKUP(F132,Companies!$B$3:$M$1250,6,FALSE),IF(VLOOKUP(F132,Companies!$B$3:$M$1250,8,FALSE)<>\"\",VLOOKUP(F132,Companies!$B$3:$M$1250,8,FALSE),IF(VLOOKUP(F132,Companies!$B$3:$M$1250,10,FALSE)<>\"\",VLOOKUP(F132,Companies!$B$3:$M$1250,10,FALSE),\"\")))))","v":""},{"$f":"IF(VLOOKUP(F132,Companies!$B$3:$M$1250,3,FALSE)<>\"\",VLOOKUP(F132,Companies!$B$3:$M$1250,3,FALSE),IF(VLOOKUP(F132,Companies!$B$3:$M$1250,5,FALSE)<>\"\",VLOOKUP(F132,Companies!$B$3:$M$1250,5,FALSE),IF(VLOOKUP(F132,Companies!$B$3:$M$1250,7,FALSE)<>\"\",VLOOKUP(F132,Companies!$B$3:$M$1250,7,FALSE),IF(VLOOKUP(F132,Companies!$B$3:$M$1250,9,FALSE)<>\"\",VLOOKUP(F132,Companies!$B$3:$M$1250,9,FALSE),IF(VLOOKUP(F132,Companies!$B$3:$M$1250,11,FALSE)<>\"\",VLOOKUP(F132,Companies!$B$3:$M$1250,11,FALSE),\"\")))))","v":""},{"$f":"IF(VLOOKUP(F132,Companies!$B$3:$M$1250,12,FALSE)<>\"\",VLOOKUP(F132,Companies!$B$3:$M$1250,12,FALSE),\"\")","v":""}]
[{"$nulls":3},"VSFR","411AGLIMPORT","MILIBOO","2019-04-30","2019-05-30","Invoice","19.04.0148",{"v":3390,"d":"3,390.00 €"},{"$f":"IF(VLOOKUP(F133,Companies!$B$3:$M$1250,2,FALSE)<>\"\",VLOOKUP(F133,Companies!$B$3:$M$1250,2,FALSE),IF(VLOOKUP(F133,Companies!$B$3:$M$1250,4,FALSE)<>\"\",VLOOKUP(F133,Companies!$B$3:$M$1250,4,FALSE),IF(VLOOKUP(F133,Companies!$B$3:$M$1250,6,FALSE)<>\"\",VLOOKUP(F133,Companies!$B$3:$M$1250,6,FALSE),IF(VLOOKUP(F133,Companies!$B$3:$M$1250,8,FALSE)<>\"\",VLOOKUP(F133,Companies!$B$3:$M$1250,8,FALSE),IF(VLOOKUP(F133,Companies!$B$3:$M$1250,10,FALSE)<>\"\",VLOOKUP(F133,Companies!$B$3:$M$1250,10,FALSE),\"\")))))","v":""},{"$f":"IF(VLOOKUP(F133,Companies!$B$3:$M$1250,3,FALSE)<>\"\",VLOOKUP(F133,Companies!$B$3:$M$1250,3,FALSE),IF(VLOOKUP(F133,Companies!$B$3:$M$1250,5,FALSE)<>\"\",VLOOKUP(F133,Companies!$B$3:$M$1250,5,FALSE),IF(VLOOKUP(F133,Companies!$B$3:$M$1250,7,FALSE)<>\"\",VLOOKUP(F133,Companies!$B$3:$M$1250,7,FALSE),IF(VLOOKUP(F133,Companies!$B$3:$M$1250,9,FALSE)<>\"\",VLOOKUP(F133,Companies!$B$3:$M$1250,9,FALSE),IF(VLOOKUP(F133,Companies!$B$3:$M$1250,11,FALSE)<>\"\",VLOOKUP(F133,Companies!$B$3:$M$1250,11,FALSE),\"\")))))","v":""},{"$f":"IF(VLOOKUP(F133,Companies!$B$3:$M$1250,12,FALSE)<>\"\",VLOOKUP(F133,Companies!$B$3:$M$1250,12,FALSE),\"\")","v":""}]
[{"$nulls":3},"VSFR","411AGLIMPORT","MILIBOO","2019-05-31","2019-06-30","Invoice","FA19050037",{"v":1086,"d":"1,086.00 €"},{"$f":"IF(VLOOKUP(F134,Companies!$B$3:$M$1250,2,FALSE)<>\"\",VLOOKUP(F134,Companies!$B$3:$M$1250,2,FALSE),IF(VLOOKUP(F134,Companies!$B$3:$M$1250,4,FALSE)<>\"\",VLOOKUP(F134,Companies!$B$3:$M$1250,4,FALSE),IF(VLOOKUP(F134,Companies!$B$3:$M$1250,6,FALSE)<>\"\",VLOOKUP(F134,Companies!$B$3:$M$1250,6,FALSE),IF(VLOOKUP(F134,Companies!$B$3:$M$1250,8,FALSE)<>\"\",VLOOKUP(F134,Companies!$B$3:$M$1250,8,FALSE),IF(VLOOKUP(F134,Companies!$B$3:$M$1250,10,FALSE)<>\"\",VLOOKUP(F134,Companies!$B$3:$M$1250,10,FALSE),\"\")))))","v":""},{"$f":"IF(VLOOKUP(F134,Companies!$B$3:$M$1250,3,FALSE)<>\"\",VLOOKUP(F134,Companies!$B$3:$M$1250,3,FALSE),IF(VLOOKUP(F134,Companies!$B$3:$M$1250,5,FALSE)<>\"\",VLOOKUP(F134,Companies!$B$3:$M$1250,5,FALSE),IF(VLOOKUP(F134,Companies!$B$3:$M$1250,7,FALSE)<>\"\",VLOOKUP(F134,Companies!$B$3:$M$1250,7,FALSE),IF(VLOOKUP(F134,Companies!$B$3:$M$1250,9,FALSE)<>\"\",VLOOKUP(F134,Companies!$B$3:$M$1250,9,FALSE),IF(VLOOKUP(F134,Companies!$B$3:$M$1250,11,FALSE)<>\"\",VLOOKUP(F134,Companies!$B$3:$M$1250,11,FALSE),\"\")))))","v":""},{"$f":"IF(VLOOKUP(F134,Companies!$B$3:$M$1250,12,FALSE)<>\"\",VLOOKUP(F134,Companies!$B$3:$M$1250,12,FALSE),\"\")","v":""}]
[{"$nulls":3},"VSFR","411MMTCIGROUP","MMTCI Group","2019-03-31","2019-04-30","Invoice","19.03.0065",{"v":240,"d":"240.00 €"},{"$f":"IF(VLOOKUP(F135,Companies!$B$3:$M$1250,2,FALSE)<>\"\",VLOOKUP(F135,Companies!$B$3:$M$1250,2,FALSE),IF(VLOOKUP(F135,Companies!$B$3:$M$1250,4,FALSE)<>\"\",VLOOKUP(F135,Companies!$B$3:$M$1250,4,FALSE),IF(VLOOKUP(F135,Companies!$B$3:$M$1250,6,FALSE)<>\"\",VLOOKUP(F135,Companies!$B$3:$M$1250,6,FALSE),IF(VLOOKUP(F135,Companies!$B$3:$M$1250,8,FALSE)<>\"\",VLOOKUP(F135,Companies!$B$3:$M$1250,8,FALSE),IF(VLOOKUP(F135,Companies!$B$3:$M$1250,10,FALSE)<>\"\",VLOOKUP(F135,Companies!$B$3:$M$1250,10,FALSE),\"\")))))","v":""},{"$f":"IF(VLOOKUP(F135,Companies!$B$3:$M$1250,3,FALSE)<>\"\",VLOOKUP(F135,Companies!$B$3:$M$1250,3,FALSE),IF(VLOOKUP(F135,Companies!$B$3:$M$1250,5,FALSE)<>\"\",VLOOKUP(F135,Companies!$B$3:$M$1250,5,FALSE),IF(VLOOKUP(F135,Companies!$B$3:$M$1250,7,FALSE)<>\"\",VLOOKUP(F135,Companies!$B$3:$M$1250,7,FALSE),IF(VLOOKUP(F135,Companies!$B$3:$M$1250,9,FALSE)<>\"\",VLOOKUP(F135,Companies!$B$3:$M$1250,9,FALSE),IF(VLOOKUP(F135,Companies!$B$3:$M$1250,11,FALSE)<>\"\",VLOOKUP(F135,Companies!$B$3:$M$1250,11,FALSE),\"\")))))","v":""},{"$f":"IF(VLOOKUP(F135,Companies!$B$3:$M$1250,12,FALSE)<>\"\",VLOOKUP(F135,Companies!$B$3:$M$1250,12,FALSE),\"\")","v":""}]
[{"$nulls":3},"VSPT","C000004004","MOTA-ENGIL SGPS S.A.","2019-04-30","2019-05-30","Invoice","FA 2019/43",{"v":889.07,"d":"889.07 €"},{"$f":"IF(VLOOKUP(F136,Companies!$B$3:$M$1250,2,FALSE)<>\"\",VLOOKUP(F136,Companies!$B$3:$M$1250,2,FALSE),IF(VLOOKUP(F136,Companies!$B$3:$M$1250,4,FALSE)<>\"\",VLOOKUP(F136,Companies!$B$3:$M$1250,4,FALSE),IF(VLOOKUP(F136,Companies!$B$3:$M$1250,6,FALSE)<>\"\",VLOOKUP(F136,Companies!$B$3:$M$1250,6,FALSE),IF(VLOOKUP(F136,Companies!$B$3:$M$1250,8,FALSE)<>\"\",VLOOKUP(F136,Companies!$B$3:$M$1250,8,FALSE),IF(VLOOKUP(F136,Companies!$B$3:$M$1250,10,FALSE)<>\"\",VLOOKUP(F136,Companies!$B$3:$M$1250,10,FALSE),\"\")))))","v":""},{"$f":"IF(VLOOKUP(F136,Companies!$B$3:$M$1250,3,FALSE)<>\"\",VLOOKUP(F136,Companies!$B$3:$M$1250,3,FALSE),IF(VLOOKUP(F136,Companies!$B$3:$M$1250,5,FALSE)<>\"\",VLOOKUP(F136,Companies!$B$3:$M$1250,5,FALSE),IF(VLOOKUP(F136,Companies!$B$3:$M$1250,7,FALSE)<>\"\",VLOOKUP(F136,Companies!$B$3:$M$1250,7,FALSE),IF(VLOOKUP(F136,Companies!$B$3:$M$1250,9,FALSE)<>\"\",VLOOKUP(F136,Companies!$B$3:$M$1250,9,FALSE),IF(VLOOKUP(F136,Companies!$B$3:$M$1250,11,FALSE)<>\"\",VLOOKUP(F136,Companies!$B$3:$M$1250,11,FALSE),\"\")))))","v":"jose.a.pinto@mota-engil.pt "},{"$f":"IF(VLOOKUP(F136,Companies!$B$3:$M$1250,12,FALSE)<>\"\",VLOOKUP(F136,Companies!$B$3:$M$1250,12,FALSE),\"\")","v":""}]
[{"$nulls":3},"VSUK","411NANJINGTATAAUTOCO","NANJING TATA AUTOCOMP SYSTEMS LIMITED","2019-04-30","2019-05-30","Invoice","04.19.0033",{"v":950,"d":"950.00 €"},{"$f":"IF(VLOOKUP(F137,Companies!$B$3:$M$1250,2,FALSE)<>\"\",VLOOKUP(F137,Companies!$B$3:$M$1250,2,FALSE),IF(VLOOKUP(F137,Companies!$B$3:$M$1250,4,FALSE)<>\"\",VLOOKUP(F137,Companies!$B$3:$M$1250,4,FALSE),IF(VLOOKUP(F137,Companies!$B$3:$M$1250,6,FALSE)<>\"\",VLOOKUP(F137,Companies!$B$3:$M$1250,6,FALSE),IF(VLOOKUP(F137,Companies!$B$3:$M$1250,8,FALSE)<>\"\",VLOOKUP(F137,Companies!$B$3:$M$1250,8,FALSE),IF(VLOOKUP(F137,Companies!$B$3:$M$1250,10,FALSE)<>\"\",VLOOKUP(F137,Companies!$B$3:$M$1250,10,FALSE),\"\")))))","v":""},{"$f":"IF(VLOOKUP(F137,Companies!$B$3:$M$1250,3,FALSE)<>\"\",VLOOKUP(F137,Companies!$B$3:$M$1250,3,FALSE),IF(VLOOKUP(F137,Companies!$B$3:$M$1250,5,FALSE)<>\"\",VLOOKUP(F137,Companies!$B$3:$M$1250,5,FALSE),IF(VLOOKUP(F137,Companies!$B$3:$M$1250,7,FALSE)<>\"\",VLOOKUP(F137,Companies!$B$3:$M$1250,7,FALSE),IF(VLOOKUP(F137,Companies!$B$3:$M$1250,9,FALSE)<>\"\",VLOOKUP(F137,Companies!$B$3:$M$1250,9,FALSE),IF(VLOOKUP(F137,Companies!$B$3:$M$1250,11,FALSE)<>\"\",VLOOKUP(F137,Companies!$B$3:$M$1250,11,FALSE),\"\")))))","v":""},{"$f":"IF(VLOOKUP(F137,Companies!$B$3:$M$1250,12,FALSE)<>\"\",VLOOKUP(F137,Companies!$B$3:$M$1250,12,FALSE),\"\")","v":""}]
[{"$nulls":3},"VSUK","411NANJINGTATAAUTOCO","NANJING TATA AUTOCOMP SYSTEMS LIMITED","2019-05-31","2019-06-30","Invoice","IN05190022",{"v":7894.17,"d":"7,894.17 €"},{"$f":"IF(VLOOKUP(F138,Companies!$B$3:$M$1250,2,FALSE)<>\"\",VLOOKUP(F138,Companies!$B$3:$M$1250,2,FALSE),IF(VLOOKUP(F138,Companies!$B$3:$M$1250,4,FALSE)<>\"\",VLOOKUP(F138,Companies!$B$3:$M$1250,4,FALSE),IF(VLOOKUP(F138,Companies!$B$3:$M$1250,6,FALSE)<>\"\",VLOOKUP(F138,Companies!$B$3:$M$1250,6,FALSE),IF(VLOOKUP(F138,Companies!$B$3:$M$1250,8,FALSE)<>\"\",VLOOKUP(F138,Companies!$B$3:$M$1250,8,FALSE),IF(VLOOKUP(F138,Companies!$B$3:$M$1250,10,FALSE)<>\"\",VLOOKUP(F138,Companies!$B$3:$M$1250,10,FALSE),\"\")))))","v":""},{"$f":"IF(VLOOKUP(F138,Companies!$B$3:$M$1250,3,FALSE)<>\"\",VLOOKUP(F138,Companies!$B$3:$M$1250,3,FALSE),IF(VLOOKUP(F138,Companies!$B$3:$M$1250,5,FALSE)<>\"\",VLOOKUP(F138,Companies!$B$3:$M$1250,5,FALSE),IF(VLOOKUP(F138,Companies!$B$3:$M$1250,7,FALSE)<>\"\",VLOOKUP(F138,Companies!$B$3:$M$1250,7,FALSE),IF(VLOOKUP(F138,Companies!$B$3:$M$1250,9,FALSE)<>\"\",VLOOKUP(F138,Companies!$B$3:$M$1250,9,FALSE),IF(VLOOKUP(F138,Companies!$B$3:$M$1250,11,FALSE)<>\"\",VLOOKUP(F138,Companies!$B$3:$M$1250,11,FALSE),\"\")))))","v":""},{"$f":"IF(VLOOKUP(F138,Companies!$B$3:$M$1250,12,FALSE)<>\"\",VLOOKUP(F138,Companies!$B$3:$M$1250,12,FALSE),\"\")","v":""}]
[{"$nulls":3},"VSFR","411NEXANSFRANCE","NEXANS FRANCE","2019-04-30","2019-05-30","Invoice","19.04.0240",{"v":1328.4,"d":"1,328.40 €"},{"$f":"IF(VLOOKUP(F139,Companies!$B$3:$M$1250,2,FALSE)<>\"\",VLOOKUP(F139,Companies!$B$3:$M$1250,2,FALSE),IF(VLOOKUP(F139,Companies!$B$3:$M$1250,4,FALSE)<>\"\",VLOOKUP(F139,Companies!$B$3:$M$1250,4,FALSE),IF(VLOOKUP(F139,Companies!$B$3:$M$1250,6,FALSE)<>\"\",VLOOKUP(F139,Companies!$B$3:$M$1250,6,FALSE),IF(VLOOKUP(F139,Companies!$B$3:$M$1250,8,FALSE)<>\"\",VLOOKUP(F139,Companies!$B$3:$M$1250,8,FALSE),IF(VLOOKUP(F139,Companies!$B$3:$M$1250,10,FALSE)<>\"\",VLOOKUP(F139,Companies!$B$3:$M$1250,10,FALSE),\"\")))))","v":""},{"$f":"IF(VLOOKUP(F139,Companies!$B$3:$M$1250,3,FALSE)<>\"\",VLOOKUP(F139,Companies!$B$3:$M$1250,3,FALSE),IF(VLOOKUP(F139,Companies!$B$3:$M$1250,5,FALSE)<>\"\",VLOOKUP(F139,Companies!$B$3:$M$1250,5,FALSE),IF(VLOOKUP(F139,Companies!$B$3:$M$1250,7,FALSE)<>\"\",VLOOKUP(F139,Companies!$B$3:$M$1250,7,FALSE),IF(VLOOKUP(F139,Companies!$B$3:$M$1250,9,FALSE)<>\"\",VLOOKUP(F139,Companies!$B$3:$M$1250,9,FALSE),IF(VLOOKUP(F139,Companies!$B$3:$M$1250,11,FALSE)<>\"\",VLOOKUP(F139,Companies!$B$3:$M$1250,11,FALSE),\"\")))))","v":""},{"$f":"IF(VLOOKUP(F139,Companies!$B$3:$M$1250,12,FALSE)<>\"\",VLOOKUP(F139,Companies!$B$3:$M$1250,12,FALSE),\"\")","v":"mamamamamamama"}]
[{"$nulls":3},"VSFR","411NLMK-COATING","NLMK COATING","2019-05-31","2019-06-30","Invoice","FA19050038",{"v":906.41,"d":"906.41 €"},{"$f":"IF(VLOOKUP(F140,Companies!$B$3:$M$1250,2,FALSE)<>\"\",VLOOKUP(F140,Companies!$B$3:$M$1250,2,FALSE),IF(VLOOKUP(F140,Companies!$B$3:$M$1250,4,FALSE)<>\"\",VLOOKUP(F140,Companies!$B$3:$M$1250,4,FALSE),IF(VLOOKUP(F140,Companies!$B$3:$M$1250,6,FALSE)<>\"\",VLOOKUP(F140,Companies!$B$3:$M$1250,6,FALSE),IF(VLOOKUP(F140,Companies!$B$3:$M$1250,8,FALSE)<>\"\",VLOOKUP(F140,Companies!$B$3:$M$1250,8,FALSE),IF(VLOOKUP(F140,Companies!$B$3:$M$1250,10,FALSE)<>\"\",VLOOKUP(F140,Companies!$B$3:$M$1250,10,FALSE),\"\")))))","v":""},{"$f":"IF(VLOOKUP(F140,Companies!$B$3:$M$1250,3,FALSE)<>\"\",VLOOKUP(F140,Companies!$B$3:$M$1250,3,FALSE),IF(VLOOKUP(F140,Companies!$B$3:$M$1250,5,FALSE)<>\"\",VLOOKUP(F140,Companies!$B$3:$M$1250,5,FALSE),IF(VLOOKUP(F140,Companies!$B$3:$M$1250,7,FALSE)<>\"\",VLOOKUP(F140,Companies!$B$3:$M$1250,7,FALSE),IF(VLOOKUP(F140,Companies!$B$3:$M$1250,9,FALSE)<>\"\",VLOOKUP(F140,Companies!$B$3:$M$1250,9,FALSE),IF(VLOOKUP(F140,Companies!$B$3:$M$1250,11,FALSE)<>\"\",VLOOKUP(F140,Companies!$B$3:$M$1250,11,FALSE),\"\")))))","v":""},{"$f":"IF(VLOOKUP(F140,Companies!$B$3:$M$1250,12,FALSE)<>\"\",VLOOKUP(F140,Companies!$B$3:$M$1250,12,FALSE),\"\")","v":""}]
[{"$nulls":3},"VSFR","411ODLO.SPORTS.GRP","ODLO SPORTS GROUP","2019-01-31","2019-03-02","Invoice","19.01.0125",{"v":70,"d":"70.00 €"},{"$f":"IF(VLOOKUP(F141,Companies!$B$3:$M$1250,2,FALSE)<>\"\",VLOOKUP(F141,Companies!$B$3:$M$1250,2,FALSE),IF(VLOOKUP(F141,Companies!$B$3:$M$1250,4,FALSE)<>\"\",VLOOKUP(F141,Companies!$B$3:$M$1250,4,FALSE),IF(VLOOKUP(F141,Companies!$B$3:$M$1250,6,FALSE)<>\"\",VLOOKUP(F141,Companies!$B$3:$M$1250,6,FALSE),IF(VLOOKUP(F141,Companies!$B$3:$M$1250,8,FALSE)<>\"\",VLOOKUP(F141,Companies!$B$3:$M$1250,8,FALSE),IF(VLOOKUP(F141,Companies!$B$3:$M$1250,10,FALSE)<>\"\",VLOOKUP(F141,Companies!$B$3:$M$1250,10,FALSE),\"\")))))","v":""},{"$f":"IF(VLOOKUP(F141,Companies!$B$3:$M$1250,3,FALSE)<>\"\",VLOOKUP(F141,Companies!$B$3:$M$1250,3,FALSE),IF(VLOOKUP(F141,Companies!$B$3:$M$1250,5,FALSE)<>\"\",VLOOKUP(F141,Companies!$B$3:$M$1250,5,FALSE),IF(VLOOKUP(F141,Companies!$B$3:$M$1250,7,FALSE)<>\"\",VLOOKUP(F141,Companies!$B$3:$M$1250,7,FALSE),IF(VLOOKUP(F141,Companies!$B$3:$M$1250,9,FALSE)<>\"\",VLOOKUP(F141,Companies!$B$3:$M$1250,9,FALSE),IF(VLOOKUP(F141,Companies!$B$3:$M$1250,11,FALSE)<>\"\",VLOOKUP(F141,Companies!$B$3:$M$1250,11,FALSE),\"\")))))","v":""},{"$f":"IF(VLOOKUP(F141,Companies!$B$3:$M$1250,12,FALSE)<>\"\",VLOOKUP(F141,Companies!$B$3:$M$1250,12,FALSE),\"\")","v":""}]
[{"$nulls":3},"VSFR","411ODLO.SPORTS.GRP","ODLO SPORTS GROUP","2019-02-15","2019-03-17","Invoice","19.02.0016",{"v":164.98,"d":"164.98 €"},{"$f":"IF(VLOOKUP(F142,Companies!$B$3:$M$1250,2,FALSE)<>\"\",VLOOKUP(F142,Companies!$B$3:$M$1250,2,FALSE),IF(VLOOKUP(F142,Companies!$B$3:$M$1250,4,FALSE)<>\"\",VLOOKUP(F142,Companies!$B$3:$M$1250,4,FALSE),IF(VLOOKUP(F142,Companies!$B$3:$M$1250,6,FALSE)<>\"\",VLOOKUP(F142,Companies!$B$3:$M$1250,6,FALSE),IF(VLOOKUP(F142,Companies!$B$3:$M$1250,8,FALSE)<>\"\",VLOOKUP(F142,Companies!$B$3:$M$1250,8,FALSE),IF(VLOOKUP(F142,Companies!$B$3:$M$1250,10,FALSE)<>\"\",VLOOKUP(F142,Companies!$B$3:$M$1250,10,FALSE),\"\")))))","v":""},{"$f":"IF(VLOOKUP(F142,Companies!$B$3:$M$1250,3,FALSE)<>\"\",VLOOKUP(F142,Companies!$B$3:$M$1250,3,FALSE),IF(VLOOKUP(F142,Companies!$B$3:$M$1250,5,FALSE)<>\"\",VLOOKUP(F142,Companies!$B$3:$M$1250,5,FALSE),IF(VLOOKUP(F142,Companies!$B$3:$M$1250,7,FALSE)<>\"\",VLOOKUP(F142,Companies!$B$3:$M$1250,7,FALSE),IF(VLOOKUP(F142,Companies!$B$3:$M$1250,9,FALSE)<>\"\",VLOOKUP(F142,Companies!$B$3:$M$1250,9,FALSE),IF(VLOOKUP(F142,Companies!$B$3:$M$1250,11,FALSE)<>\"\",VLOOKUP(F142,Companies!$B$3:$M$1250,11,FALSE),\"\")))))","v":""},{"$f":"IF(VLOOKUP(F142,Companies!$B$3:$M$1250,12,FALSE)<>\"\",VLOOKUP(F142,Companies!$B$3:$M$1250,12,FALSE),\"\")","v":""}]
[{"$nulls":3},"VSFR","411OMYAINTERNATIONAL","OMYA INTERNATIONAL AG","2019-04-30","2019-05-30","Invoice","19.04.0045",{"v":345.99,"d":"345.99 €"},{"$f":"IF(VLOOKUP(F143,Companies!$B$3:$M$1250,2,FALSE)<>\"\",VLOOKUP(F143,Companies!$B$3:$M$1250,2,FALSE),IF(VLOOKUP(F143,Companies!$B$3:$M$1250,4,FALSE)<>\"\",VLOOKUP(F143,Companies!$B$3:$M$1250,4,FALSE),IF(VLOOKUP(F143,Companies!$B$3:$M$1250,6,FALSE)<>\"\",VLOOKUP(F143,Companies!$B$3:$M$1250,6,FALSE),IF(VLOOKUP(F143,Companies!$B$3:$M$1250,8,FALSE)<>\"\",VLOOKUP(F143,Companies!$B$3:$M$1250,8,FALSE),IF(VLOOKUP(F143,Companies!$B$3:$M$1250,10,FALSE)<>\"\",VLOOKUP(F143,Companies!$B$3:$M$1250,10,FALSE),\"\")))))","v":""},{"$f":"IF(VLOOKUP(F143,Companies!$B$3:$M$1250,3,FALSE)<>\"\",VLOOKUP(F143,Companies!$B$3:$M$1250,3,FALSE),IF(VLOOKUP(F143,Companies!$B$3:$M$1250,5,FALSE)<>\"\",VLOOKUP(F143,Companies!$B$3:$M$1250,5,FALSE),IF(VLOOKUP(F143,Companies!$B$3:$M$1250,7,FALSE)<>\"\",VLOOKUP(F143,Companies!$B$3:$M$1250,7,FALSE),IF(VLOOKUP(F143,Companies!$B$3:$M$1250,9,FALSE)<>\"\",VLOOKUP(F143,Companies!$B$3:$M$1250,9,FALSE),IF(VLOOKUP(F143,Companies!$B$3:$M$1250,11,FALSE)<>\"\",VLOOKUP(F143,Companies!$B$3:$M$1250,11,FALSE),\"\")))))","v":""},{"$f":"IF(VLOOKUP(F143,Companies!$B$3:$M$1250,12,FALSE)<>\"\",VLOOKUP(F143,Companies!$B$3:$M$1250,12,FALSE),\"\")","v":""}]
[{"$nulls":3},"VSFR","411PIERREPRADELPARIS","PIERRE PRADEL PARIS","2019-01-31","2019-03-02","Invoice","19.01.0196",{"v":622,"d":"622.00 €"},{"$f":"IF(VLOOKUP(F144,Companies!$B$3:$M$1250,2,FALSE)<>\"\",VLOOKUP(F144,Companies!$B$3:$M$1250,2,FALSE),IF(VLOOKUP(F144,Companies!$B$3:$M$1250,4,FALSE)<>\"\",VLOOKUP(F144,Companies!$B$3:$M$1250,4,FALSE),IF(VLOOKUP(F144,Companies!$B$3:$M$1250,6,FALSE)<>\"\",VLOOKUP(F144,Companies!$B$3:$M$1250,6,FALSE),IF(VLOOKUP(F144,Companies!$B$3:$M$1250,8,FALSE)<>\"\",VLOOKUP(F144,Companies!$B$3:$M$1250,8,FALSE),IF(VLOOKUP(F144,Companies!$B$3:$M$1250,10,FALSE)<>\"\",VLOOKUP(F144,Companies!$B$3:$M$1250,10,FALSE),\"\")))))","v":""},{"$f":"IF(VLOOKUP(F144,Companies!$B$3:$M$1250,3,FALSE)<>\"\",VLOOKUP(F144,Companies!$B$3:$M$1250,3,FALSE),IF(VLOOKUP(F144,Companies!$B$3:$M$1250,5,FALSE)<>\"\",VLOOKUP(F144,Companies!$B$3:$M$1250,5,FALSE),IF(VLOOKUP(F144,Companies!$B$3:$M$1250,7,FALSE)<>\"\",VLOOKUP(F144,Companies!$B$3:$M$1250,7,FALSE),IF(VLOOKUP(F144,Companies!$B$3:$M$1250,9,FALSE)<>\"\",VLOOKUP(F144,Companies!$B$3:$M$1250,9,FALSE),IF(VLOOKUP(F144,Companies!$B$3:$M$1250,11,FALSE)<>\"\",VLOOKUP(F144,Companies!$B$3:$M$1250,11,FALSE),\"\")))))","v":""},{"$f":"IF(VLOOKUP(F144,Companies!$B$3:$M$1250,12,FALSE)<>\"\",VLOOKUP(F144,Companies!$B$3:$M$1250,12,FALSE),\"\")","v":""}]
[{"$nulls":3},"VSFR","411PIERREPRADELPARIS","PIERRE PRADEL PARIS","2019-04-30","2019-05-30","Invoice","19.04.0155",{"v":776,"d":"776.00 €"},{"$f":"IF(VLOOKUP(F145,Companies!$B$3:$M$1250,2,FALSE)<>\"\",VLOOKUP(F145,Companies!$B$3:$M$1250,2,FALSE),IF(VLOOKUP(F145,Companies!$B$3:$M$1250,4,FALSE)<>\"\",VLOOKUP(F145,Companies!$B$3:$M$1250,4,FALSE),IF(VLOOKUP(F145,Companies!$B$3:$M$1250,6,FALSE)<>\"\",VLOOKUP(F145,Companies!$B$3:$M$1250,6,FALSE),IF(VLOOKUP(F145,Companies!$B$3:$M$1250,8,FALSE)<>\"\",VLOOKUP(F145,Companies!$B$3:$M$1250,8,FALSE),IF(VLOOKUP(F145,Companies!$B$3:$M$1250,10,FALSE)<>\"\",VLOOKUP(F145,Companies!$B$3:$M$1250,10,FALSE),\"\")))))","v":""},{"$f":"IF(VLOOKUP(F145,Companies!$B$3:$M$1250,3,FALSE)<>\"\",VLOOKUP(F145,Companies!$B$3:$M$1250,3,FALSE),IF(VLOOKUP(F145,Companies!$B$3:$M$1250,5,FALSE)<>\"\",VLOOKUP(F145,Companies!$B$3:$M$1250,5,FALSE),IF(VLOOKUP(F145,Companies!$B$3:$M$1250,7,FALSE)<>\"\",VLOOKUP(F145,Companies!$B$3:$M$1250,7,FALSE),IF(VLOOKUP(F145,Companies!$B$3:$M$1250,9,FALSE)<>\"\",VLOOKUP(F145,Companies!$B$3:$M$1250,9,FALSE),IF(VLOOKUP(F145,Companies!$B$3:$M$1250,11,FALSE)<>\"\",VLOOKUP(F145,Companies!$B$3:$M$1250,11,FALSE),\"\")))))","v":""},{"$f":"IF(VLOOKUP(F145,Companies!$B$3:$M$1250,12,FALSE)<>\"\",VLOOKUP(F145,Companies!$B$3:$M$1250,12,FALSE),\"\")","v":""}]
[{"$nulls":3},"VSFR","411PILKINGTONAUTFI","Pilkington Automotive Finland Oy","2019-05-31","2019-06-30","Invoice","FA19050060",{"v":600,"d":"600.00 €"},{"$f":"IF(VLOOKUP(F146,Companies!$B$3:$M$1250,2,FALSE)<>\"\",VLOOKUP(F146,Companies!$B$3:$M$1250,2,FALSE),IF(VLOOKUP(F146,Companies!$B$3:$M$1250,4,FALSE)<>\"\",VLOOKUP(F146,Companies!$B$3:$M$1250,4,FALSE),IF(VLOOKUP(F146,Companies!$B$3:$M$1250,6,FALSE)<>\"\",VLOOKUP(F146,Companies!$B$3:$M$1250,6,FALSE),IF(VLOOKUP(F146,Companies!$B$3:$M$1250,8,FALSE)<>\"\",VLOOKUP(F146,Companies!$B$3:$M$1250,8,FALSE),IF(VLOOKUP(F146,Companies!$B$3:$M$1250,10,FALSE)<>\"\",VLOOKUP(F146,Companies!$B$3:$M$1250,10,FALSE),\"\")))))","v":""},{"$f":"IF(VLOOKUP(F146,Companies!$B$3:$M$1250,3,FALSE)<>\"\",VLOOKUP(F146,Companies!$B$3:$M$1250,3,FALSE),IF(VLOOKUP(F146,Companies!$B$3:$M$1250,5,FALSE)<>\"\",VLOOKUP(F146,Companies!$B$3:$M$1250,5,FALSE),IF(VLOOKUP(F146,Companies!$B$3:$M$1250,7,FALSE)<>\"\",VLOOKUP(F146,Companies!$B$3:$M$1250,7,FALSE),IF(VLOOKUP(F146,Companies!$B$3:$M$1250,9,FALSE)<>\"\",VLOOKUP(F146,Companies!$B$3:$M$1250,9,FALSE),IF(VLOOKUP(F146,Companies!$B$3:$M$1250,11,FALSE)<>\"\",VLOOKUP(F146,Companies!$B$3:$M$1250,11,FALSE),\"\")))))","v":""},{"$f":"IF(VLOOKUP(F146,Companies!$B$3:$M$1250,12,FALSE)<>\"\",VLOOKUP(F146,Companies!$B$3:$M$1250,12,FALSE),\"\")","v":""}]
[{"$nulls":3},"VSUK","411PNHOMELTD","PN Home LTD","2018-09-30","2018-10-30","Invoice","09.18.0047",{"v":10800,"d":"10,800.00 €"},{"$f":"IF(VLOOKUP(F147,Companies!$B$3:$M$1250,2,FALSE)<>\"\",VLOOKUP(F147,Companies!$B$3:$M$1250,2,FALSE),IF(VLOOKUP(F147,Companies!$B$3:$M$1250,4,FALSE)<>\"\",VLOOKUP(F147,Companies!$B$3:$M$1250,4,FALSE),IF(VLOOKUP(F147,Companies!$B$3:$M$1250,6,FALSE)<>\"\",VLOOKUP(F147,Companies!$B$3:$M$1250,6,FALSE),IF(VLOOKUP(F147,Companies!$B$3:$M$1250,8,FALSE)<>\"\",VLOOKUP(F147,Companies!$B$3:$M$1250,8,FALSE),IF(VLOOKUP(F147,Companies!$B$3:$M$1250,10,FALSE)<>\"\",VLOOKUP(F147,Companies!$B$3:$M$1250,10,FALSE),\"\")))))","v":""},{"$f":"IF(VLOOKUP(F147,Companies!$B$3:$M$1250,3,FALSE)<>\"\",VLOOKUP(F147,Companies!$B$3:$M$1250,3,FALSE),IF(VLOOKUP(F147,Companies!$B$3:$M$1250,5,FALSE)<>\"\",VLOOKUP(F147,Companies!$B$3:$M$1250,5,FALSE),IF(VLOOKUP(F147,Companies!$B$3:$M$1250,7,FALSE)<>\"\",VLOOKUP(F147,Companies!$B$3:$M$1250,7,FALSE),IF(VLOOKUP(F147,Companies!$B$3:$M$1250,9,FALSE)<>\"\",VLOOKUP(F147,Companies!$B$3:$M$1250,9,FALSE),IF(VLOOKUP(F147,Companies!$B$3:$M$1250,11,FALSE)<>\"\",VLOOKUP(F147,Companies!$B$3:$M$1250,11,FALSE),\"\")))))","v":""},{"$f":"IF(VLOOKUP(F147,Companies!$B$3:$M$1250,12,FALSE)<>\"\",VLOOKUP(F147,Companies!$B$3:$M$1250,12,FALSE),\"\")","v":""}]
[{"$nulls":3},"VSUK","411PNHOMELTD","PN Home LTD","2018-12-31","2019-01-30","Invoice","12.18.0044",{"v":608,"d":"608.00 €"},{"$f":"IF(VLOOKUP(F148,Companies!$B$3:$M$1250,2,FALSE)<>\"\",VLOOKUP(F148,Companies!$B$3:$M$1250,2,FALSE),IF(VLOOKUP(F148,Companies!$B$3:$M$1250,4,FALSE)<>\"\",VLOOKUP(F148,Companies!$B$3:$M$1250,4,FALSE),IF(VLOOKUP(F148,Companies!$B$3:$M$1250,6,FALSE)<>\"\",VLOOKUP(F148,Companies!$B$3:$M$1250,6,FALSE),IF(VLOOKUP(F148,Companies!$B$3:$M$1250,8,FALSE)<>\"\",VLOOKUP(F148,Companies!$B$3:$M$1250,8,FALSE),IF(VLOOKUP(F148,Companies!$B$3:$M$1250,10,FALSE)<>\"\",VLOOKUP(F148,Companies!$B$3:$M$1250,10,FALSE),\"\")))))","v":""},{"$f":"IF(VLOOKUP(F148,Companies!$B$3:$M$1250,3,FALSE)<>\"\",VLOOKUP(F148,Companies!$B$3:$M$1250,3,FALSE),IF(VLOOKUP(F148,Companies!$B$3:$M$1250,5,FALSE)<>\"\",VLOOKUP(F148,Companies!$B$3:$M$1250,5,FALSE),IF(VLOOKUP(F148,Companies!$B$3:$M$1250,7,FALSE)<>\"\",VLOOKUP(F148,Companies!$B$3:$M$1250,7,FALSE),IF(VLOOKUP(F148,Companies!$B$3:$M$1250,9,FALSE)<>\"\",VLOOKUP(F148,Companies!$B$3:$M$1250,9,FALSE),IF(VLOOKUP(F148,Companies!$B$3:$M$1250,11,FALSE)<>\"\",VLOOKUP(F148,Companies!$B$3:$M$1250,11,FALSE),\"\")))))","v":""},{"$f":"IF(VLOOKUP(F148,Companies!$B$3:$M$1250,12,FALSE)<>\"\",VLOOKUP(F148,Companies!$B$3:$M$1250,12,FALSE),\"\")","v":""}]
[{"$nulls":3},"VSUK","411PNHOMELTD","PN Home LTD","2019-01-08","2018-07-30","Invoice","01.19.0001",{"v":7200,"d":"7,200.00 €"},{"$f":"IF(VLOOKUP(F149,Companies!$B$3:$M$1250,2,FALSE)<>\"\",VLOOKUP(F149,Companies!$B$3:$M$1250,2,FALSE),IF(VLOOKUP(F149,Companies!$B$3:$M$1250,4,FALSE)<>\"\",VLOOKUP(F149,Companies!$B$3:$M$1250,4,FALSE),IF(VLOOKUP(F149,Companies!$B$3:$M$1250,6,FALSE)<>\"\",VLOOKUP(F149,Companies!$B$3:$M$1250,6,FALSE),IF(VLOOKUP(F149,Companies!$B$3:$M$1250,8,FALSE)<>\"\",VLOOKUP(F149,Companies!$B$3:$M$1250,8,FALSE),IF(VLOOKUP(F149,Companies!$B$3:$M$1250,10,FALSE)<>\"\",VLOOKUP(F149,Companies!$B$3:$M$1250,10,FALSE),\"\")))))","v":""},{"$f":"IF(VLOOKUP(F149,Companies!$B$3:$M$1250,3,FALSE)<>\"\",VLOOKUP(F149,Companies!$B$3:$M$1250,3,FALSE),IF(VLOOKUP(F149,Companies!$B$3:$M$1250,5,FALSE)<>\"\",VLOOKUP(F149,Companies!$B$3:$M$1250,5,FALSE),IF(VLOOKUP(F149,Companies!$B$3:$M$1250,7,FALSE)<>\"\",VLOOKUP(F149,Companies!$B$3:$M$1250,7,FALSE),IF(VLOOKUP(F149,Companies!$B$3:$M$1250,9,FALSE)<>\"\",VLOOKUP(F149,Companies!$B$3:$M$1250,9,FALSE),IF(VLOOKUP(F149,Companies!$B$3:$M$1250,11,FALSE)<>\"\",VLOOKUP(F149,Companies!$B$3:$M$1250,11,FALSE),\"\")))))","v":""},{"$f":"IF(VLOOKUP(F149,Companies!$B$3:$M$1250,12,FALSE)<>\"\",VLOOKUP(F149,Companies!$B$3:$M$1250,12,FALSE),\"\")","v":""}]
[{"$nulls":3},"VSUK","411PNHOMELTD","PN Home LTD","2019-01-08","2018-08-30","Invoice","01.19.0002",{"v":192,"d":"192.00 €"},{"$f":"IF(VLOOKUP(F150,Companies!$B$3:$M$1250,2,FALSE)<>\"\",VLOOKUP(F150,Companies!$B$3:$M$1250,2,FALSE),IF(VLOOKUP(F150,Companies!$B$3:$M$1250,4,FALSE)<>\"\",VLOOKUP(F150,Companies!$B$3:$M$1250,4,FALSE),IF(VLOOKUP(F150,Companies!$B$3:$M$1250,6,FALSE)<>\"\",VLOOKUP(F150,Companies!$B$3:$M$1250,6,FALSE),IF(VLOOKUP(F150,Companies!$B$3:$M$1250,8,FALSE)<>\"\",VLOOKUP(F150,Companies!$B$3:$M$1250,8,FALSE),IF(VLOOKUP(F150,Companies!$B$3:$M$1250,10,FALSE)<>\"\",VLOOKUP(F150,Companies!$B$3:$M$1250,10,FALSE),\"\")))))","v":""},{"$f":"IF(VLOOKUP(F150,Companies!$B$3:$M$1250,3,FALSE)<>\"\",VLOOKUP(F150,Companies!$B$3:$M$1250,3,FALSE),IF(VLOOKUP(F150,Companies!$B$3:$M$1250,5,FALSE)<>\"\",VLOOKUP(F150,Companies!$B$3:$M$1250,5,FALSE),IF(VLOOKUP(F150,Companies!$B$3:$M$1250,7,FALSE)<>\"\",VLOOKUP(F150,Companies!$B$3:$M$1250,7,FALSE),IF(VLOOKUP(F150,Companies!$B$3:$M$1250,9,FALSE)<>\"\",VLOOKUP(F150,Companies!$B$3:$M$1250,9,FALSE),IF(VLOOKUP(F150,Companies!$B$3:$M$1250,11,FALSE)<>\"\",VLOOKUP(F150,Companies!$B$3:$M$1250,11,FALSE),\"\")))))","v":""},{"$f":"IF(VLOOKUP(F150,Companies!$B$3:$M$1250,12,FALSE)<>\"\",VLOOKUP(F150,Companies!$B$3:$M$1250,12,FALSE),\"\")","v":""}]
[{"$nulls":3},"VSUK","411PNHOMELTD","PN Home LTD","2019-01-08","2018-10-30","Invoice","01.19.0004",{"v":4016.7,"d":"4,016.70 €"},{"$f":"IF(VLOOKUP(F151,Companies!$B$3:$M$1250,2,FALSE)<>\"\",VLOOKUP(F151,Companies!$B$3:$M$1250,2,FALSE),IF(VLOOKUP(F151,Companies!$B$3:$M$1250,4,FALSE)<>\"\",VLOOKUP(F151,Companies!$B$3:$M$1250,4,FALSE),IF(VLOOKUP(F151,Companies!$B$3:$M$1250,6,FALSE)<>\"\",VLOOKUP(F151,Companies!$B$3:$M$1250,6,FALSE),IF(VLOOKUP(F151,Companies!$B$3:$M$1250,8,FALSE)<>\"\",VLOOKUP(F151,Companies!$B$3:$M$1250,8,FALSE),IF(VLOOKUP(F151,Companies!$B$3:$M$1250,10,FALSE)<>\"\",VLOOKUP(F151,Companies!$B$3:$M$1250,10,FALSE),\"\")))))","v":""},{"$f":"IF(VLOOKUP(F151,Companies!$B$3:$M$1250,3,FALSE)<>\"\",VLOOKUP(F151,Companies!$B$3:$M$1250,3,FALSE),IF(VLOOKUP(F151,Companies!$B$3:$M$1250,5,FALSE)<>\"\",VLOOKUP(F151,Companies!$B$3:$M$1250,5,FALSE),IF(VLOOKUP(F151,Companies!$B$3:$M$1250,7,FALSE)<>\"\",VLOOKUP(F151,Companies!$B$3:$M$1250,7,FALSE),IF(VLOOKUP(F151,Companies!$B$3:$M$1250,9,FALSE)<>\"\",VLOOKUP(F151,Companies!$B$3:$M$1250,9,FALSE),IF(VLOOKUP(F151,Companies!$B$3:$M$1250,11,FALSE)<>\"\",VLOOKUP(F151,Companies!$B$3:$M$1250,11,FALSE),\"\")))))","v":""},{"$f":"IF(VLOOKUP(F151,Companies!$B$3:$M$1250,12,FALSE)<>\"\",VLOOKUP(F151,Companies!$B$3:$M$1250,12,FALSE),\"\")","v":""}]
[{"$nulls":3},"VSUK","411PNHOMELTD","PN Home LTD","2019-01-08","2018-11-30","Invoice","01.19.0005",{"v":1484.99,"d":"1,484.99 €"},{"$f":"IF(VLOOKUP(F152,Companies!$B$3:$M$1250,2,FALSE)<>\"\",VLOOKUP(F152,Companies!$B$3:$M$1250,2,FALSE),IF(VLOOKUP(F152,Companies!$B$3:$M$1250,4,FALSE)<>\"\",VLOOKUP(F152,Companies!$B$3:$M$1250,4,FALSE),IF(VLOOKUP(F152,Companies!$B$3:$M$1250,6,FALSE)<>\"\",VLOOKUP(F152,Companies!$B$3:$M$1250,6,FALSE),IF(VLOOKUP(F152,Companies!$B$3:$M$1250,8,FALSE)<>\"\",VLOOKUP(F152,Companies!$B$3:$M$1250,8,FALSE),IF(VLOOKUP(F152,Companies!$B$3:$M$1250,10,FALSE)<>\"\",VLOOKUP(F152,Companies!$B$3:$M$1250,10,FALSE),\"\")))))","v":""},{"$f":"IF(VLOOKUP(F152,Companies!$B$3:$M$1250,3,FALSE)<>\"\",VLOOKUP(F152,Companies!$B$3:$M$1250,3,FALSE),IF(VLOOKUP(F152,Companies!$B$3:$M$1250,5,FALSE)<>\"\",VLOOKUP(F152,Companies!$B$3:$M$1250,5,FALSE),IF(VLOOKUP(F152,Companies!$B$3:$M$1250,7,FALSE)<>\"\",VLOOKUP(F152,Companies!$B$3:$M$1250,7,FALSE),IF(VLOOKUP(F152,Companies!$B$3:$M$1250,9,FALSE)<>\"\",VLOOKUP(F152,Companies!$B$3:$M$1250,9,FALSE),IF(VLOOKUP(F152,Companies!$B$3:$M$1250,11,FALSE)<>\"\",VLOOKUP(F152,Companies!$B$3:$M$1250,11,FALSE),\"\")))))","v":""},{"$f":"IF(VLOOKUP(F152,Companies!$B$3:$M$1250,12,FALSE)<>\"\",VLOOKUP(F152,Companies!$B$3:$M$1250,12,FALSE),\"\")","v":""}]
[{"$nulls":3},"VSUK","411PNHOMELTD","PN Home LTD","2019-01-08","2018-11-30","Invoice","01.19.0006",{"v":3440.09,"d":"3,440.09 €"},{"$f":"IF(VLOOKUP(F153,Companies!$B$3:$M$1250,2,FALSE)<>\"\",VLOOKUP(F153,Companies!$B$3:$M$1250,2,FALSE),IF(VLOOKUP(F153,Companies!$B$3:$M$1250,4,FALSE)<>\"\",VLOOKUP(F153,Companies!$B$3:$M$1250,4,FALSE),IF(VLOOKUP(F153,Companies!$B$3:$M$1250,6,FALSE)<>\"\",VLOOKUP(F153,Companies!$B$3:$M$1250,6,FALSE),IF(VLOOKUP(F153,Companies!$B$3:$M$1250,8,FALSE)<>\"\",VLOOKUP(F153,Companies!$B$3:$M$1250,8,FALSE),IF(VLOOKUP(F153,Companies!$B$3:$M$1250,10,FALSE)<>\"\",VLOOKUP(F153,Companies!$B$3:$M$1250,10,FALSE),\"\")))))","v":""},{"$f":"IF(VLOOKUP(F153,Companies!$B$3:$M$1250,3,FALSE)<>\"\",VLOOKUP(F153,Companies!$B$3:$M$1250,3,FALSE),IF(VLOOKUP(F153,Companies!$B$3:$M$1250,5,FALSE)<>\"\",VLOOKUP(F153,Companies!$B$3:$M$1250,5,FALSE),IF(VLOOKUP(F153,Companies!$B$3:$M$1250,7,FALSE)<>\"\",VLOOKUP(F153,Companies!$B$3:$M$1250,7,FALSE),IF(VLOOKUP(F153,Companies!$B$3:$M$1250,9,FALSE)<>\"\",VLOOKUP(F153,Companies!$B$3:$M$1250,9,FALSE),IF(VLOOKUP(F153,Companies!$B$3:$M$1250,11,FALSE)<>\"\",VLOOKUP(F153,Companies!$B$3:$M$1250,11,FALSE),\"\")))))","v":""},{"$f":"IF(VLOOKUP(F153,Companies!$B$3:$M$1250,12,FALSE)<>\"\",VLOOKUP(F153,Companies!$B$3:$M$1250,12,FALSE),\"\")","v":""}]
[{"$nulls":3},"VSUK","411PNHOMELTD","PN Home LTD","2019-01-08","2018-09-30","Invoice","01.19.0007",{"v":3721.87,"d":"3,721.87 €"},{"$f":"IF(VLOOKUP(F154,Companies!$B$3:$M$1250,2,FALSE)<>\"\",VLOOKUP(F154,Companies!$B$3:$M$1250,2,FALSE),IF(VLOOKUP(F154,Companies!$B$3:$M$1250,4,FALSE)<>\"\",VLOOKUP(F154,Companies!$B$3:$M$1250,4,FALSE),IF(VLOOKUP(F154,Companies!$B$3:$M$1250,6,FALSE)<>\"\",VLOOKUP(F154,Companies!$B$3:$M$1250,6,FALSE),IF(VLOOKUP(F154,Companies!$B$3:$M$1250,8,FALSE)<>\"\",VLOOKUP(F154,Companies!$B$3:$M$1250,8,FALSE),IF(VLOOKUP(F154,Companies!$B$3:$M$1250,10,FALSE)<>\"\",VLOOKUP(F154,Companies!$B$3:$M$1250,10,FALSE),\"\")))))","v":""},{"$f":"IF(VLOOKUP(F154,Companies!$B$3:$M$1250,3,FALSE)<>\"\",VLOOKUP(F154,Companies!$B$3:$M$1250,3,FALSE),IF(VLOOKUP(F154,Companies!$B$3:$M$1250,5,FALSE)<>\"\",VLOOKUP(F154,Companies!$B$3:$M$1250,5,FALSE),IF(VLOOKUP(F154,Companies!$B$3:$M$1250,7,FALSE)<>\"\",VLOOKUP(F154,Companies!$B$3:$M$1250,7,FALSE),IF(VLOOKUP(F154,Companies!$B$3:$M$1250,9,FALSE)<>\"\",VLOOKUP(F154,Companies!$B$3:$M$1250,9,FALSE),IF(VLOOKUP(F154,Companies!$B$3:$M$1250,11,FALSE)<>\"\",VLOOKUP(F154,Companies!$B$3:$M$1250,11,FALSE),\"\")))))","v":""},{"$f":"IF(VLOOKUP(F154,Companies!$B$3:$M$1250,12,FALSE)<>\"\",VLOOKUP(F154,Companies!$B$3:$M$1250,12,FALSE),\"\")","v":""}]
[{"$nulls":3},"VSUK","411PNHOMELTD","PN Home LTD","2019-01-31","2019-03-02","Invoice","01.19.0051",{"v":912,"d":"912.00 €"},{"$f":"IF(VLOOKUP(F155,Companies!$B$3:$M$1250,2,FALSE)<>\"\",VLOOKUP(F155,Companies!$B$3:$M$1250,2,FALSE),IF(VLOOKUP(F155,Companies!$B$3:$M$1250,4,FALSE)<>\"\",VLOOKUP(F155,Companies!$B$3:$M$1250,4,FALSE),IF(VLOOKUP(F155,Companies!$B$3:$M$1250,6,FALSE)<>\"\",VLOOKUP(F155,Companies!$B$3:$M$1250,6,FALSE),IF(VLOOKUP(F155,Companies!$B$3:$M$1250,8,FALSE)<>\"\",VLOOKUP(F155,Companies!$B$3:$M$1250,8,FALSE),IF(VLOOKUP(F155,Companies!$B$3:$M$1250,10,FALSE)<>\"\",VLOOKUP(F155,Companies!$B$3:$M$1250,10,FALSE),\"\")))))","v":""},{"$f":"IF(VLOOKUP(F155,Companies!$B$3:$M$1250,3,FALSE)<>\"\",VLOOKUP(F155,Companies!$B$3:$M$1250,3,FALSE),IF(VLOOKUP(F155,Companies!$B$3:$M$1250,5,FALSE)<>\"\",VLOOKUP(F155,Companies!$B$3:$M$1250,5,FALSE),IF(VLOOKUP(F155,Companies!$B$3:$M$1250,7,FALSE)<>\"\",VLOOKUP(F155,Companies!$B$3:$M$1250,7,FALSE),IF(VLOOKUP(F155,Companies!$B$3:$M$1250,9,FALSE)<>\"\",VLOOKUP(F155,Companies!$B$3:$M$1250,9,FALSE),IF(VLOOKUP(F155,Companies!$B$3:$M$1250,11,FALSE)<>\"\",VLOOKUP(F155,Companies!$B$3:$M$1250,11,FALSE),\"\")))))","v":""},{"$f":"IF(VLOOKUP(F155,Companies!$B$3:$M$1250,12,FALSE)<>\"\",VLOOKUP(F155,Companies!$B$3:$M$1250,12,FALSE),\"\")","v":""}]
[{"$nulls":3},"VSUK","411PNHOMELTD","PN Home LTD","2019-01-31","2019-01-31","      ","OD-19-0052",{"v":489.05,"d":"489.05 €"},{"$f":"IF(VLOOKUP(F156,Companies!$B$3:$M$1250,2,FALSE)<>\"\",VLOOKUP(F156,Companies!$B$3:$M$1250,2,FALSE),IF(VLOOKUP(F156,Companies!$B$3:$M$1250,4,FALSE)<>\"\",VLOOKUP(F156,Companies!$B$3:$M$1250,4,FALSE),IF(VLOOKUP(F156,Companies!$B$3:$M$1250,6,FALSE)<>\"\",VLOOKUP(F156,Companies!$B$3:$M$1250,6,FALSE),IF(VLOOKUP(F156,Companies!$B$3:$M$1250,8,FALSE)<>\"\",VLOOKUP(F156,Companies!$B$3:$M$1250,8,FALSE),IF(VLOOKUP(F156,Companies!$B$3:$M$1250,10,FALSE)<>\"\",VLOOKUP(F156,Companies!$B$3:$M$1250,10,FALSE),\"\")))))","v":""},{"$f":"IF(VLOOKUP(F156,Companies!$B$3:$M$1250,3,FALSE)<>\"\",VLOOKUP(F156,Companies!$B$3:$M$1250,3,FALSE),IF(VLOOKUP(F156,Companies!$B$3:$M$1250,5,FALSE)<>\"\",VLOOKUP(F156,Companies!$B$3:$M$1250,5,FALSE),IF(VLOOKUP(F156,Companies!$B$3:$M$1250,7,FALSE)<>\"\",VLOOKUP(F156,Companies!$B$3:$M$1250,7,FALSE),IF(VLOOKUP(F156,Companies!$B$3:$M$1250,9,FALSE)<>\"\",VLOOKUP(F156,Companies!$B$3:$M$1250,9,FALSE),IF(VLOOKUP(F156,Companies!$B$3:$M$1250,11,FALSE)<>\"\",VLOOKUP(F156,Companies!$B$3:$M$1250,11,FALSE),\"\")))))","v":""},{"$f":"IF(VLOOKUP(F156,Companies!$B$3:$M$1250,12,FALSE)<>\"\",VLOOKUP(F156,Companies!$B$3:$M$1250,12,FALSE),\"\")","v":""}]
[{"$nulls":3},"VSFR","411POLYPLASTMULLER","POLYPLAST MÜLLER GMBH","2019-01-31","2019-03-02","Invoice","19.01.0265",{"v":2517.49,"d":"2,517.49 €"},{"$f":"IF(VLOOKUP(F157,Companies!$B$3:$M$1250,2,FALSE)<>\"\",VLOOKUP(F157,Companies!$B$3:$M$1250,2,FALSE),IF(VLOOKUP(F157,Companies!$B$3:$M$1250,4,FALSE)<>\"\",VLOOKUP(F157,Companies!$B$3:$M$1250,4,FALSE),IF(VLOOKUP(F157,Companies!$B$3:$M$1250,6,FALSE)<>\"\",VLOOKUP(F157,Companies!$B$3:$M$1250,6,FALSE),IF(VLOOKUP(F157,Companies!$B$3:$M$1250,8,FALSE)<>\"\",VLOOKUP(F157,Companies!$B$3:$M$1250,8,FALSE),IF(VLOOKUP(F157,Companies!$B$3:$M$1250,10,FALSE)<>\"\",VLOOKUP(F157,Companies!$B$3:$M$1250,10,FALSE),\"\")))))","v":""},{"$f":"IF(VLOOKUP(F157,Companies!$B$3:$M$1250,3,FALSE)<>\"\",VLOOKUP(F157,Companies!$B$3:$M$1250,3,FALSE),IF(VLOOKUP(F157,Companies!$B$3:$M$1250,5,FALSE)<>\"\",VLOOKUP(F157,Companies!$B$3:$M$1250,5,FALSE),IF(VLOOKUP(F157,Companies!$B$3:$M$1250,7,FALSE)<>\"\",VLOOKUP(F157,Companies!$B$3:$M$1250,7,FALSE),IF(VLOOKUP(F157,Companies!$B$3:$M$1250,9,FALSE)<>\"\",VLOOKUP(F157,Companies!$B$3:$M$1250,9,FALSE),IF(VLOOKUP(F157,Companies!$B$3:$M$1250,11,FALSE)<>\"\",VLOOKUP(F157,Companies!$B$3:$M$1250,11,FALSE),\"\")))))","v":""},{"$f":"IF(VLOOKUP(F157,Companies!$B$3:$M$1250,12,FALSE)<>\"\",VLOOKUP(F157,Companies!$B$3:$M$1250,12,FALSE),\"\")","v":""}]
[{"$nulls":3},"VSFR","411POLYPLASTMULLER","POLYPLAST MÜLLER GMBH","2019-02-28","2019-03-30","Invoice","19.02.0177",{"v":1981.17,"d":"1,981.17 €"},{"$f":"IF(VLOOKUP(F158,Companies!$B$3:$M$1250,2,FALSE)<>\"\",VLOOKUP(F158,Companies!$B$3:$M$1250,2,FALSE),IF(VLOOKUP(F158,Companies!$B$3:$M$1250,4,FALSE)<>\"\",VLOOKUP(F158,Companies!$B$3:$M$1250,4,FALSE),IF(VLOOKUP(F158,Companies!$B$3:$M$1250,6,FALSE)<>\"\",VLOOKUP(F158,Companies!$B$3:$M$1250,6,FALSE),IF(VLOOKUP(F158,Companies!$B$3:$M$1250,8,FALSE)<>\"\",VLOOKUP(F158,Companies!$B$3:$M$1250,8,FALSE),IF(VLOOKUP(F158,Companies!$B$3:$M$1250,10,FALSE)<>\"\",VLOOKUP(F158,Companies!$B$3:$M$1250,10,FALSE),\"\")))))","v":""},{"$f":"IF(VLOOKUP(F158,Companies!$B$3:$M$1250,3,FALSE)<>\"\",VLOOKUP(F158,Companies!$B$3:$M$1250,3,FALSE),IF(VLOOKUP(F158,Companies!$B$3:$M$1250,5,FALSE)<>\"\",VLOOKUP(F158,Companies!$B$3:$M$1250,5,FALSE),IF(VLOOKUP(F158,Companies!$B$3:$M$1250,7,FALSE)<>\"\",VLOOKUP(F158,Companies!$B$3:$M$1250,7,FALSE),IF(VLOOKUP(F158,Companies!$B$3:$M$1250,9,FALSE)<>\"\",VLOOKUP(F158,Companies!$B$3:$M$1250,9,FALSE),IF(VLOOKUP(F158,Companies!$B$3:$M$1250,11,FALSE)<>\"\",VLOOKUP(F158,Companies!$B$3:$M$1250,11,FALSE),\"\")))))","v":""},{"$f":"IF(VLOOKUP(F158,Companies!$B$3:$M$1250,12,FALSE)<>\"\",VLOOKUP(F158,Companies!$B$3:$M$1250,12,FALSE),\"\")","v":""}]
[{"$nulls":3},"VSFR","411PORRAG","PORR AG","2019-05-31","2019-06-30","Invoice",{"$f":"\"19050004\"","v":"19050004"},{"v":364.6,"d":"364.60 €"},{"$f":"IF(VLOOKUP(F159,Companies!$B$3:$M$1250,2,FALSE)<>\"\",VLOOKUP(F159,Companies!$B$3:$M$1250,2,FALSE),IF(VLOOKUP(F159,Companies!$B$3:$M$1250,4,FALSE)<>\"\",VLOOKUP(F159,Companies!$B$3:$M$1250,4,FALSE),IF(VLOOKUP(F159,Companies!$B$3:$M$1250,6,FALSE)<>\"\",VLOOKUP(F159,Companies!$B$3:$M$1250,6,FALSE),IF(VLOOKUP(F159,Companies!$B$3:$M$1250,8,FALSE)<>\"\",VLOOKUP(F159,Companies!$B$3:$M$1250,8,FALSE),IF(VLOOKUP(F159,Companies!$B$3:$M$1250,10,FALSE)<>\"\",VLOOKUP(F159,Companies!$B$3:$M$1250,10,FALSE),\"\")))))","v":""},{"$f":"IF(VLOOKUP(F159,Companies!$B$3:$M$1250,3,FALSE)<>\"\",VLOOKUP(F159,Companies!$B$3:$M$1250,3,FALSE),IF(VLOOKUP(F159,Companies!$B$3:$M$1250,5,FALSE)<>\"\",VLOOKUP(F159,Companies!$B$3:$M$1250,5,FALSE),IF(VLOOKUP(F159,Companies!$B$3:$M$1250,7,FALSE)<>\"\",VLOOKUP(F159,Companies!$B$3:$M$1250,7,FALSE),IF(VLOOKUP(F159,Companies!$B$3:$M$1250,9,FALSE)<>\"\",VLOOKUP(F159,Companies!$B$3:$M$1250,9,FALSE),IF(VLOOKUP(F159,Companies!$B$3:$M$1250,11,FALSE)<>\"\",VLOOKUP(F159,Companies!$B$3:$M$1250,11,FALSE),\"\")))))","v":""},{"$f":"IF(VLOOKUP(F159,Companies!$B$3:$M$1250,12,FALSE)<>\"\",VLOOKUP(F159,Companies!$B$3:$M$1250,12,FALSE),\"\")","v":""}]
[{"$nulls":3},"VSFR","411PRODUCTOSCAPILARE","PRODUCTOS CAPILARES L'OREAL S.A.","2019-05-31","2019-06-30","Invoice","FA19050069",{"v":4850,"d":"4,850.00 €"},{"$f":"IF(VLOOKUP(F160,Companies!$B$3:$M$1250,2,FALSE)<>\"\",VLOOKUP(F160,Companies!$B$3:$M$1250,2,FALSE),IF(VLOOKUP(F160,Companies!$B$3:$M$1250,4,FALSE)<>\"\",VLOOKUP(F160,Companies!$B$3:$M$1250,4,FALSE),IF(VLOOKUP(F160,Companies!$B$3:$M$1250,6,FALSE)<>\"\",VLOOKUP(F160,Companies!$B$3:$M$1250,6,FALSE),IF(VLOOKUP(F160,Companies!$B$3:$M$1250,8,FALSE)<>\"\",VLOOKUP(F160,Companies!$B$3:$M$1250,8,FALSE),IF(VLOOKUP(F160,Companies!$B$3:$M$1250,10,FALSE)<>\"\",VLOOKUP(F160,Companies!$B$3:$M$1250,10,FALSE),\"\")))))","v":""},{"$f":"IF(VLOOKUP(F160,Companies!$B$3:$M$1250,3,FALSE)<>\"\",VLOOKUP(F160,Companies!$B$3:$M$1250,3,FALSE),IF(VLOOKUP(F160,Companies!$B$3:$M$1250,5,FALSE)<>\"\",VLOOKUP(F160,Companies!$B$3:$M$1250,5,FALSE),IF(VLOOKUP(F160,Companies!$B$3:$M$1250,7,FALSE)<>\"\",VLOOKUP(F160,Companies!$B$3:$M$1250,7,FALSE),IF(VLOOKUP(F160,Companies!$B$3:$M$1250,9,FALSE)<>\"\",VLOOKUP(F160,Companies!$B$3:$M$1250,9,FALSE),IF(VLOOKUP(F160,Companies!$B$3:$M$1250,11,FALSE)<>\"\",VLOOKUP(F160,Companies!$B$3:$M$1250,11,FALSE),\"\")))))","v":""},{"$f":"IF(VLOOKUP(F160,Companies!$B$3:$M$1250,12,FALSE)<>\"\",VLOOKUP(F160,Companies!$B$3:$M$1250,12,FALSE),\"\")","v":""}]
[{"$nulls":3},"VSFR","411PWCSOCIÉTÉ","PWC Société d Avocats","2019-02-28","2019-03-30","Invoice","19.02.0110",{"v":1395.36,"d":"1,395.36 €"},{"$f":"IF(VLOOKUP(F161,Companies!$B$3:$M$1250,2,FALSE)<>\"\",VLOOKUP(F161,Companies!$B$3:$M$1250,2,FALSE),IF(VLOOKUP(F161,Companies!$B$3:$M$1250,4,FALSE)<>\"\",VLOOKUP(F161,Companies!$B$3:$M$1250,4,FALSE),IF(VLOOKUP(F161,Companies!$B$3:$M$1250,6,FALSE)<>\"\",VLOOKUP(F161,Companies!$B$3:$M$1250,6,FALSE),IF(VLOOKUP(F161,Companies!$B$3:$M$1250,8,FALSE)<>\"\",VLOOKUP(F161,Companies!$B$3:$M$1250,8,FALSE),IF(VLOOKUP(F161,Companies!$B$3:$M$1250,10,FALSE)<>\"\",VLOOKUP(F161,Companies!$B$3:$M$1250,10,FALSE),\"\")))))","v":""},{"$f":"IF(VLOOKUP(F161,Companies!$B$3:$M$1250,3,FALSE)<>\"\",VLOOKUP(F161,Companies!$B$3:$M$1250,3,FALSE),IF(VLOOKUP(F161,Companies!$B$3:$M$1250,5,FALSE)<>\"\",VLOOKUP(F161,Companies!$B$3:$M$1250,5,FALSE),IF(VLOOKUP(F161,Companies!$B$3:$M$1250,7,FALSE)<>\"\",VLOOKUP(F161,Companies!$B$3:$M$1250,7,FALSE),IF(VLOOKUP(F161,Companies!$B$3:$M$1250,9,FALSE)<>\"\",VLOOKUP(F161,Companies!$B$3:$M$1250,9,FALSE),IF(VLOOKUP(F161,Companies!$B$3:$M$1250,11,FALSE)<>\"\",VLOOKUP(F161,Companies!$B$3:$M$1250,11,FALSE),\"\")))))","v":""},{"$f":"IF(VLOOKUP(F161,Companies!$B$3:$M$1250,12,FALSE)<>\"\",VLOOKUP(F161,Companies!$B$3:$M$1250,12,FALSE),\"\")","v":""}]
[{"$nulls":3},"VSFR","411PWCSOCIÉTÉ","PWC Société d Avocats","2019-03-31","2019-04-30","Invoice","19.03.0135",{"v":2520.82,"d":"2,520.82 €"},{"$f":"IF(VLOOKUP(F162,Companies!$B$3:$M$1250,2,FALSE)<>\"\",VLOOKUP(F162,Companies!$B$3:$M$1250,2,FALSE),IF(VLOOKUP(F162,Companies!$B$3:$M$1250,4,FALSE)<>\"\",VLOOKUP(F162,Companies!$B$3:$M$1250,4,FALSE),IF(VLOOKUP(F162,Companies!$B$3:$M$1250,6,FALSE)<>\"\",VLOOKUP(F162,Companies!$B$3:$M$1250,6,FALSE),IF(VLOOKUP(F162,Companies!$B$3:$M$1250,8,FALSE)<>\"\",VLOOKUP(F162,Companies!$B$3:$M$1250,8,FALSE),IF(VLOOKUP(F162,Companies!$B$3:$M$1250,10,FALSE)<>\"\",VLOOKUP(F162,Companies!$B$3:$M$1250,10,FALSE),\"\")))))","v":""},{"$f":"IF(VLOOKUP(F162,Companies!$B$3:$M$1250,3,FALSE)<>\"\",VLOOKUP(F162,Companies!$B$3:$M$1250,3,FALSE),IF(VLOOKUP(F162,Companies!$B$3:$M$1250,5,FALSE)<>\"\",VLOOKUP(F162,Companies!$B$3:$M$1250,5,FALSE),IF(VLOOKUP(F162,Companies!$B$3:$M$1250,7,FALSE)<>\"\",VLOOKUP(F162,Companies!$B$3:$M$1250,7,FALSE),IF(VLOOKUP(F162,Companies!$B$3:$M$1250,9,FALSE)<>\"\",VLOOKUP(F162,Companies!$B$3:$M$1250,9,FALSE),IF(VLOOKUP(F162,Companies!$B$3:$M$1250,11,FALSE)<>\"\",VLOOKUP(F162,Companies!$B$3:$M$1250,11,FALSE),\"\")))))","v":""},{"$f":"IF(VLOOKUP(F162,Companies!$B$3:$M$1250,12,FALSE)<>\"\",VLOOKUP(F162,Companies!$B$3:$M$1250,12,FALSE),\"\")","v":""}]
[{"$nulls":3},"VSFR",24047,"RADIALL","2019-05-31","2019-06-30","Invoice","FA19050193",{"v":596.81,"d":"596.81 €"},{"$f":"IF(VLOOKUP(F163,Companies!$B$3:$M$1250,2,FALSE)<>\"\",VLOOKUP(F163,Companies!$B$3:$M$1250,2,FALSE),IF(VLOOKUP(F163,Companies!$B$3:$M$1250,4,FALSE)<>\"\",VLOOKUP(F163,Companies!$B$3:$M$1250,4,FALSE),IF(VLOOKUP(F163,Companies!$B$3:$M$1250,6,FALSE)<>\"\",VLOOKUP(F163,Companies!$B$3:$M$1250,6,FALSE),IF(VLOOKUP(F163,Companies!$B$3:$M$1250,8,FALSE)<>\"\",VLOOKUP(F163,Companies!$B$3:$M$1250,8,FALSE),IF(VLOOKUP(F163,Companies!$B$3:$M$1250,10,FALSE)<>\"\",VLOOKUP(F163,Companies!$B$3:$M$1250,10,FALSE),\"\")))))","v":""},{"$f":"IF(VLOOKUP(F163,Companies!$B$3:$M$1250,3,FALSE)<>\"\",VLOOKUP(F163,Companies!$B$3:$M$1250,3,FALSE),IF(VLOOKUP(F163,Companies!$B$3:$M$1250,5,FALSE)<>\"\",VLOOKUP(F163,Companies!$B$3:$M$1250,5,FALSE),IF(VLOOKUP(F163,Companies!$B$3:$M$1250,7,FALSE)<>\"\",VLOOKUP(F163,Companies!$B$3:$M$1250,7,FALSE),IF(VLOOKUP(F163,Companies!$B$3:$M$1250,9,FALSE)<>\"\",VLOOKUP(F163,Companies!$B$3:$M$1250,9,FALSE),IF(VLOOKUP(F163,Companies!$B$3:$M$1250,11,FALSE)<>\"\",VLOOKUP(F163,Companies!$B$3:$M$1250,11,FALSE),\"\")))))","v":""},{"$f":"IF(VLOOKUP(F163,Companies!$B$3:$M$1250,12,FALSE)<>\"\",VLOOKUP(F163,Companies!$B$3:$M$1250,12,FALSE),\"\")","v":""}]
[{"$nulls":3},"VSFR","411REDAPTINC.","Redapt Inc.","2019-04-30","2019-05-30","Invoice","19.04.0225",{"v":1583.34,"d":"1,583.34 €"},{"$f":"IF(VLOOKUP(F164,Companies!$B$3:$M$1250,2,FALSE)<>\"\",VLOOKUP(F164,Companies!$B$3:$M$1250,2,FALSE),IF(VLOOKUP(F164,Companies!$B$3:$M$1250,4,FALSE)<>\"\",VLOOKUP(F164,Companies!$B$3:$M$1250,4,FALSE),IF(VLOOKUP(F164,Companies!$B$3:$M$1250,6,FALSE)<>\"\",VLOOKUP(F164,Companies!$B$3:$M$1250,6,FALSE),IF(VLOOKUP(F164,Companies!$B$3:$M$1250,8,FALSE)<>\"\",VLOOKUP(F164,Companies!$B$3:$M$1250,8,FALSE),IF(VLOOKUP(F164,Companies!$B$3:$M$1250,10,FALSE)<>\"\",VLOOKUP(F164,Companies!$B$3:$M$1250,10,FALSE),\"\")))))","v":""},{"$f":"IF(VLOOKUP(F164,Companies!$B$3:$M$1250,3,FALSE)<>\"\",VLOOKUP(F164,Companies!$B$3:$M$1250,3,FALSE),IF(VLOOKUP(F164,Companies!$B$3:$M$1250,5,FALSE)<>\"\",VLOOKUP(F164,Companies!$B$3:$M$1250,5,FALSE),IF(VLOOKUP(F164,Companies!$B$3:$M$1250,7,FALSE)<>\"\",VLOOKUP(F164,Companies!$B$3:$M$1250,7,FALSE),IF(VLOOKUP(F164,Companies!$B$3:$M$1250,9,FALSE)<>\"\",VLOOKUP(F164,Companies!$B$3:$M$1250,9,FALSE),IF(VLOOKUP(F164,Companies!$B$3:$M$1250,11,FALSE)<>\"\",VLOOKUP(F164,Companies!$B$3:$M$1250,11,FALSE),\"\")))))","v":""},{"$f":"IF(VLOOKUP(F164,Companies!$B$3:$M$1250,12,FALSE)<>\"\",VLOOKUP(F164,Companies!$B$3:$M$1250,12,FALSE),\"\")","v":""}]
[{"$nulls":3},"VSFR","411REDAPTINC.","Redapt Inc.","2019-05-31","2019-06-30","Invoice","FA19050123",{"v":2052.49,"d":"2,052.49 €"},{"$f":"IF(VLOOKUP(F165,Companies!$B$3:$M$1250,2,FALSE)<>\"\",VLOOKUP(F165,Companies!$B$3:$M$1250,2,FALSE),IF(VLOOKUP(F165,Companies!$B$3:$M$1250,4,FALSE)<>\"\",VLOOKUP(F165,Companies!$B$3:$M$1250,4,FALSE),IF(VLOOKUP(F165,Companies!$B$3:$M$1250,6,FALSE)<>\"\",VLOOKUP(F165,Companies!$B$3:$M$1250,6,FALSE),IF(VLOOKUP(F165,Companies!$B$3:$M$1250,8,FALSE)<>\"\",VLOOKUP(F165,Companies!$B$3:$M$1250,8,FALSE),IF(VLOOKUP(F165,Companies!$B$3:$M$1250,10,FALSE)<>\"\",VLOOKUP(F165,Companies!$B$3:$M$1250,10,FALSE),\"\")))))","v":""},{"$f":"IF(VLOOKUP(F165,Companies!$B$3:$M$1250,3,FALSE)<>\"\",VLOOKUP(F165,Companies!$B$3:$M$1250,3,FALSE),IF(VLOOKUP(F165,Companies!$B$3:$M$1250,5,FALSE)<>\"\",VLOOKUP(F165,Companies!$B$3:$M$1250,5,FALSE),IF(VLOOKUP(F165,Companies!$B$3:$M$1250,7,FALSE)<>\"\",VLOOKUP(F165,Companies!$B$3:$M$1250,7,FALSE),IF(VLOOKUP(F165,Companies!$B$3:$M$1250,9,FALSE)<>\"\",VLOOKUP(F165,Companies!$B$3:$M$1250,9,FALSE),IF(VLOOKUP(F165,Companies!$B$3:$M$1250,11,FALSE)<>\"\",VLOOKUP(F165,Companies!$B$3:$M$1250,11,FALSE),\"\")))))","v":""},{"$f":"IF(VLOOKUP(F165,Companies!$B$3:$M$1250,12,FALSE)<>\"\",VLOOKUP(F165,Companies!$B$3:$M$1250,12,FALSE),\"\")","v":""}]
[{"$nulls":3},"VSUK","411RHIDINARISGMBH","RHI DINARIS GMBH","2019-05-31","2019-06-30","Invoice","IN05190013",{"v":4999.1,"d":"4,999.10 €"},{"$f":"IF(VLOOKUP(F166,Companies!$B$3:$M$1250,2,FALSE)<>\"\",VLOOKUP(F166,Companies!$B$3:$M$1250,2,FALSE),IF(VLOOKUP(F166,Companies!$B$3:$M$1250,4,FALSE)<>\"\",VLOOKUP(F166,Companies!$B$3:$M$1250,4,FALSE),IF(VLOOKUP(F166,Companies!$B$3:$M$1250,6,FALSE)<>\"\",VLOOKUP(F166,Companies!$B$3:$M$1250,6,FALSE),IF(VLOOKUP(F166,Companies!$B$3:$M$1250,8,FALSE)<>\"\",VLOOKUP(F166,Companies!$B$3:$M$1250,8,FALSE),IF(VLOOKUP(F166,Companies!$B$3:$M$1250,10,FALSE)<>\"\",VLOOKUP(F166,Companies!$B$3:$M$1250,10,FALSE),\"\")))))","v":""},{"$f":"IF(VLOOKUP(F166,Companies!$B$3:$M$1250,3,FALSE)<>\"\",VLOOKUP(F166,Companies!$B$3:$M$1250,3,FALSE),IF(VLOOKUP(F166,Companies!$B$3:$M$1250,5,FALSE)<>\"\",VLOOKUP(F166,Companies!$B$3:$M$1250,5,FALSE),IF(VLOOKUP(F166,Companies!$B$3:$M$1250,7,FALSE)<>\"\",VLOOKUP(F166,Companies!$B$3:$M$1250,7,FALSE),IF(VLOOKUP(F166,Companies!$B$3:$M$1250,9,FALSE)<>\"\",VLOOKUP(F166,Companies!$B$3:$M$1250,9,FALSE),IF(VLOOKUP(F166,Companies!$B$3:$M$1250,11,FALSE)<>\"\",VLOOKUP(F166,Companies!$B$3:$M$1250,11,FALSE),\"\")))))","v":""},{"$f":"IF(VLOOKUP(F166,Companies!$B$3:$M$1250,12,FALSE)<>\"\",VLOOKUP(F166,Companies!$B$3:$M$1250,12,FALSE),\"\")","v":""}]
[{"$nulls":3},"VSUK","411RHIGLASGMBH","RHI GLAS GMBH","2019-05-31","2019-06-30","Invoice","IN05190020",{"v":6968,"d":"6,968.00 €"},{"$f":"IF(VLOOKUP(F167,Companies!$B$3:$M$1250,2,FALSE)<>\"\",VLOOKUP(F167,Companies!$B$3:$M$1250,2,FALSE),IF(VLOOKUP(F167,Companies!$B$3:$M$1250,4,FALSE)<>\"\",VLOOKUP(F167,Companies!$B$3:$M$1250,4,FALSE),IF(VLOOKUP(F167,Companies!$B$3:$M$1250,6,FALSE)<>\"\",VLOOKUP(F167,Companies!$B$3:$M$1250,6,FALSE),IF(VLOOKUP(F167,Companies!$B$3:$M$1250,8,FALSE)<>\"\",VLOOKUP(F167,Companies!$B$3:$M$1250,8,FALSE),IF(VLOOKUP(F167,Companies!$B$3:$M$1250,10,FALSE)<>\"\",VLOOKUP(F167,Companies!$B$3:$M$1250,10,FALSE),\"\")))))","v":""},{"$f":"IF(VLOOKUP(F167,Companies!$B$3:$M$1250,3,FALSE)<>\"\",VLOOKUP(F167,Companies!$B$3:$M$1250,3,FALSE),IF(VLOOKUP(F167,Companies!$B$3:$M$1250,5,FALSE)<>\"\",VLOOKUP(F167,Companies!$B$3:$M$1250,5,FALSE),IF(VLOOKUP(F167,Companies!$B$3:$M$1250,7,FALSE)<>\"\",VLOOKUP(F167,Companies!$B$3:$M$1250,7,FALSE),IF(VLOOKUP(F167,Companies!$B$3:$M$1250,9,FALSE)<>\"\",VLOOKUP(F167,Companies!$B$3:$M$1250,9,FALSE),IF(VLOOKUP(F167,Companies!$B$3:$M$1250,11,FALSE)<>\"\",VLOOKUP(F167,Companies!$B$3:$M$1250,11,FALSE),\"\")))))","v":""},{"$f":"IF(VLOOKUP(F167,Companies!$B$3:$M$1250,12,FALSE)<>\"\",VLOOKUP(F167,Companies!$B$3:$M$1250,12,FALSE),\"\")","v":""}]
[{"$nulls":3},"VSUK","411MARVOFEUERUNGS","RHI MARVO Feuerungs - und Industriebau GmbH","2019-04-30","2019-05-30","Invoice","04.19.0014",{"v":1970.67,"d":"1,970.67 €"},{"$f":"IF(VLOOKUP(F168,Companies!$B$3:$M$1250,2,FALSE)<>\"\",VLOOKUP(F168,Companies!$B$3:$M$1250,2,FALSE),IF(VLOOKUP(F168,Companies!$B$3:$M$1250,4,FALSE)<>\"\",VLOOKUP(F168,Companies!$B$3:$M$1250,4,FALSE),IF(VLOOKUP(F168,Companies!$B$3:$M$1250,6,FALSE)<>\"\",VLOOKUP(F168,Companies!$B$3:$M$1250,6,FALSE),IF(VLOOKUP(F168,Companies!$B$3:$M$1250,8,FALSE)<>\"\",VLOOKUP(F168,Companies!$B$3:$M$1250,8,FALSE),IF(VLOOKUP(F168,Companies!$B$3:$M$1250,10,FALSE)<>\"\",VLOOKUP(F168,Companies!$B$3:$M$1250,10,FALSE),\"\")))))","v":""},{"$f":"IF(VLOOKUP(F168,Companies!$B$3:$M$1250,3,FALSE)<>\"\",VLOOKUP(F168,Companies!$B$3:$M$1250,3,FALSE),IF(VLOOKUP(F168,Companies!$B$3:$M$1250,5,FALSE)<>\"\",VLOOKUP(F168,Companies!$B$3:$M$1250,5,FALSE),IF(VLOOKUP(F168,Companies!$B$3:$M$1250,7,FALSE)<>\"\",VLOOKUP(F168,Companies!$B$3:$M$1250,7,FALSE),IF(VLOOKUP(F168,Companies!$B$3:$M$1250,9,FALSE)<>\"\",VLOOKUP(F168,Companies!$B$3:$M$1250,9,FALSE),IF(VLOOKUP(F168,Companies!$B$3:$M$1250,11,FALSE)<>\"\",VLOOKUP(F168,Companies!$B$3:$M$1250,11,FALSE),\"\")))))","v":""},{"$f":"IF(VLOOKUP(F168,Companies!$B$3:$M$1250,12,FALSE)<>\"\",VLOOKUP(F168,Companies!$B$3:$M$1250,12,FALSE),\"\")","v":""}]
[{"$nulls":3},"VSFR","411RHIREFRACTORIESIB","RHI REFRACTORIES IBERICA SL","2019-05-31","2019-06-30","Invoice","FA19050039",{"v":520,"d":"520.00 €"},{"$f":"IF(VLOOKUP(F169,Companies!$B$3:$M$1250,2,FALSE)<>\"\",VLOOKUP(F169,Companies!$B$3:$M$1250,2,FALSE),IF(VLOOKUP(F169,Companies!$B$3:$M$1250,4,FALSE)<>\"\",VLOOKUP(F169,Companies!$B$3:$M$1250,4,FALSE),IF(VLOOKUP(F169,Companies!$B$3:$M$1250,6,FALSE)<>\"\",VLOOKUP(F169,Companies!$B$3:$M$1250,6,FALSE),IF(VLOOKUP(F169,Companies!$B$3:$M$1250,8,FALSE)<>\"\",VLOOKUP(F169,Companies!$B$3:$M$1250,8,FALSE),IF(VLOOKUP(F169,Companies!$B$3:$M$1250,10,FALSE)<>\"\",VLOOKUP(F169,Companies!$B$3:$M$1250,10,FALSE),\"\")))))","v":""},{"$f":"IF(VLOOKUP(F169,Companies!$B$3:$M$1250,3,FALSE)<>\"\",VLOOKUP(F169,Companies!$B$3:$M$1250,3,FALSE),IF(VLOOKUP(F169,Companies!$B$3:$M$1250,5,FALSE)<>\"\",VLOOKUP(F169,Companies!$B$3:$M$1250,5,FALSE),IF(VLOOKUP(F169,Companies!$B$3:$M$1250,7,FALSE)<>\"\",VLOOKUP(F169,Companies!$B$3:$M$1250,7,FALSE),IF(VLOOKUP(F169,Companies!$B$3:$M$1250,9,FALSE)<>\"\",VLOOKUP(F169,Companies!$B$3:$M$1250,9,FALSE),IF(VLOOKUP(F169,Companies!$B$3:$M$1250,11,FALSE)<>\"\",VLOOKUP(F169,Companies!$B$3:$M$1250,11,FALSE),\"\")))))","v":""},{"$f":"IF(VLOOKUP(F169,Companies!$B$3:$M$1250,12,FALSE)<>\"\",VLOOKUP(F169,Companies!$B$3:$M$1250,12,FALSE),\"\")","v":""}]
[{"$nulls":3},"VSFR",301179,"RHI REFRACTORIES SITE SERVICE GMBH","2019-05-31","2019-06-30","Invoice","FA19050174",{"v":1155,"d":"1,155.00 €"},{"$f":"IF(VLOOKUP(F170,Companies!$B$3:$M$1250,2,FALSE)<>\"\",VLOOKUP(F170,Companies!$B$3:$M$1250,2,FALSE),IF(VLOOKUP(F170,Companies!$B$3:$M$1250,4,FALSE)<>\"\",VLOOKUP(F170,Companies!$B$3:$M$1250,4,FALSE),IF(VLOOKUP(F170,Companies!$B$3:$M$1250,6,FALSE)<>\"\",VLOOKUP(F170,Companies!$B$3:$M$1250,6,FALSE),IF(VLOOKUP(F170,Companies!$B$3:$M$1250,8,FALSE)<>\"\",VLOOKUP(F170,Companies!$B$3:$M$1250,8,FALSE),IF(VLOOKUP(F170,Companies!$B$3:$M$1250,10,FALSE)<>\"\",VLOOKUP(F170,Companies!$B$3:$M$1250,10,FALSE),\"\")))))","v":""},{"$f":"IF(VLOOKUP(F170,Companies!$B$3:$M$1250,3,FALSE)<>\"\",VLOOKUP(F170,Companies!$B$3:$M$1250,3,FALSE),IF(VLOOKUP(F170,Companies!$B$3:$M$1250,5,FALSE)<>\"\",VLOOKUP(F170,Companies!$B$3:$M$1250,5,FALSE),IF(VLOOKUP(F170,Companies!$B$3:$M$1250,7,FALSE)<>\"\",VLOOKUP(F170,Companies!$B$3:$M$1250,7,FALSE),IF(VLOOKUP(F170,Companies!$B$3:$M$1250,9,FALSE)<>\"\",VLOOKUP(F170,Companies!$B$3:$M$1250,9,FALSE),IF(VLOOKUP(F170,Companies!$B$3:$M$1250,11,FALSE)<>\"\",VLOOKUP(F170,Companies!$B$3:$M$1250,11,FALSE),\"\")))))","v":""},{"$f":"IF(VLOOKUP(F170,Companies!$B$3:$M$1250,12,FALSE)<>\"\",VLOOKUP(F170,Companies!$B$3:$M$1250,12,FALSE),\"\")","v":""}]
[{"$nulls":3},"VSFR","411ROUSSELOTSAS","ROUSSELOT SAS","2019-05-31","2019-06-30","Invoice",{"$f":"\"19050024\"","v":"19050024"},{"v":374.86,"d":"374.86 €"},{"$f":"IF(VLOOKUP(F171,Companies!$B$3:$M$1250,2,FALSE)<>\"\",VLOOKUP(F171,Companies!$B$3:$M$1250,2,FALSE),IF(VLOOKUP(F171,Companies!$B$3:$M$1250,4,FALSE)<>\"\",VLOOKUP(F171,Companies!$B$3:$M$1250,4,FALSE),IF(VLOOKUP(F171,Companies!$B$3:$M$1250,6,FALSE)<>\"\",VLOOKUP(F171,Companies!$B$3:$M$1250,6,FALSE),IF(VLOOKUP(F171,Companies!$B$3:$M$1250,8,FALSE)<>\"\",VLOOKUP(F171,Companies!$B$3:$M$1250,8,FALSE),IF(VLOOKUP(F171,Companies!$B$3:$M$1250,10,FALSE)<>\"\",VLOOKUP(F171,Companies!$B$3:$M$1250,10,FALSE),\"\")))))","v":""},{"$f":"IF(VLOOKUP(F171,Companies!$B$3:$M$1250,3,FALSE)<>\"\",VLOOKUP(F171,Companies!$B$3:$M$1250,3,FALSE),IF(VLOOKUP(F171,Companies!$B$3:$M$1250,5,FALSE)<>\"\",VLOOKUP(F171,Companies!$B$3:$M$1250,5,FALSE),IF(VLOOKUP(F171,Companies!$B$3:$M$1250,7,FALSE)<>\"\",VLOOKUP(F171,Companies!$B$3:$M$1250,7,FALSE),IF(VLOOKUP(F171,Companies!$B$3:$M$1250,9,FALSE)<>\"\",VLOOKUP(F171,Companies!$B$3:$M$1250,9,FALSE),IF(VLOOKUP(F171,Companies!$B$3:$M$1250,11,FALSE)<>\"\",VLOOKUP(F171,Companies!$B$3:$M$1250,11,FALSE),\"\")))))","v":""},{"$f":"IF(VLOOKUP(F171,Companies!$B$3:$M$1250,12,FALSE)<>\"\",VLOOKUP(F171,Companies!$B$3:$M$1250,12,FALSE),\"\")","v":""}]
[{"$nulls":3},"VSFR","411ROUSSELOTSAS","ROUSSELOT SAS","2019-05-31","2019-06-30","Invoice",{"$f":"\"19050028\"","v":"19050028"},{"v":600,"d":"600.00 €"},{"$f":"IF(VLOOKUP(F172,Companies!$B$3:$M$1250,2,FALSE)<>\"\",VLOOKUP(F172,Companies!$B$3:$M$1250,2,FALSE),IF(VLOOKUP(F172,Companies!$B$3:$M$1250,4,FALSE)<>\"\",VLOOKUP(F172,Companies!$B$3:$M$1250,4,FALSE),IF(VLOOKUP(F172,Companies!$B$3:$M$1250,6,FALSE)<>\"\",VLOOKUP(F172,Companies!$B$3:$M$1250,6,FALSE),IF(VLOOKUP(F172,Companies!$B$3:$M$1250,8,FALSE)<>\"\",VLOOKUP(F172,Companies!$B$3:$M$1250,8,FALSE),IF(VLOOKUP(F172,Companies!$B$3:$M$1250,10,FALSE)<>\"\",VLOOKUP(F172,Companies!$B$3:$M$1250,10,FALSE),\"\")))))","v":""},{"$f":"IF(VLOOKUP(F172,Companies!$B$3:$M$1250,3,FALSE)<>\"\",VLOOKUP(F172,Companies!$B$3:$M$1250,3,FALSE),IF(VLOOKUP(F172,Companies!$B$3:$M$1250,5,FALSE)<>\"\",VLOOKUP(F172,Companies!$B$3:$M$1250,5,FALSE),IF(VLOOKUP(F172,Companies!$B$3:$M$1250,7,FALSE)<>\"\",VLOOKUP(F172,Companies!$B$3:$M$1250,7,FALSE),IF(VLOOKUP(F172,Companies!$B$3:$M$1250,9,FALSE)<>\"\",VLOOKUP(F172,Companies!$B$3:$M$1250,9,FALSE),IF(VLOOKUP(F172,Companies!$B$3:$M$1250,11,FALSE)<>\"\",VLOOKUP(F172,Companies!$B$3:$M$1250,11,FALSE),\"\")))))","v":""},{"$f":"IF(VLOOKUP(F172,Companies!$B$3:$M$1250,12,FALSE)<>\"\",VLOOKUP(F172,Companies!$B$3:$M$1250,12,FALSE),\"\")","v":""}]
[{"$nulls":3},"VSFR","411RUEDUCOMMERCE","RUE DU COMMERCE","2019-05-31","2019-06-30","Invoice","FA19050157",{"v":840,"d":"840.00 €"},{"$f":"IF(VLOOKUP(F173,Companies!$B$3:$M$1250,2,FALSE)<>\"\",VLOOKUP(F173,Companies!$B$3:$M$1250,2,FALSE),IF(VLOOKUP(F173,Companies!$B$3:$M$1250,4,FALSE)<>\"\",VLOOKUP(F173,Companies!$B$3:$M$1250,4,FALSE),IF(VLOOKUP(F173,Companies!$B$3:$M$1250,6,FALSE)<>\"\",VLOOKUP(F173,Companies!$B$3:$M$1250,6,FALSE),IF(VLOOKUP(F173,Companies!$B$3:$M$1250,8,FALSE)<>\"\",VLOOKUP(F173,Companies!$B$3:$M$1250,8,FALSE),IF(VLOOKUP(F173,Companies!$B$3:$M$1250,10,FALSE)<>\"\",VLOOKUP(F173,Companies!$B$3:$M$1250,10,FALSE),\"\")))))","v":""},{"$f":"IF(VLOOKUP(F173,Companies!$B$3:$M$1250,3,FALSE)<>\"\",VLOOKUP(F173,Companies!$B$3:$M$1250,3,FALSE),IF(VLOOKUP(F173,Companies!$B$3:$M$1250,5,FALSE)<>\"\",VLOOKUP(F173,Companies!$B$3:$M$1250,5,FALSE),IF(VLOOKUP(F173,Companies!$B$3:$M$1250,7,FALSE)<>\"\",VLOOKUP(F173,Companies!$B$3:$M$1250,7,FALSE),IF(VLOOKUP(F173,Companies!$B$3:$M$1250,9,FALSE)<>\"\",VLOOKUP(F173,Companies!$B$3:$M$1250,9,FALSE),IF(VLOOKUP(F173,Companies!$B$3:$M$1250,11,FALSE)<>\"\",VLOOKUP(F173,Companies!$B$3:$M$1250,11,FALSE),\"\")))))","v":""},{"$f":"IF(VLOOKUP(F173,Companies!$B$3:$M$1250,12,FALSE)<>\"\",VLOOKUP(F173,Companies!$B$3:$M$1250,12,FALSE),\"\")","v":""}]
[{"$nulls":3},"VSFR","411SGMCMATXCONST","Saint Gobain MC Matx Const","2019-05-31","2019-06-30","Invoice",{"$f":"\"19050023\"","v":"19050023"},{"v":84,"d":"84.00 €"},{"$f":"IF(VLOOKUP(F174,Companies!$B$3:$M$1250,2,FALSE)<>\"\",VLOOKUP(F174,Companies!$B$3:$M$1250,2,FALSE),IF(VLOOKUP(F174,Companies!$B$3:$M$1250,4,FALSE)<>\"\",VLOOKUP(F174,Companies!$B$3:$M$1250,4,FALSE),IF(VLOOKUP(F174,Companies!$B$3:$M$1250,6,FALSE)<>\"\",VLOOKUP(F174,Companies!$B$3:$M$1250,6,FALSE),IF(VLOOKUP(F174,Companies!$B$3:$M$1250,8,FALSE)<>\"\",VLOOKUP(F174,Companies!$B$3:$M$1250,8,FALSE),IF(VLOOKUP(F174,Companies!$B$3:$M$1250,10,FALSE)<>\"\",VLOOKUP(F174,Companies!$B$3:$M$1250,10,FALSE),\"\")))))","v":""},{"$f":"IF(VLOOKUP(F174,Companies!$B$3:$M$1250,3,FALSE)<>\"\",VLOOKUP(F174,Companies!$B$3:$M$1250,3,FALSE),IF(VLOOKUP(F174,Companies!$B$3:$M$1250,5,FALSE)<>\"\",VLOOKUP(F174,Companies!$B$3:$M$1250,5,FALSE),IF(VLOOKUP(F174,Companies!$B$3:$M$1250,7,FALSE)<>\"\",VLOOKUP(F174,Companies!$B$3:$M$1250,7,FALSE),IF(VLOOKUP(F174,Companies!$B$3:$M$1250,9,FALSE)<>\"\",VLOOKUP(F174,Companies!$B$3:$M$1250,9,FALSE),IF(VLOOKUP(F174,Companies!$B$3:$M$1250,11,FALSE)<>\"\",VLOOKUP(F174,Companies!$B$3:$M$1250,11,FALSE),\"\")))))","v":""},{"$f":"IF(VLOOKUP(F174,Companies!$B$3:$M$1250,12,FALSE)<>\"\",VLOOKUP(F174,Companies!$B$3:$M$1250,12,FALSE),\"\")","v":""}]
[{"$nulls":3},"VSUK","411SAINTGOBAINSEKURI","SAINT GOBAIN SEKURIT FRANCE","2019-04-30","2019-05-30","Invoice","04.19.0025",{"v":4247,"d":"4,247.00 €"},{"$f":"IF(VLOOKUP(F175,Companies!$B$3:$M$1250,2,FALSE)<>\"\",VLOOKUP(F175,Companies!$B$3:$M$1250,2,FALSE),IF(VLOOKUP(F175,Companies!$B$3:$M$1250,4,FALSE)<>\"\",VLOOKUP(F175,Companies!$B$3:$M$1250,4,FALSE),IF(VLOOKUP(F175,Companies!$B$3:$M$1250,6,FALSE)<>\"\",VLOOKUP(F175,Companies!$B$3:$M$1250,6,FALSE),IF(VLOOKUP(F175,Companies!$B$3:$M$1250,8,FALSE)<>\"\",VLOOKUP(F175,Companies!$B$3:$M$1250,8,FALSE),IF(VLOOKUP(F175,Companies!$B$3:$M$1250,10,FALSE)<>\"\",VLOOKUP(F175,Companies!$B$3:$M$1250,10,FALSE),\"\")))))","v":""},{"$f":"IF(VLOOKUP(F175,Companies!$B$3:$M$1250,3,FALSE)<>\"\",VLOOKUP(F175,Companies!$B$3:$M$1250,3,FALSE),IF(VLOOKUP(F175,Companies!$B$3:$M$1250,5,FALSE)<>\"\",VLOOKUP(F175,Companies!$B$3:$M$1250,5,FALSE),IF(VLOOKUP(F175,Companies!$B$3:$M$1250,7,FALSE)<>\"\",VLOOKUP(F175,Companies!$B$3:$M$1250,7,FALSE),IF(VLOOKUP(F175,Companies!$B$3:$M$1250,9,FALSE)<>\"\",VLOOKUP(F175,Companies!$B$3:$M$1250,9,FALSE),IF(VLOOKUP(F175,Companies!$B$3:$M$1250,11,FALSE)<>\"\",VLOOKUP(F175,Companies!$B$3:$M$1250,11,FALSE),\"\")))))","v":""},{"$f":"IF(VLOOKUP(F175,Companies!$B$3:$M$1250,12,FALSE)<>\"\",VLOOKUP(F175,Companies!$B$3:$M$1250,12,FALSE),\"\")","v":""}]
[{"$nulls":3},"VSUK","411SAINTGOBAINSEKURI","SAINT GOBAIN SEKURIT FRANCE","2019-05-31","2019-06-30","Invoice","IN05190004",{"v":1166,"d":"1,166.00 €"},{"$f":"IF(VLOOKUP(F176,Companies!$B$3:$M$1250,2,FALSE)<>\"\",VLOOKUP(F176,Companies!$B$3:$M$1250,2,FALSE),IF(VLOOKUP(F176,Companies!$B$3:$M$1250,4,FALSE)<>\"\",VLOOKUP(F176,Companies!$B$3:$M$1250,4,FALSE),IF(VLOOKUP(F176,Companies!$B$3:$M$1250,6,FALSE)<>\"\",VLOOKUP(F176,Companies!$B$3:$M$1250,6,FALSE),IF(VLOOKUP(F176,Companies!$B$3:$M$1250,8,FALSE)<>\"\",VLOOKUP(F176,Companies!$B$3:$M$1250,8,FALSE),IF(VLOOKUP(F176,Companies!$B$3:$M$1250,10,FALSE)<>\"\",VLOOKUP(F176,Companies!$B$3:$M$1250,10,FALSE),\"\")))))","v":""},{"$f":"IF(VLOOKUP(F176,Companies!$B$3:$M$1250,3,FALSE)<>\"\",VLOOKUP(F176,Companies!$B$3:$M$1250,3,FALSE),IF(VLOOKUP(F176,Companies!$B$3:$M$1250,5,FALSE)<>\"\",VLOOKUP(F176,Companies!$B$3:$M$1250,5,FALSE),IF(VLOOKUP(F176,Companies!$B$3:$M$1250,7,FALSE)<>\"\",VLOOKUP(F176,Companies!$B$3:$M$1250,7,FALSE),IF(VLOOKUP(F176,Companies!$B$3:$M$1250,9,FALSE)<>\"\",VLOOKUP(F176,Companies!$B$3:$M$1250,9,FALSE),IF(VLOOKUP(F176,Companies!$B$3:$M$1250,11,FALSE)<>\"\",VLOOKUP(F176,Companies!$B$3:$M$1250,11,FALSE),\"\")))))","v":""},{"$f":"IF(VLOOKUP(F176,Companies!$B$3:$M$1250,12,FALSE)<>\"\",VLOOKUP(F176,Companies!$B$3:$M$1250,12,FALSE),\"\")","v":""}]
[{"$nulls":3},"VSFR","411SALAMANDERGROUPSA","SALAMANDER GROUP SAS","2019-05-31","2019-06-30","Invoice","FA19050107",{"v":441,"d":"441.00 €"},{"$f":"IF(VLOOKUP(F177,Companies!$B$3:$M$1250,2,FALSE)<>\"\",VLOOKUP(F177,Companies!$B$3:$M$1250,2,FALSE),IF(VLOOKUP(F177,Companies!$B$3:$M$1250,4,FALSE)<>\"\",VLOOKUP(F177,Companies!$B$3:$M$1250,4,FALSE),IF(VLOOKUP(F177,Companies!$B$3:$M$1250,6,FALSE)<>\"\",VLOOKUP(F177,Companies!$B$3:$M$1250,6,FALSE),IF(VLOOKUP(F177,Companies!$B$3:$M$1250,8,FALSE)<>\"\",VLOOKUP(F177,Companies!$B$3:$M$1250,8,FALSE),IF(VLOOKUP(F177,Companies!$B$3:$M$1250,10,FALSE)<>\"\",VLOOKUP(F177,Companies!$B$3:$M$1250,10,FALSE),\"\")))))","v":""},{"$f":"IF(VLOOKUP(F177,Companies!$B$3:$M$1250,3,FALSE)<>\"\",VLOOKUP(F177,Companies!$B$3:$M$1250,3,FALSE),IF(VLOOKUP(F177,Companies!$B$3:$M$1250,5,FALSE)<>\"\",VLOOKUP(F177,Companies!$B$3:$M$1250,5,FALSE),IF(VLOOKUP(F177,Companies!$B$3:$M$1250,7,FALSE)<>\"\",VLOOKUP(F177,Companies!$B$3:$M$1250,7,FALSE),IF(VLOOKUP(F177,Companies!$B$3:$M$1250,9,FALSE)<>\"\",VLOOKUP(F177,Companies!$B$3:$M$1250,9,FALSE),IF(VLOOKUP(F177,Companies!$B$3:$M$1250,11,FALSE)<>\"\",VLOOKUP(F177,Companies!$B$3:$M$1250,11,FALSE),\"\")))))","v":""},{"$f":"IF(VLOOKUP(F177,Companies!$B$3:$M$1250,12,FALSE)<>\"\",VLOOKUP(F177,Companies!$B$3:$M$1250,12,FALSE),\"\")","v":""}]
[{"$nulls":3},"VSFR","411SAMSKIPMULTIMODAL","Samskip Multimodal BV","2019-05-31","2019-06-30","Invoice",{"$f":"\"19050018\"","v":"19050018"},{"v":131.71,"d":"131.71 €"},{"$f":"IF(VLOOKUP(F178,Companies!$B$3:$M$1250,2,FALSE)<>\"\",VLOOKUP(F178,Companies!$B$3:$M$1250,2,FALSE),IF(VLOOKUP(F178,Companies!$B$3:$M$1250,4,FALSE)<>\"\",VLOOKUP(F178,Companies!$B$3:$M$1250,4,FALSE),IF(VLOOKUP(F178,Companies!$B$3:$M$1250,6,FALSE)<>\"\",VLOOKUP(F178,Companies!$B$3:$M$1250,6,FALSE),IF(VLOOKUP(F178,Companies!$B$3:$M$1250,8,FALSE)<>\"\",VLOOKUP(F178,Companies!$B$3:$M$1250,8,FALSE),IF(VLOOKUP(F178,Companies!$B$3:$M$1250,10,FALSE)<>\"\",VLOOKUP(F178,Companies!$B$3:$M$1250,10,FALSE),\"\")))))","v":""},{"$f":"IF(VLOOKUP(F178,Companies!$B$3:$M$1250,3,FALSE)<>\"\",VLOOKUP(F178,Companies!$B$3:$M$1250,3,FALSE),IF(VLOOKUP(F178,Companies!$B$3:$M$1250,5,FALSE)<>\"\",VLOOKUP(F178,Companies!$B$3:$M$1250,5,FALSE),IF(VLOOKUP(F178,Companies!$B$3:$M$1250,7,FALSE)<>\"\",VLOOKUP(F178,Companies!$B$3:$M$1250,7,FALSE),IF(VLOOKUP(F178,Companies!$B$3:$M$1250,9,FALSE)<>\"\",VLOOKUP(F178,Companies!$B$3:$M$1250,9,FALSE),IF(VLOOKUP(F178,Companies!$B$3:$M$1250,11,FALSE)<>\"\",VLOOKUP(F178,Companies!$B$3:$M$1250,11,FALSE),\"\")))))","v":""},{"$f":"IF(VLOOKUP(F178,Companies!$B$3:$M$1250,12,FALSE)<>\"\",VLOOKUP(F178,Companies!$B$3:$M$1250,12,FALSE),\"\")","v":""}]
[{"$nulls":3},"VSFR","411SAPPIPAPIERHOLDIN","Sappi Papier Holding GmbH","2019-05-31","2019-06-30","Invoice","FA19050141",{"v":787.5,"d":"787.50 €"},{"$f":"IF(VLOOKUP(F179,Companies!$B$3:$M$1250,2,FALSE)<>\"\",VLOOKUP(F179,Companies!$B$3:$M$1250,2,FALSE),IF(VLOOKUP(F179,Companies!$B$3:$M$1250,4,FALSE)<>\"\",VLOOKUP(F179,Companies!$B$3:$M$1250,4,FALSE),IF(VLOOKUP(F179,Companies!$B$3:$M$1250,6,FALSE)<>\"\",VLOOKUP(F179,Companies!$B$3:$M$1250,6,FALSE),IF(VLOOKUP(F179,Companies!$B$3:$M$1250,8,FALSE)<>\"\",VLOOKUP(F179,Companies!$B$3:$M$1250,8,FALSE),IF(VLOOKUP(F179,Companies!$B$3:$M$1250,10,FALSE)<>\"\",VLOOKUP(F179,Companies!$B$3:$M$1250,10,FALSE),\"\")))))","v":""},{"$f":"IF(VLOOKUP(F179,Companies!$B$3:$M$1250,3,FALSE)<>\"\",VLOOKUP(F179,Companies!$B$3:$M$1250,3,FALSE),IF(VLOOKUP(F179,Companies!$B$3:$M$1250,5,FALSE)<>\"\",VLOOKUP(F179,Companies!$B$3:$M$1250,5,FALSE),IF(VLOOKUP(F179,Companies!$B$3:$M$1250,7,FALSE)<>\"\",VLOOKUP(F179,Companies!$B$3:$M$1250,7,FALSE),IF(VLOOKUP(F179,Companies!$B$3:$M$1250,9,FALSE)<>\"\",VLOOKUP(F179,Companies!$B$3:$M$1250,9,FALSE),IF(VLOOKUP(F179,Companies!$B$3:$M$1250,11,FALSE)<>\"\",VLOOKUP(F179,Companies!$B$3:$M$1250,11,FALSE),\"\")))))","v":""},{"$f":"IF(VLOOKUP(F179,Companies!$B$3:$M$1250,12,FALSE)<>\"\",VLOOKUP(F179,Companies!$B$3:$M$1250,12,FALSE),\"\")","v":""}]
[{"$nulls":3},"VSUK","411SALMSAS","SCHMIDT GROUP SAS","2018-11-20","2018-12-20","Invoice","11.18.0007",{"v":70,"d":"70.00 €"},{"$f":"IF(VLOOKUP(F180,Companies!$B$3:$M$1250,2,FALSE)<>\"\",VLOOKUP(F180,Companies!$B$3:$M$1250,2,FALSE),IF(VLOOKUP(F180,Companies!$B$3:$M$1250,4,FALSE)<>\"\",VLOOKUP(F180,Companies!$B$3:$M$1250,4,FALSE),IF(VLOOKUP(F180,Companies!$B$3:$M$1250,6,FALSE)<>\"\",VLOOKUP(F180,Companies!$B$3:$M$1250,6,FALSE),IF(VLOOKUP(F180,Companies!$B$3:$M$1250,8,FALSE)<>\"\",VLOOKUP(F180,Companies!$B$3:$M$1250,8,FALSE),IF(VLOOKUP(F180,Companies!$B$3:$M$1250,10,FALSE)<>\"\",VLOOKUP(F180,Companies!$B$3:$M$1250,10,FALSE),\"\")))))","v":""},{"$f":"IF(VLOOKUP(F180,Companies!$B$3:$M$1250,3,FALSE)<>\"\",VLOOKUP(F180,Companies!$B$3:$M$1250,3,FALSE),IF(VLOOKUP(F180,Companies!$B$3:$M$1250,5,FALSE)<>\"\",VLOOKUP(F180,Companies!$B$3:$M$1250,5,FALSE),IF(VLOOKUP(F180,Companies!$B$3:$M$1250,7,FALSE)<>\"\",VLOOKUP(F180,Companies!$B$3:$M$1250,7,FALSE),IF(VLOOKUP(F180,Companies!$B$3:$M$1250,9,FALSE)<>\"\",VLOOKUP(F180,Companies!$B$3:$M$1250,9,FALSE),IF(VLOOKUP(F180,Companies!$B$3:$M$1250,11,FALSE)<>\"\",VLOOKUP(F180,Companies!$B$3:$M$1250,11,FALSE),\"\")))))","v":""},{"$f":"IF(VLOOKUP(F180,Companies!$B$3:$M$1250,12,FALSE)<>\"\",VLOOKUP(F180,Companies!$B$3:$M$1250,12,FALSE),\"\")","v":""}]
[{"$nulls":3},"VSFR","411SEEGPHARMSA","SEEGPHARM SA","2018-10-31","2018-11-30","Invoice","18.10.0139",{"v":1491.67,"d":"1,491.67 €"},{"$f":"IF(VLOOKUP(F181,Companies!$B$3:$M$1250,2,FALSE)<>\"\",VLOOKUP(F181,Companies!$B$3:$M$1250,2,FALSE),IF(VLOOKUP(F181,Companies!$B$3:$M$1250,4,FALSE)<>\"\",VLOOKUP(F181,Companies!$B$3:$M$1250,4,FALSE),IF(VLOOKUP(F181,Companies!$B$3:$M$1250,6,FALSE)<>\"\",VLOOKUP(F181,Companies!$B$3:$M$1250,6,FALSE),IF(VLOOKUP(F181,Companies!$B$3:$M$1250,8,FALSE)<>\"\",VLOOKUP(F181,Companies!$B$3:$M$1250,8,FALSE),IF(VLOOKUP(F181,Companies!$B$3:$M$1250,10,FALSE)<>\"\",VLOOKUP(F181,Companies!$B$3:$M$1250,10,FALSE),\"\")))))","v":""},{"$f":"IF(VLOOKUP(F181,Companies!$B$3:$M$1250,3,FALSE)<>\"\",VLOOKUP(F181,Companies!$B$3:$M$1250,3,FALSE),IF(VLOOKUP(F181,Companies!$B$3:$M$1250,5,FALSE)<>\"\",VLOOKUP(F181,Companies!$B$3:$M$1250,5,FALSE),IF(VLOOKUP(F181,Companies!$B$3:$M$1250,7,FALSE)<>\"\",VLOOKUP(F181,Companies!$B$3:$M$1250,7,FALSE),IF(VLOOKUP(F181,Companies!$B$3:$M$1250,9,FALSE)<>\"\",VLOOKUP(F181,Companies!$B$3:$M$1250,9,FALSE),IF(VLOOKUP(F181,Companies!$B$3:$M$1250,11,FALSE)<>\"\",VLOOKUP(F181,Companies!$B$3:$M$1250,11,FALSE),\"\")))))","v":""},{"$f":"IF(VLOOKUP(F181,Companies!$B$3:$M$1250,12,FALSE)<>\"\",VLOOKUP(F181,Companies!$B$3:$M$1250,12,FALSE),\"\")","v":""}]
[{"$nulls":3},"VSUK","411SERSAGROUPAGSCWE","Sersa Group AG (Schweiz)","2019-05-31","2019-06-30","Invoice","IN05190018",{"v":710,"d":"710.00 €"},{"$f":"IF(VLOOKUP(F182,Companies!$B$3:$M$1250,2,FALSE)<>\"\",VLOOKUP(F182,Companies!$B$3:$M$1250,2,FALSE),IF(VLOOKUP(F182,Companies!$B$3:$M$1250,4,FALSE)<>\"\",VLOOKUP(F182,Companies!$B$3:$M$1250,4,FALSE),IF(VLOOKUP(F182,Companies!$B$3:$M$1250,6,FALSE)<>\"\",VLOOKUP(F182,Companies!$B$3:$M$1250,6,FALSE),IF(VLOOKUP(F182,Companies!$B$3:$M$1250,8,FALSE)<>\"\",VLOOKUP(F182,Companies!$B$3:$M$1250,8,FALSE),IF(VLOOKUP(F182,Companies!$B$3:$M$1250,10,FALSE)<>\"\",VLOOKUP(F182,Companies!$B$3:$M$1250,10,FALSE),\"\")))))","v":""},{"$f":"IF(VLOOKUP(F182,Companies!$B$3:$M$1250,3,FALSE)<>\"\",VLOOKUP(F182,Companies!$B$3:$M$1250,3,FALSE),IF(VLOOKUP(F182,Companies!$B$3:$M$1250,5,FALSE)<>\"\",VLOOKUP(F182,Companies!$B$3:$M$1250,5,FALSE),IF(VLOOKUP(F182,Companies!$B$3:$M$1250,7,FALSE)<>\"\",VLOOKUP(F182,Companies!$B$3:$M$1250,7,FALSE),IF(VLOOKUP(F182,Companies!$B$3:$M$1250,9,FALSE)<>\"\",VLOOKUP(F182,Companies!$B$3:$M$1250,9,FALSE),IF(VLOOKUP(F182,Companies!$B$3:$M$1250,11,FALSE)<>\"\",VLOOKUP(F182,Companies!$B$3:$M$1250,11,FALSE),\"\")))))","v":""},{"$f":"IF(VLOOKUP(F182,Companies!$B$3:$M$1250,12,FALSE)<>\"\",VLOOKUP(F182,Companies!$B$3:$M$1250,12,FALSE),\"\")","v":""}]
[{"$nulls":3},"VSFR","411SKINYBODYWEARGMBH","Skiny Bodywear GMBH & CO KG","2019-05-31","2019-06-30","Invoice",{"$f":"\"19050034\"","v":"19050034"},{"v":400,"d":"400.00 €"},{"$f":"IF(VLOOKUP(F183,Companies!$B$3:$M$1250,2,FALSE)<>\"\",VLOOKUP(F183,Companies!$B$3:$M$1250,2,FALSE),IF(VLOOKUP(F183,Companies!$B$3:$M$1250,4,FALSE)<>\"\",VLOOKUP(F183,Companies!$B$3:$M$1250,4,FALSE),IF(VLOOKUP(F183,Companies!$B$3:$M$1250,6,FALSE)<>\"\",VLOOKUP(F183,Companies!$B$3:$M$1250,6,FALSE),IF(VLOOKUP(F183,Companies!$B$3:$M$1250,8,FALSE)<>\"\",VLOOKUP(F183,Companies!$B$3:$M$1250,8,FALSE),IF(VLOOKUP(F183,Companies!$B$3:$M$1250,10,FALSE)<>\"\",VLOOKUP(F183,Companies!$B$3:$M$1250,10,FALSE),\"\")))))","v":""},{"$f":"IF(VLOOKUP(F183,Companies!$B$3:$M$1250,3,FALSE)<>\"\",VLOOKUP(F183,Companies!$B$3:$M$1250,3,FALSE),IF(VLOOKUP(F183,Companies!$B$3:$M$1250,5,FALSE)<>\"\",VLOOKUP(F183,Companies!$B$3:$M$1250,5,FALSE),IF(VLOOKUP(F183,Companies!$B$3:$M$1250,7,FALSE)<>\"\",VLOOKUP(F183,Companies!$B$3:$M$1250,7,FALSE),IF(VLOOKUP(F183,Companies!$B$3:$M$1250,9,FALSE)<>\"\",VLOOKUP(F183,Companies!$B$3:$M$1250,9,FALSE),IF(VLOOKUP(F183,Companies!$B$3:$M$1250,11,FALSE)<>\"\",VLOOKUP(F183,Companies!$B$3:$M$1250,11,FALSE),\"\")))))","v":""},{"$f":"IF(VLOOKUP(F183,Companies!$B$3:$M$1250,12,FALSE)<>\"\",VLOOKUP(F183,Companies!$B$3:$M$1250,12,FALSE),\"\")","v":""}]
[{"$nulls":3},"VSFR","411SEPR","SOCIÉTÉ EUROPÉENNE DES PRODUITS","2019-05-31","2019-06-30","Invoice",{"$f":"\"19050007\"","v":"19050007"},{"v":698.23,"d":"698.23 €"},{"$f":"IF(VLOOKUP(F184,Companies!$B$3:$M$1250,2,FALSE)<>\"\",VLOOKUP(F184,Companies!$B$3:$M$1250,2,FALSE),IF(VLOOKUP(F184,Companies!$B$3:$M$1250,4,FALSE)<>\"\",VLOOKUP(F184,Companies!$B$3:$M$1250,4,FALSE),IF(VLOOKUP(F184,Companies!$B$3:$M$1250,6,FALSE)<>\"\",VLOOKUP(F184,Companies!$B$3:$M$1250,6,FALSE),IF(VLOOKUP(F184,Companies!$B$3:$M$1250,8,FALSE)<>\"\",VLOOKUP(F184,Companies!$B$3:$M$1250,8,FALSE),IF(VLOOKUP(F184,Companies!$B$3:$M$1250,10,FALSE)<>\"\",VLOOKUP(F184,Companies!$B$3:$M$1250,10,FALSE),\"\")))))","v":""},{"$f":"IF(VLOOKUP(F184,Companies!$B$3:$M$1250,3,FALSE)<>\"\",VLOOKUP(F184,Companies!$B$3:$M$1250,3,FALSE),IF(VLOOKUP(F184,Companies!$B$3:$M$1250,5,FALSE)<>\"\",VLOOKUP(F184,Companies!$B$3:$M$1250,5,FALSE),IF(VLOOKUP(F184,Companies!$B$3:$M$1250,7,FALSE)<>\"\",VLOOKUP(F184,Companies!$B$3:$M$1250,7,FALSE),IF(VLOOKUP(F184,Companies!$B$3:$M$1250,9,FALSE)<>\"\",VLOOKUP(F184,Companies!$B$3:$M$1250,9,FALSE),IF(VLOOKUP(F184,Companies!$B$3:$M$1250,11,FALSE)<>\"\",VLOOKUP(F184,Companies!$B$3:$M$1250,11,FALSE),\"\")))))","v":""},{"$f":"IF(VLOOKUP(F184,Companies!$B$3:$M$1250,12,FALSE)<>\"\",VLOOKUP(F184,Companies!$B$3:$M$1250,12,FALSE),\"\")","v":""}]
[{"$nulls":3},"VSUK","411SOFRUCESAS","SOFRUCE SAS","2018-11-30","2018-12-30","Invoice","11.18.0047",{"v":100,"d":"100.00 €"},{"$f":"IF(VLOOKUP(F185,Companies!$B$3:$M$1250,2,FALSE)<>\"\",VLOOKUP(F185,Companies!$B$3:$M$1250,2,FALSE),IF(VLOOKUP(F185,Companies!$B$3:$M$1250,4,FALSE)<>\"\",VLOOKUP(F185,Companies!$B$3:$M$1250,4,FALSE),IF(VLOOKUP(F185,Companies!$B$3:$M$1250,6,FALSE)<>\"\",VLOOKUP(F185,Companies!$B$3:$M$1250,6,FALSE),IF(VLOOKUP(F185,Companies!$B$3:$M$1250,8,FALSE)<>\"\",VLOOKUP(F185,Companies!$B$3:$M$1250,8,FALSE),IF(VLOOKUP(F185,Companies!$B$3:$M$1250,10,FALSE)<>\"\",VLOOKUP(F185,Companies!$B$3:$M$1250,10,FALSE),\"\")))))","v":""},{"$f":"IF(VLOOKUP(F185,Companies!$B$3:$M$1250,3,FALSE)<>\"\",VLOOKUP(F185,Companies!$B$3:$M$1250,3,FALSE),IF(VLOOKUP(F185,Companies!$B$3:$M$1250,5,FALSE)<>\"\",VLOOKUP(F185,Companies!$B$3:$M$1250,5,FALSE),IF(VLOOKUP(F185,Companies!$B$3:$M$1250,7,FALSE)<>\"\",VLOOKUP(F185,Companies!$B$3:$M$1250,7,FALSE),IF(VLOOKUP(F185,Companies!$B$3:$M$1250,9,FALSE)<>\"\",VLOOKUP(F185,Companies!$B$3:$M$1250,9,FALSE),IF(VLOOKUP(F185,Companies!$B$3:$M$1250,11,FALSE)<>\"\",VLOOKUP(F185,Companies!$B$3:$M$1250,11,FALSE),\"\")))))","v":""},{"$f":"IF(VLOOKUP(F185,Companies!$B$3:$M$1250,12,FALSE)<>\"\",VLOOKUP(F185,Companies!$B$3:$M$1250,12,FALSE),\"\")","v":""}]
[{"$nulls":3},"VSUK","411SOFRUCESAS","SOFRUCE SAS","2018-12-31","2019-01-30","Invoice","12.18.0027",{"v":100,"d":"100.00 €"},{"$f":"IF(VLOOKUP(F186,Companies!$B$3:$M$1250,2,FALSE)<>\"\",VLOOKUP(F186,Companies!$B$3:$M$1250,2,FALSE),IF(VLOOKUP(F186,Companies!$B$3:$M$1250,4,FALSE)<>\"\",VLOOKUP(F186,Companies!$B$3:$M$1250,4,FALSE),IF(VLOOKUP(F186,Companies!$B$3:$M$1250,6,FALSE)<>\"\",VLOOKUP(F186,Companies!$B$3:$M$1250,6,FALSE),IF(VLOOKUP(F186,Companies!$B$3:$M$1250,8,FALSE)<>\"\",VLOOKUP(F186,Companies!$B$3:$M$1250,8,FALSE),IF(VLOOKUP(F186,Companies!$B$3:$M$1250,10,FALSE)<>\"\",VLOOKUP(F186,Companies!$B$3:$M$1250,10,FALSE),\"\")))))","v":""},{"$f":"IF(VLOOKUP(F186,Companies!$B$3:$M$1250,3,FALSE)<>\"\",VLOOKUP(F186,Companies!$B$3:$M$1250,3,FALSE),IF(VLOOKUP(F186,Companies!$B$3:$M$1250,5,FALSE)<>\"\",VLOOKUP(F186,Companies!$B$3:$M$1250,5,FALSE),IF(VLOOKUP(F186,Companies!$B$3:$M$1250,7,FALSE)<>\"\",VLOOKUP(F186,Companies!$B$3:$M$1250,7,FALSE),IF(VLOOKUP(F186,Companies!$B$3:$M$1250,9,FALSE)<>\"\",VLOOKUP(F186,Companies!$B$3:$M$1250,9,FALSE),IF(VLOOKUP(F186,Companies!$B$3:$M$1250,11,FALSE)<>\"\",VLOOKUP(F186,Companies!$B$3:$M$1250,11,FALSE),\"\")))))","v":""},{"$f":"IF(VLOOKUP(F186,Companies!$B$3:$M$1250,12,FALSE)<>\"\",VLOOKUP(F186,Companies!$B$3:$M$1250,12,FALSE),\"\")","v":""}]
[{"$nulls":3},"VSUK","411SOFRUCESAS","SOFRUCE SAS","2019-01-31","2019-03-02","Invoice","01.19.0040",{"v":100,"d":"100.00 €"},{"$f":"IF(VLOOKUP(F187,Companies!$B$3:$M$1250,2,FALSE)<>\"\",VLOOKUP(F187,Companies!$B$3:$M$1250,2,FALSE),IF(VLOOKUP(F187,Companies!$B$3:$M$1250,4,FALSE)<>\"\",VLOOKUP(F187,Companies!$B$3:$M$1250,4,FALSE),IF(VLOOKUP(F187,Companies!$B$3:$M$1250,6,FALSE)<>\"\",VLOOKUP(F187,Companies!$B$3:$M$1250,6,FALSE),IF(VLOOKUP(F187,Companies!$B$3:$M$1250,8,FALSE)<>\"\",VLOOKUP(F187,Companies!$B$3:$M$1250,8,FALSE),IF(VLOOKUP(F187,Companies!$B$3:$M$1250,10,FALSE)<>\"\",VLOOKUP(F187,Companies!$B$3:$M$1250,10,FALSE),\"\")))))","v":""},{"$f":"IF(VLOOKUP(F187,Companies!$B$3:$M$1250,3,FALSE)<>\"\",VLOOKUP(F187,Companies!$B$3:$M$1250,3,FALSE),IF(VLOOKUP(F187,Companies!$B$3:$M$1250,5,FALSE)<>\"\",VLOOKUP(F187,Companies!$B$3:$M$1250,5,FALSE),IF(VLOOKUP(F187,Companies!$B$3:$M$1250,7,FALSE)<>\"\",VLOOKUP(F187,Companies!$B$3:$M$1250,7,FALSE),IF(VLOOKUP(F187,Companies!$B$3:$M$1250,9,FALSE)<>\"\",VLOOKUP(F187,Companies!$B$3:$M$1250,9,FALSE),IF(VLOOKUP(F187,Companies!$B$3:$M$1250,11,FALSE)<>\"\",VLOOKUP(F187,Companies!$B$3:$M$1250,11,FALSE),\"\")))))","v":""},{"$f":"IF(VLOOKUP(F187,Companies!$B$3:$M$1250,12,FALSE)<>\"\",VLOOKUP(F187,Companies!$B$3:$M$1250,12,FALSE),\"\")","v":""}]
[{"$nulls":3},"VSUK","411SOFRUCESAS","SOFRUCE SAS","2019-02-28","2019-03-30","Invoice","02.19.0024",{"v":100,"d":"100.00 €"},{"$f":"IF(VLOOKUP(F188,Companies!$B$3:$M$1250,2,FALSE)<>\"\",VLOOKUP(F188,Companies!$B$3:$M$1250,2,FALSE),IF(VLOOKUP(F188,Companies!$B$3:$M$1250,4,FALSE)<>\"\",VLOOKUP(F188,Companies!$B$3:$M$1250,4,FALSE),IF(VLOOKUP(F188,Companies!$B$3:$M$1250,6,FALSE)<>\"\",VLOOKUP(F188,Companies!$B$3:$M$1250,6,FALSE),IF(VLOOKUP(F188,Companies!$B$3:$M$1250,8,FALSE)<>\"\",VLOOKUP(F188,Companies!$B$3:$M$1250,8,FALSE),IF(VLOOKUP(F188,Companies!$B$3:$M$1250,10,FALSE)<>\"\",VLOOKUP(F188,Companies!$B$3:$M$1250,10,FALSE),\"\")))))","v":""},{"$f":"IF(VLOOKUP(F188,Companies!$B$3:$M$1250,3,FALSE)<>\"\",VLOOKUP(F188,Companies!$B$3:$M$1250,3,FALSE),IF(VLOOKUP(F188,Companies!$B$3:$M$1250,5,FALSE)<>\"\",VLOOKUP(F188,Companies!$B$3:$M$1250,5,FALSE),IF(VLOOKUP(F188,Companies!$B$3:$M$1250,7,FALSE)<>\"\",VLOOKUP(F188,Companies!$B$3:$M$1250,7,FALSE),IF(VLOOKUP(F188,Companies!$B$3:$M$1250,9,FALSE)<>\"\",VLOOKUP(F188,Companies!$B$3:$M$1250,9,FALSE),IF(VLOOKUP(F188,Companies!$B$3:$M$1250,11,FALSE)<>\"\",VLOOKUP(F188,Companies!$B$3:$M$1250,11,FALSE),\"\")))))","v":""},{"$f":"IF(VLOOKUP(F188,Companies!$B$3:$M$1250,12,FALSE)<>\"\",VLOOKUP(F188,Companies!$B$3:$M$1250,12,FALSE),\"\")","v":""}]
[{"$nulls":3},"VSUK","411SOFRUCESAS","SOFRUCE SAS","2019-03-31","2019-04-30","Invoice","03.19.0022",{"v":100,"d":"100.00 €"},{"$f":"IF(VLOOKUP(F189,Companies!$B$3:$M$1250,2,FALSE)<>\"\",VLOOKUP(F189,Companies!$B$3:$M$1250,2,FALSE),IF(VLOOKUP(F189,Companies!$B$3:$M$1250,4,FALSE)<>\"\",VLOOKUP(F189,Companies!$B$3:$M$1250,4,FALSE),IF(VLOOKUP(F189,Companies!$B$3:$M$1250,6,FALSE)<>\"\",VLOOKUP(F189,Companies!$B$3:$M$1250,6,FALSE),IF(VLOOKUP(F189,Companies!$B$3:$M$1250,8,FALSE)<>\"\",VLOOKUP(F189,Companies!$B$3:$M$1250,8,FALSE),IF(VLOOKUP(F189,Companies!$B$3:$M$1250,10,FALSE)<>\"\",VLOOKUP(F189,Companies!$B$3:$M$1250,10,FALSE),\"\")))))","v":""},{"$f":"IF(VLOOKUP(F189,Companies!$B$3:$M$1250,3,FALSE)<>\"\",VLOOKUP(F189,Companies!$B$3:$M$1250,3,FALSE),IF(VLOOKUP(F189,Companies!$B$3:$M$1250,5,FALSE)<>\"\",VLOOKUP(F189,Companies!$B$3:$M$1250,5,FALSE),IF(VLOOKUP(F189,Companies!$B$3:$M$1250,7,FALSE)<>\"\",VLOOKUP(F189,Companies!$B$3:$M$1250,7,FALSE),IF(VLOOKUP(F189,Companies!$B$3:$M$1250,9,FALSE)<>\"\",VLOOKUP(F189,Companies!$B$3:$M$1250,9,FALSE),IF(VLOOKUP(F189,Companies!$B$3:$M$1250,11,FALSE)<>\"\",VLOOKUP(F189,Companies!$B$3:$M$1250,11,FALSE),\"\")))))","v":""},{"$f":"IF(VLOOKUP(F189,Companies!$B$3:$M$1250,12,FALSE)<>\"\",VLOOKUP(F189,Companies!$B$3:$M$1250,12,FALSE),\"\")","v":""}]
[{"$nulls":3},"VSUK","411SOFRUCESAS","SOFRUCE SAS","2019-04-30","2019-05-30","Invoice","04.19.0020",{"v":100,"d":"100.00 €"},{"$f":"IF(VLOOKUP(F190,Companies!$B$3:$M$1250,2,FALSE)<>\"\",VLOOKUP(F190,Companies!$B$3:$M$1250,2,FALSE),IF(VLOOKUP(F190,Companies!$B$3:$M$1250,4,FALSE)<>\"\",VLOOKUP(F190,Companies!$B$3:$M$1250,4,FALSE),IF(VLOOKUP(F190,Companies!$B$3:$M$1250,6,FALSE)<>\"\",VLOOKUP(F190,Companies!$B$3:$M$1250,6,FALSE),IF(VLOOKUP(F190,Companies!$B$3:$M$1250,8,FALSE)<>\"\",VLOOKUP(F190,Companies!$B$3:$M$1250,8,FALSE),IF(VLOOKUP(F190,Companies!$B$3:$M$1250,10,FALSE)<>\"\",VLOOKUP(F190,Companies!$B$3:$M$1250,10,FALSE),\"\")))))","v":""},{"$f":"IF(VLOOKUP(F190,Companies!$B$3:$M$1250,3,FALSE)<>\"\",VLOOKUP(F190,Companies!$B$3:$M$1250,3,FALSE),IF(VLOOKUP(F190,Companies!$B$3:$M$1250,5,FALSE)<>\"\",VLOOKUP(F190,Companies!$B$3:$M$1250,5,FALSE),IF(VLOOKUP(F190,Companies!$B$3:$M$1250,7,FALSE)<>\"\",VLOOKUP(F190,Companies!$B$3:$M$1250,7,FALSE),IF(VLOOKUP(F190,Companies!$B$3:$M$1250,9,FALSE)<>\"\",VLOOKUP(F190,Companies!$B$3:$M$1250,9,FALSE),IF(VLOOKUP(F190,Companies!$B$3:$M$1250,11,FALSE)<>\"\",VLOOKUP(F190,Companies!$B$3:$M$1250,11,FALSE),\"\")))))","v":""},{"$f":"IF(VLOOKUP(F190,Companies!$B$3:$M$1250,12,FALSE)<>\"\",VLOOKUP(F190,Companies!$B$3:$M$1250,12,FALSE),\"\")","v":""}]
[{"$nulls":3},"VSUK","411SOFRUCESAS","SOFRUCE SAS","2019-05-31","2019-06-30","Invoice","IN05190007",{"v":100,"d":"100.00 €"},{"$f":"IF(VLOOKUP(F191,Companies!$B$3:$M$1250,2,FALSE)<>\"\",VLOOKUP(F191,Companies!$B$3:$M$1250,2,FALSE),IF(VLOOKUP(F191,Companies!$B$3:$M$1250,4,FALSE)<>\"\",VLOOKUP(F191,Companies!$B$3:$M$1250,4,FALSE),IF(VLOOKUP(F191,Companies!$B$3:$M$1250,6,FALSE)<>\"\",VLOOKUP(F191,Companies!$B$3:$M$1250,6,FALSE),IF(VLOOKUP(F191,Companies!$B$3:$M$1250,8,FALSE)<>\"\",VLOOKUP(F191,Companies!$B$3:$M$1250,8,FALSE),IF(VLOOKUP(F191,Companies!$B$3:$M$1250,10,FALSE)<>\"\",VLOOKUP(F191,Companies!$B$3:$M$1250,10,FALSE),\"\")))))","v":""},{"$f":"IF(VLOOKUP(F191,Companies!$B$3:$M$1250,3,FALSE)<>\"\",VLOOKUP(F191,Companies!$B$3:$M$1250,3,FALSE),IF(VLOOKUP(F191,Companies!$B$3:$M$1250,5,FALSE)<>\"\",VLOOKUP(F191,Companies!$B$3:$M$1250,5,FALSE),IF(VLOOKUP(F191,Companies!$B$3:$M$1250,7,FALSE)<>\"\",VLOOKUP(F191,Companies!$B$3:$M$1250,7,FALSE),IF(VLOOKUP(F191,Companies!$B$3:$M$1250,9,FALSE)<>\"\",VLOOKUP(F191,Companies!$B$3:$M$1250,9,FALSE),IF(VLOOKUP(F191,Companies!$B$3:$M$1250,11,FALSE)<>\"\",VLOOKUP(F191,Companies!$B$3:$M$1250,11,FALSE),\"\")))))","v":""},{"$f":"IF(VLOOKUP(F191,Companies!$B$3:$M$1250,12,FALSE)<>\"\",VLOOKUP(F191,Companies!$B$3:$M$1250,12,FALSE),\"\")","v":""}]
[{"$nulls":3},"VSPT","C000375576","Sonae MC - Serviços Partilhados","2019-05-31","2019-06-30","Invoice","FA 2019/65",{"v":980.93,"d":"980.93 €"},{"$f":"IF(VLOOKUP(F192,Companies!$B$3:$M$1250,2,FALSE)<>\"\",VLOOKUP(F192,Companies!$B$3:$M$1250,2,FALSE),IF(VLOOKUP(F192,Companies!$B$3:$M$1250,4,FALSE)<>\"\",VLOOKUP(F192,Companies!$B$3:$M$1250,4,FALSE),IF(VLOOKUP(F192,Companies!$B$3:$M$1250,6,FALSE)<>\"\",VLOOKUP(F192,Companies!$B$3:$M$1250,6,FALSE),IF(VLOOKUP(F192,Companies!$B$3:$M$1250,8,FALSE)<>\"\",VLOOKUP(F192,Companies!$B$3:$M$1250,8,FALSE),IF(VLOOKUP(F192,Companies!$B$3:$M$1250,10,FALSE)<>\"\",VLOOKUP(F192,Companies!$B$3:$M$1250,10,FALSE),\"\")))))","v":""},{"$f":"IF(VLOOKUP(F192,Companies!$B$3:$M$1250,3,FALSE)<>\"\",VLOOKUP(F192,Companies!$B$3:$M$1250,3,FALSE),IF(VLOOKUP(F192,Companies!$B$3:$M$1250,5,FALSE)<>\"\",VLOOKUP(F192,Companies!$B$3:$M$1250,5,FALSE),IF(VLOOKUP(F192,Companies!$B$3:$M$1250,7,FALSE)<>\"\",VLOOKUP(F192,Companies!$B$3:$M$1250,7,FALSE),IF(VLOOKUP(F192,Companies!$B$3:$M$1250,9,FALSE)<>\"\",VLOOKUP(F192,Companies!$B$3:$M$1250,9,FALSE),IF(VLOOKUP(F192,Companies!$B$3:$M$1250,11,FALSE)<>\"\",VLOOKUP(F192,Companies!$B$3:$M$1250,11,FALSE),\"\")))))","v":""},{"$f":"IF(VLOOKUP(F192,Companies!$B$3:$M$1250,12,FALSE)<>\"\",VLOOKUP(F192,Companies!$B$3:$M$1250,12,FALSE),\"\")","v":""}]
[{"$nulls":3},"VSFR","411SUNGARDENPOLSKA","SUN GARDEN POLSKA Sp.Z.o.o. Sp. K.","2019-04-30","2019-05-30","Invoice","19.04.0085",{"v":649.67,"d":"649.67 €"},{"$f":"IF(VLOOKUP(F193,Companies!$B$3:$M$1250,2,FALSE)<>\"\",VLOOKUP(F193,Companies!$B$3:$M$1250,2,FALSE),IF(VLOOKUP(F193,Companies!$B$3:$M$1250,4,FALSE)<>\"\",VLOOKUP(F193,Companies!$B$3:$M$1250,4,FALSE),IF(VLOOKUP(F193,Companies!$B$3:$M$1250,6,FALSE)<>\"\",VLOOKUP(F193,Companies!$B$3:$M$1250,6,FALSE),IF(VLOOKUP(F193,Companies!$B$3:$M$1250,8,FALSE)<>\"\",VLOOKUP(F193,Companies!$B$3:$M$1250,8,FALSE),IF(VLOOKUP(F193,Companies!$B$3:$M$1250,10,FALSE)<>\"\",VLOOKUP(F193,Companies!$B$3:$M$1250,10,FALSE),\"\")))))","v":""},{"$f":"IF(VLOOKUP(F193,Companies!$B$3:$M$1250,3,FALSE)<>\"\",VLOOKUP(F193,Companies!$B$3:$M$1250,3,FALSE),IF(VLOOKUP(F193,Companies!$B$3:$M$1250,5,FALSE)<>\"\",VLOOKUP(F193,Companies!$B$3:$M$1250,5,FALSE),IF(VLOOKUP(F193,Companies!$B$3:$M$1250,7,FALSE)<>\"\",VLOOKUP(F193,Companies!$B$3:$M$1250,7,FALSE),IF(VLOOKUP(F193,Companies!$B$3:$M$1250,9,FALSE)<>\"\",VLOOKUP(F193,Companies!$B$3:$M$1250,9,FALSE),IF(VLOOKUP(F193,Companies!$B$3:$M$1250,11,FALSE)<>\"\",VLOOKUP(F193,Companies!$B$3:$M$1250,11,FALSE),\"\")))))","v":""},{"$f":"IF(VLOOKUP(F193,Companies!$B$3:$M$1250,12,FALSE)<>\"\",VLOOKUP(F193,Companies!$B$3:$M$1250,12,FALSE),\"\")","v":""}]
[{"$nulls":3},"VSFR","411TANNICOSRL","Tannico SPA","2019-05-31","2019-06-30","Invoice","FA19050143",{"v":3403.01,"d":"3,403.01 €"},{"$f":"IF(VLOOKUP(F194,Companies!$B$3:$M$1250,2,FALSE)<>\"\",VLOOKUP(F194,Companies!$B$3:$M$1250,2,FALSE),IF(VLOOKUP(F194,Companies!$B$3:$M$1250,4,FALSE)<>\"\",VLOOKUP(F194,Companies!$B$3:$M$1250,4,FALSE),IF(VLOOKUP(F194,Companies!$B$3:$M$1250,6,FALSE)<>\"\",VLOOKUP(F194,Companies!$B$3:$M$1250,6,FALSE),IF(VLOOKUP(F194,Companies!$B$3:$M$1250,8,FALSE)<>\"\",VLOOKUP(F194,Companies!$B$3:$M$1250,8,FALSE),IF(VLOOKUP(F194,Companies!$B$3:$M$1250,10,FALSE)<>\"\",VLOOKUP(F194,Companies!$B$3:$M$1250,10,FALSE),\"\")))))","v":""},{"$f":"IF(VLOOKUP(F194,Companies!$B$3:$M$1250,3,FALSE)<>\"\",VLOOKUP(F194,Companies!$B$3:$M$1250,3,FALSE),IF(VLOOKUP(F194,Companies!$B$3:$M$1250,5,FALSE)<>\"\",VLOOKUP(F194,Companies!$B$3:$M$1250,5,FALSE),IF(VLOOKUP(F194,Companies!$B$3:$M$1250,7,FALSE)<>\"\",VLOOKUP(F194,Companies!$B$3:$M$1250,7,FALSE),IF(VLOOKUP(F194,Companies!$B$3:$M$1250,9,FALSE)<>\"\",VLOOKUP(F194,Companies!$B$3:$M$1250,9,FALSE),IF(VLOOKUP(F194,Companies!$B$3:$M$1250,11,FALSE)<>\"\",VLOOKUP(F194,Companies!$B$3:$M$1250,11,FALSE),\"\")))))","v":""},{"$f":"IF(VLOOKUP(F194,Companies!$B$3:$M$1250,12,FALSE)<>\"\",VLOOKUP(F194,Companies!$B$3:$M$1250,12,FALSE),\"\")","v":""}]
[{"$nulls":3},"VSFR","411TCMGOURMET2012S.L","TCM Gourmet 2012 S.L.U.","2019-05-31","2019-06-30","Invoice","FA19050050",{"v":297.8,"d":"297.80 €"},{"$f":"IF(VLOOKUP(F195,Companies!$B$3:$M$1250,2,FALSE)<>\"\",VLOOKUP(F195,Companies!$B$3:$M$1250,2,FALSE),IF(VLOOKUP(F195,Companies!$B$3:$M$1250,4,FALSE)<>\"\",VLOOKUP(F195,Companies!$B$3:$M$1250,4,FALSE),IF(VLOOKUP(F195,Companies!$B$3:$M$1250,6,FALSE)<>\"\",VLOOKUP(F195,Companies!$B$3:$M$1250,6,FALSE),IF(VLOOKUP(F195,Companies!$B$3:$M$1250,8,FALSE)<>\"\",VLOOKUP(F195,Companies!$B$3:$M$1250,8,FALSE),IF(VLOOKUP(F195,Companies!$B$3:$M$1250,10,FALSE)<>\"\",VLOOKUP(F195,Companies!$B$3:$M$1250,10,FALSE),\"\")))))","v":""},{"$f":"IF(VLOOKUP(F195,Companies!$B$3:$M$1250,3,FALSE)<>\"\",VLOOKUP(F195,Companies!$B$3:$M$1250,3,FALSE),IF(VLOOKUP(F195,Companies!$B$3:$M$1250,5,FALSE)<>\"\",VLOOKUP(F195,Companies!$B$3:$M$1250,5,FALSE),IF(VLOOKUP(F195,Companies!$B$3:$M$1250,7,FALSE)<>\"\",VLOOKUP(F195,Companies!$B$3:$M$1250,7,FALSE),IF(VLOOKUP(F195,Companies!$B$3:$M$1250,9,FALSE)<>\"\",VLOOKUP(F195,Companies!$B$3:$M$1250,9,FALSE),IF(VLOOKUP(F195,Companies!$B$3:$M$1250,11,FALSE)<>\"\",VLOOKUP(F195,Companies!$B$3:$M$1250,11,FALSE),\"\")))))","v":""},{"$f":"IF(VLOOKUP(F195,Companies!$B$3:$M$1250,12,FALSE)<>\"\",VLOOKUP(F195,Companies!$B$3:$M$1250,12,FALSE),\"\")","v":""}]
[{"$nulls":3},"VSFR","411TDCA/S","TDC A/S","2019-04-23","2019-05-23","Invoice","19.04.0021",{"v":845.92,"d":"845.92 €"},{"$f":"IF(VLOOKUP(F196,Companies!$B$3:$M$1250,2,FALSE)<>\"\",VLOOKUP(F196,Companies!$B$3:$M$1250,2,FALSE),IF(VLOOKUP(F196,Companies!$B$3:$M$1250,4,FALSE)<>\"\",VLOOKUP(F196,Companies!$B$3:$M$1250,4,FALSE),IF(VLOOKUP(F196,Companies!$B$3:$M$1250,6,FALSE)<>\"\",VLOOKUP(F196,Companies!$B$3:$M$1250,6,FALSE),IF(VLOOKUP(F196,Companies!$B$3:$M$1250,8,FALSE)<>\"\",VLOOKUP(F196,Companies!$B$3:$M$1250,8,FALSE),IF(VLOOKUP(F196,Companies!$B$3:$M$1250,10,FALSE)<>\"\",VLOOKUP(F196,Companies!$B$3:$M$1250,10,FALSE),\"\")))))","v":""},{"$f":"IF(VLOOKUP(F196,Companies!$B$3:$M$1250,3,FALSE)<>\"\",VLOOKUP(F196,Companies!$B$3:$M$1250,3,FALSE),IF(VLOOKUP(F196,Companies!$B$3:$M$1250,5,FALSE)<>\"\",VLOOKUP(F196,Companies!$B$3:$M$1250,5,FALSE),IF(VLOOKUP(F196,Companies!$B$3:$M$1250,7,FALSE)<>\"\",VLOOKUP(F196,Companies!$B$3:$M$1250,7,FALSE),IF(VLOOKUP(F196,Companies!$B$3:$M$1250,9,FALSE)<>\"\",VLOOKUP(F196,Companies!$B$3:$M$1250,9,FALSE),IF(VLOOKUP(F196,Companies!$B$3:$M$1250,11,FALSE)<>\"\",VLOOKUP(F196,Companies!$B$3:$M$1250,11,FALSE),\"\")))))","v":""},{"$f":"IF(VLOOKUP(F196,Companies!$B$3:$M$1250,12,FALSE)<>\"\",VLOOKUP(F196,Companies!$B$3:$M$1250,12,FALSE),\"\")","v":""}]
[{"$nulls":3},"VSFR","411TERHELL&CO.GMBH","TER HELL & CO. GMBH","2018-11-30","2018-12-30","Invoice","18.11.0163",{"v":942.13,"d":"942.13 €"},{"$f":"IF(VLOOKUP(F197,Companies!$B$3:$M$1250,2,FALSE)<>\"\",VLOOKUP(F197,Companies!$B$3:$M$1250,2,FALSE),IF(VLOOKUP(F197,Companies!$B$3:$M$1250,4,FALSE)<>\"\",VLOOKUP(F197,Companies!$B$3:$M$1250,4,FALSE),IF(VLOOKUP(F197,Companies!$B$3:$M$1250,6,FALSE)<>\"\",VLOOKUP(F197,Companies!$B$3:$M$1250,6,FALSE),IF(VLOOKUP(F197,Companies!$B$3:$M$1250,8,FALSE)<>\"\",VLOOKUP(F197,Companies!$B$3:$M$1250,8,FALSE),IF(VLOOKUP(F197,Companies!$B$3:$M$1250,10,FALSE)<>\"\",VLOOKUP(F197,Companies!$B$3:$M$1250,10,FALSE),\"\")))))","v":""},{"$f":"IF(VLOOKUP(F197,Companies!$B$3:$M$1250,3,FALSE)<>\"\",VLOOKUP(F197,Companies!$B$3:$M$1250,3,FALSE),IF(VLOOKUP(F197,Companies!$B$3:$M$1250,5,FALSE)<>\"\",VLOOKUP(F197,Companies!$B$3:$M$1250,5,FALSE),IF(VLOOKUP(F197,Companies!$B$3:$M$1250,7,FALSE)<>\"\",VLOOKUP(F197,Companies!$B$3:$M$1250,7,FALSE),IF(VLOOKUP(F197,Companies!$B$3:$M$1250,9,FALSE)<>\"\",VLOOKUP(F197,Companies!$B$3:$M$1250,9,FALSE),IF(VLOOKUP(F197,Companies!$B$3:$M$1250,11,FALSE)<>\"\",VLOOKUP(F197,Companies!$B$3:$M$1250,11,FALSE),\"\")))))","v":""},{"$f":"IF(VLOOKUP(F197,Companies!$B$3:$M$1250,12,FALSE)<>\"\",VLOOKUP(F197,Companies!$B$3:$M$1250,12,FALSE),\"\")","v":""}]
[{"$nulls":3},"VSFR","411TERHELL&CO.GMBH","TER HELL & CO. GMBH","2018-12-31","2019-01-30","Invoice","18.12.0213",{"v":888.78,"d":"888.78 €"},{"$f":"IF(VLOOKUP(F198,Companies!$B$3:$M$1250,2,FALSE)<>\"\",VLOOKUP(F198,Companies!$B$3:$M$1250,2,FALSE),IF(VLOOKUP(F198,Companies!$B$3:$M$1250,4,FALSE)<>\"\",VLOOKUP(F198,Companies!$B$3:$M$1250,4,FALSE),IF(VLOOKUP(F198,Companies!$B$3:$M$1250,6,FALSE)<>\"\",VLOOKUP(F198,Companies!$B$3:$M$1250,6,FALSE),IF(VLOOKUP(F198,Companies!$B$3:$M$1250,8,FALSE)<>\"\",VLOOKUP(F198,Companies!$B$3:$M$1250,8,FALSE),IF(VLOOKUP(F198,Companies!$B$3:$M$1250,10,FALSE)<>\"\",VLOOKUP(F198,Companies!$B$3:$M$1250,10,FALSE),\"\")))))","v":""},{"$f":"IF(VLOOKUP(F198,Companies!$B$3:$M$1250,3,FALSE)<>\"\",VLOOKUP(F198,Companies!$B$3:$M$1250,3,FALSE),IF(VLOOKUP(F198,Companies!$B$3:$M$1250,5,FALSE)<>\"\",VLOOKUP(F198,Companies!$B$3:$M$1250,5,FALSE),IF(VLOOKUP(F198,Companies!$B$3:$M$1250,7,FALSE)<>\"\",VLOOKUP(F198,Companies!$B$3:$M$1250,7,FALSE),IF(VLOOKUP(F198,Companies!$B$3:$M$1250,9,FALSE)<>\"\",VLOOKUP(F198,Companies!$B$3:$M$1250,9,FALSE),IF(VLOOKUP(F198,Companies!$B$3:$M$1250,11,FALSE)<>\"\",VLOOKUP(F198,Companies!$B$3:$M$1250,11,FALSE),\"\")))))","v":""},{"$f":"IF(VLOOKUP(F198,Companies!$B$3:$M$1250,12,FALSE)<>\"\",VLOOKUP(F198,Companies!$B$3:$M$1250,12,FALSE),\"\")","v":""}]
[{"$nulls":3},"VSFR","411TERHELL&CO.GMBH","TER HELL & CO. GMBH","2019-01-31","2019-03-02","Invoice","19.01.0267",{"v":1059.34,"d":"1,059.34 €"},{"$f":"IF(VLOOKUP(F199,Companies!$B$3:$M$1250,2,FALSE)<>\"\",VLOOKUP(F199,Companies!$B$3:$M$1250,2,FALSE),IF(VLOOKUP(F199,Companies!$B$3:$M$1250,4,FALSE)<>\"\",VLOOKUP(F199,Companies!$B$3:$M$1250,4,FALSE),IF(VLOOKUP(F199,Companies!$B$3:$M$1250,6,FALSE)<>\"\",VLOOKUP(F199,Companies!$B$3:$M$1250,6,FALSE),IF(VLOOKUP(F199,Companies!$B$3:$M$1250,8,FALSE)<>\"\",VLOOKUP(F199,Companies!$B$3:$M$1250,8,FALSE),IF(VLOOKUP(F199,Companies!$B$3:$M$1250,10,FALSE)<>\"\",VLOOKUP(F199,Companies!$B$3:$M$1250,10,FALSE),\"\")))))","v":""},{"$f":"IF(VLOOKUP(F199,Companies!$B$3:$M$1250,3,FALSE)<>\"\",VLOOKUP(F199,Companies!$B$3:$M$1250,3,FALSE),IF(VLOOKUP(F199,Companies!$B$3:$M$1250,5,FALSE)<>\"\",VLOOKUP(F199,Companies!$B$3:$M$1250,5,FALSE),IF(VLOOKUP(F199,Companies!$B$3:$M$1250,7,FALSE)<>\"\",VLOOKUP(F199,Companies!$B$3:$M$1250,7,FALSE),IF(VLOOKUP(F199,Companies!$B$3:$M$1250,9,FALSE)<>\"\",VLOOKUP(F199,Companies!$B$3:$M$1250,9,FALSE),IF(VLOOKUP(F199,Companies!$B$3:$M$1250,11,FALSE)<>\"\",VLOOKUP(F199,Companies!$B$3:$M$1250,11,FALSE),\"\")))))","v":""},{"$f":"IF(VLOOKUP(F199,Companies!$B$3:$M$1250,12,FALSE)<>\"\",VLOOKUP(F199,Companies!$B$3:$M$1250,12,FALSE),\"\")","v":""}]
[{"$nulls":3},"VSFR","411TERHELL&CO.GMBH","TER HELL & CO. GMBH","2019-02-28","2019-03-30","Invoice","19.02.0195",{"v":3648.34,"d":"3,648.34 €"},{"$f":"IF(VLOOKUP(F200,Companies!$B$3:$M$1250,2,FALSE)<>\"\",VLOOKUP(F200,Companies!$B$3:$M$1250,2,FALSE),IF(VLOOKUP(F200,Companies!$B$3:$M$1250,4,FALSE)<>\"\",VLOOKUP(F200,Companies!$B$3:$M$1250,4,FALSE),IF(VLOOKUP(F200,Companies!$B$3:$M$1250,6,FALSE)<>\"\",VLOOKUP(F200,Companies!$B$3:$M$1250,6,FALSE),IF(VLOOKUP(F200,Companies!$B$3:$M$1250,8,FALSE)<>\"\",VLOOKUP(F200,Companies!$B$3:$M$1250,8,FALSE),IF(VLOOKUP(F200,Companies!$B$3:$M$1250,10,FALSE)<>\"\",VLOOKUP(F200,Companies!$B$3:$M$1250,10,FALSE),\"\")))))","v":""},{"$f":"IF(VLOOKUP(F200,Companies!$B$3:$M$1250,3,FALSE)<>\"\",VLOOKUP(F200,Companies!$B$3:$M$1250,3,FALSE),IF(VLOOKUP(F200,Companies!$B$3:$M$1250,5,FALSE)<>\"\",VLOOKUP(F200,Companies!$B$3:$M$1250,5,FALSE),IF(VLOOKUP(F200,Companies!$B$3:$M$1250,7,FALSE)<>\"\",VLOOKUP(F200,Companies!$B$3:$M$1250,7,FALSE),IF(VLOOKUP(F200,Companies!$B$3:$M$1250,9,FALSE)<>\"\",VLOOKUP(F200,Companies!$B$3:$M$1250,9,FALSE),IF(VLOOKUP(F200,Companies!$B$3:$M$1250,11,FALSE)<>\"\",VLOOKUP(F200,Companies!$B$3:$M$1250,11,FALSE),\"\")))))","v":""},{"$f":"IF(VLOOKUP(F200,Companies!$B$3:$M$1250,12,FALSE)<>\"\",VLOOKUP(F200,Companies!$B$3:$M$1250,12,FALSE),\"\")","v":""}]
[{"$nulls":3},"VSFR","411TERHELPLASTICGMBH","TER HELL PLASTIC GMBH","2018-09-30","2018-10-30","Invoice","18.09.0243",{"v":20131.14,"d":"20,131.14 €"},{"$f":"IF(VLOOKUP(F201,Companies!$B$3:$M$1250,2,FALSE)<>\"\",VLOOKUP(F201,Companies!$B$3:$M$1250,2,FALSE),IF(VLOOKUP(F201,Companies!$B$3:$M$1250,4,FALSE)<>\"\",VLOOKUP(F201,Companies!$B$3:$M$1250,4,FALSE),IF(VLOOKUP(F201,Companies!$B$3:$M$1250,6,FALSE)<>\"\",VLOOKUP(F201,Companies!$B$3:$M$1250,6,FALSE),IF(VLOOKUP(F201,Companies!$B$3:$M$1250,8,FALSE)<>\"\",VLOOKUP(F201,Companies!$B$3:$M$1250,8,FALSE),IF(VLOOKUP(F201,Companies!$B$3:$M$1250,10,FALSE)<>\"\",VLOOKUP(F201,Companies!$B$3:$M$1250,10,FALSE),\"\")))))","v":""},{"$f":"IF(VLOOKUP(F201,Companies!$B$3:$M$1250,3,FALSE)<>\"\",VLOOKUP(F201,Companies!$B$3:$M$1250,3,FALSE),IF(VLOOKUP(F201,Companies!$B$3:$M$1250,5,FALSE)<>\"\",VLOOKUP(F201,Companies!$B$3:$M$1250,5,FALSE),IF(VLOOKUP(F201,Companies!$B$3:$M$1250,7,FALSE)<>\"\",VLOOKUP(F201,Companies!$B$3:$M$1250,7,FALSE),IF(VLOOKUP(F201,Companies!$B$3:$M$1250,9,FALSE)<>\"\",VLOOKUP(F201,Companies!$B$3:$M$1250,9,FALSE),IF(VLOOKUP(F201,Companies!$B$3:$M$1250,11,FALSE)<>\"\",VLOOKUP(F201,Companies!$B$3:$M$1250,11,FALSE),\"\")))))","v":""},{"$f":"IF(VLOOKUP(F201,Companies!$B$3:$M$1250,12,FALSE)<>\"\",VLOOKUP(F201,Companies!$B$3:$M$1250,12,FALSE),\"\")","v":""}]
[{"$nulls":3},"VSFR","411TERNORDICSAPS","TER NORDICS APS","2018-09-30","2018-10-30","Invoice","18.09.0214",{"v":1687.34,"d":"1,687.34 €"},{"$f":"IF(VLOOKUP(F202,Companies!$B$3:$M$1250,2,FALSE)<>\"\",VLOOKUP(F202,Companies!$B$3:$M$1250,2,FALSE),IF(VLOOKUP(F202,Companies!$B$3:$M$1250,4,FALSE)<>\"\",VLOOKUP(F202,Companies!$B$3:$M$1250,4,FALSE),IF(VLOOKUP(F202,Companies!$B$3:$M$1250,6,FALSE)<>\"\",VLOOKUP(F202,Companies!$B$3:$M$1250,6,FALSE),IF(VLOOKUP(F202,Companies!$B$3:$M$1250,8,FALSE)<>\"\",VLOOKUP(F202,Companies!$B$3:$M$1250,8,FALSE),IF(VLOOKUP(F202,Companies!$B$3:$M$1250,10,FALSE)<>\"\",VLOOKUP(F202,Companies!$B$3:$M$1250,10,FALSE),\"\")))))","v":""},{"$f":"IF(VLOOKUP(F202,Companies!$B$3:$M$1250,3,FALSE)<>\"\",VLOOKUP(F202,Companies!$B$3:$M$1250,3,FALSE),IF(VLOOKUP(F202,Companies!$B$3:$M$1250,5,FALSE)<>\"\",VLOOKUP(F202,Companies!$B$3:$M$1250,5,FALSE),IF(VLOOKUP(F202,Companies!$B$3:$M$1250,7,FALSE)<>\"\",VLOOKUP(F202,Companies!$B$3:$M$1250,7,FALSE),IF(VLOOKUP(F202,Companies!$B$3:$M$1250,9,FALSE)<>\"\",VLOOKUP(F202,Companies!$B$3:$M$1250,9,FALSE),IF(VLOOKUP(F202,Companies!$B$3:$M$1250,11,FALSE)<>\"\",VLOOKUP(F202,Companies!$B$3:$M$1250,11,FALSE),\"\")))))","v":""},{"$f":"IF(VLOOKUP(F202,Companies!$B$3:$M$1250,12,FALSE)<>\"\",VLOOKUP(F202,Companies!$B$3:$M$1250,12,FALSE),\"\")","v":""}]
[{"$nulls":3},"VSFR","411TERNORDICSAPS","TER NORDICS APS","2018-10-31","2018-11-30","Invoice","18.10.0179",{"v":1110.33,"d":"1,110.33 €"},{"$f":"IF(VLOOKUP(F203,Companies!$B$3:$M$1250,2,FALSE)<>\"\",VLOOKUP(F203,Companies!$B$3:$M$1250,2,FALSE),IF(VLOOKUP(F203,Companies!$B$3:$M$1250,4,FALSE)<>\"\",VLOOKUP(F203,Companies!$B$3:$M$1250,4,FALSE),IF(VLOOKUP(F203,Companies!$B$3:$M$1250,6,FALSE)<>\"\",VLOOKUP(F203,Companies!$B$3:$M$1250,6,FALSE),IF(VLOOKUP(F203,Companies!$B$3:$M$1250,8,FALSE)<>\"\",VLOOKUP(F203,Companies!$B$3:$M$1250,8,FALSE),IF(VLOOKUP(F203,Companies!$B$3:$M$1250,10,FALSE)<>\"\",VLOOKUP(F203,Companies!$B$3:$M$1250,10,FALSE),\"\")))))","v":""},{"$f":"IF(VLOOKUP(F203,Companies!$B$3:$M$1250,3,FALSE)<>\"\",VLOOKUP(F203,Companies!$B$3:$M$1250,3,FALSE),IF(VLOOKUP(F203,Companies!$B$3:$M$1250,5,FALSE)<>\"\",VLOOKUP(F203,Companies!$B$3:$M$1250,5,FALSE),IF(VLOOKUP(F203,Companies!$B$3:$M$1250,7,FALSE)<>\"\",VLOOKUP(F203,Companies!$B$3:$M$1250,7,FALSE),IF(VLOOKUP(F203,Companies!$B$3:$M$1250,9,FALSE)<>\"\",VLOOKUP(F203,Companies!$B$3:$M$1250,9,FALSE),IF(VLOOKUP(F203,Companies!$B$3:$M$1250,11,FALSE)<>\"\",VLOOKUP(F203,Companies!$B$3:$M$1250,11,FALSE),\"\")))))","v":""},{"$f":"IF(VLOOKUP(F203,Companies!$B$3:$M$1250,12,FALSE)<>\"\",VLOOKUP(F203,Companies!$B$3:$M$1250,12,FALSE),\"\")","v":""}]
[{"$nulls":3},"VSFR","411TERNORDICSAPS","TER NORDICS APS","2018-11-30","2018-12-30","Invoice","18.11.0153",{"v":214,"d":"214.00 €"},{"$f":"IF(VLOOKUP(F204,Companies!$B$3:$M$1250,2,FALSE)<>\"\",VLOOKUP(F204,Companies!$B$3:$M$1250,2,FALSE),IF(VLOOKUP(F204,Companies!$B$3:$M$1250,4,FALSE)<>\"\",VLOOKUP(F204,Companies!$B$3:$M$1250,4,FALSE),IF(VLOOKUP(F204,Companies!$B$3:$M$1250,6,FALSE)<>\"\",VLOOKUP(F204,Companies!$B$3:$M$1250,6,FALSE),IF(VLOOKUP(F204,Companies!$B$3:$M$1250,8,FALSE)<>\"\",VLOOKUP(F204,Companies!$B$3:$M$1250,8,FALSE),IF(VLOOKUP(F204,Companies!$B$3:$M$1250,10,FALSE)<>\"\",VLOOKUP(F204,Companies!$B$3:$M$1250,10,FALSE),\"\")))))","v":""},{"$f":"IF(VLOOKUP(F204,Companies!$B$3:$M$1250,3,FALSE)<>\"\",VLOOKUP(F204,Companies!$B$3:$M$1250,3,FALSE),IF(VLOOKUP(F204,Companies!$B$3:$M$1250,5,FALSE)<>\"\",VLOOKUP(F204,Companies!$B$3:$M$1250,5,FALSE),IF(VLOOKUP(F204,Companies!$B$3:$M$1250,7,FALSE)<>\"\",VLOOKUP(F204,Companies!$B$3:$M$1250,7,FALSE),IF(VLOOKUP(F204,Companies!$B$3:$M$1250,9,FALSE)<>\"\",VLOOKUP(F204,Companies!$B$3:$M$1250,9,FALSE),IF(VLOOKUP(F204,Companies!$B$3:$M$1250,11,FALSE)<>\"\",VLOOKUP(F204,Companies!$B$3:$M$1250,11,FALSE),\"\")))))","v":""},{"$f":"IF(VLOOKUP(F204,Companies!$B$3:$M$1250,12,FALSE)<>\"\",VLOOKUP(F204,Companies!$B$3:$M$1250,12,FALSE),\"\")","v":""}]
[{"$nulls":3},"VSFR","411TERNORDICSAPS","TER NORDICS APS","2019-05-31","2019-06-30","Invoice","FA19050035",{"v":143.33,"d":"143.33 €"},{"$f":"IF(VLOOKUP(F205,Companies!$B$3:$M$1250,2,FALSE)<>\"\",VLOOKUP(F205,Companies!$B$3:$M$1250,2,FALSE),IF(VLOOKUP(F205,Companies!$B$3:$M$1250,4,FALSE)<>\"\",VLOOKUP(F205,Companies!$B$3:$M$1250,4,FALSE),IF(VLOOKUP(F205,Companies!$B$3:$M$1250,6,FALSE)<>\"\",VLOOKUP(F205,Companies!$B$3:$M$1250,6,FALSE),IF(VLOOKUP(F205,Companies!$B$3:$M$1250,8,FALSE)<>\"\",VLOOKUP(F205,Companies!$B$3:$M$1250,8,FALSE),IF(VLOOKUP(F205,Companies!$B$3:$M$1250,10,FALSE)<>\"\",VLOOKUP(F205,Companies!$B$3:$M$1250,10,FALSE),\"\")))))","v":""},{"$f":"IF(VLOOKUP(F205,Companies!$B$3:$M$1250,3,FALSE)<>\"\",VLOOKUP(F205,Companies!$B$3:$M$1250,3,FALSE),IF(VLOOKUP(F205,Companies!$B$3:$M$1250,5,FALSE)<>\"\",VLOOKUP(F205,Companies!$B$3:$M$1250,5,FALSE),IF(VLOOKUP(F205,Companies!$B$3:$M$1250,7,FALSE)<>\"\",VLOOKUP(F205,Companies!$B$3:$M$1250,7,FALSE),IF(VLOOKUP(F205,Companies!$B$3:$M$1250,9,FALSE)<>\"\",VLOOKUP(F205,Companies!$B$3:$M$1250,9,FALSE),IF(VLOOKUP(F205,Companies!$B$3:$M$1250,11,FALSE)<>\"\",VLOOKUP(F205,Companies!$B$3:$M$1250,11,FALSE),\"\")))))","v":""},{"$f":"IF(VLOOKUP(F205,Companies!$B$3:$M$1250,12,FALSE)<>\"\",VLOOKUP(F205,Companies!$B$3:$M$1250,12,FALSE),\"\")","v":""}]
[{"$nulls":3},"VSFR","411TEREXGLOBALGMBH","TEREX GLOBAL GMBH","2019-04-30","2019-05-30","Invoice","19.04.0201",{"v":36486.91,"d":"36,486.91 €"},{"$f":"IF(VLOOKUP(F206,Companies!$B$3:$M$1250,2,FALSE)<>\"\",VLOOKUP(F206,Companies!$B$3:$M$1250,2,FALSE),IF(VLOOKUP(F206,Companies!$B$3:$M$1250,4,FALSE)<>\"\",VLOOKUP(F206,Companies!$B$3:$M$1250,4,FALSE),IF(VLOOKUP(F206,Companies!$B$3:$M$1250,6,FALSE)<>\"\",VLOOKUP(F206,Companies!$B$3:$M$1250,6,FALSE),IF(VLOOKUP(F206,Companies!$B$3:$M$1250,8,FALSE)<>\"\",VLOOKUP(F206,Companies!$B$3:$M$1250,8,FALSE),IF(VLOOKUP(F206,Companies!$B$3:$M$1250,10,FALSE)<>\"\",VLOOKUP(F206,Companies!$B$3:$M$1250,10,FALSE),\"\")))))","v":""},{"$f":"IF(VLOOKUP(F206,Companies!$B$3:$M$1250,3,FALSE)<>\"\",VLOOKUP(F206,Companies!$B$3:$M$1250,3,FALSE),IF(VLOOKUP(F206,Companies!$B$3:$M$1250,5,FALSE)<>\"\",VLOOKUP(F206,Companies!$B$3:$M$1250,5,FALSE),IF(VLOOKUP(F206,Companies!$B$3:$M$1250,7,FALSE)<>\"\",VLOOKUP(F206,Companies!$B$3:$M$1250,7,FALSE),IF(VLOOKUP(F206,Companies!$B$3:$M$1250,9,FALSE)<>\"\",VLOOKUP(F206,Companies!$B$3:$M$1250,9,FALSE),IF(VLOOKUP(F206,Companies!$B$3:$M$1250,11,FALSE)<>\"\",VLOOKUP(F206,Companies!$B$3:$M$1250,11,FALSE),\"\")))))","v":""},{"$f":"IF(VLOOKUP(F206,Companies!$B$3:$M$1250,12,FALSE)<>\"\",VLOOKUP(F206,Companies!$B$3:$M$1250,12,FALSE),\"\")","v":""}]
[{"$nulls":3},"VSFR","411TEREXGLOBALGMBH","TEREX GLOBAL GMBH","2019-05-31","2019-06-30","Invoice","FA19050178",{"v":40182.33,"d":"40,182.33 €"},{"$f":"IF(VLOOKUP(F207,Companies!$B$3:$M$1250,2,FALSE)<>\"\",VLOOKUP(F207,Companies!$B$3:$M$1250,2,FALSE),IF(VLOOKUP(F207,Companies!$B$3:$M$1250,4,FALSE)<>\"\",VLOOKUP(F207,Companies!$B$3:$M$1250,4,FALSE),IF(VLOOKUP(F207,Companies!$B$3:$M$1250,6,FALSE)<>\"\",VLOOKUP(F207,Companies!$B$3:$M$1250,6,FALSE),IF(VLOOKUP(F207,Companies!$B$3:$M$1250,8,FALSE)<>\"\",VLOOKUP(F207,Companies!$B$3:$M$1250,8,FALSE),IF(VLOOKUP(F207,Companies!$B$3:$M$1250,10,FALSE)<>\"\",VLOOKUP(F207,Companies!$B$3:$M$1250,10,FALSE),\"\")))))","v":""},{"$f":"IF(VLOOKUP(F207,Companies!$B$3:$M$1250,3,FALSE)<>\"\",VLOOKUP(F207,Companies!$B$3:$M$1250,3,FALSE),IF(VLOOKUP(F207,Companies!$B$3:$M$1250,5,FALSE)<>\"\",VLOOKUP(F207,Companies!$B$3:$M$1250,5,FALSE),IF(VLOOKUP(F207,Companies!$B$3:$M$1250,7,FALSE)<>\"\",VLOOKUP(F207,Companies!$B$3:$M$1250,7,FALSE),IF(VLOOKUP(F207,Companies!$B$3:$M$1250,9,FALSE)<>\"\",VLOOKUP(F207,Companies!$B$3:$M$1250,9,FALSE),IF(VLOOKUP(F207,Companies!$B$3:$M$1250,11,FALSE)<>\"\",VLOOKUP(F207,Companies!$B$3:$M$1250,11,FALSE),\"\")))))","v":""},{"$f":"IF(VLOOKUP(F207,Companies!$B$3:$M$1250,12,FALSE)<>\"\",VLOOKUP(F207,Companies!$B$3:$M$1250,12,FALSE),\"\")","v":""}]
[{"$nulls":3},"VSUK","411THALESSERVICESSAS","THALES SERVICES SAS","2018-08-16","2018-09-15","Invoice","08.18.0004",{"v":4963.9,"d":"4,963.90 €"},{"$f":"IF(VLOOKUP(F208,Companies!$B$3:$M$1250,2,FALSE)<>\"\",VLOOKUP(F208,Companies!$B$3:$M$1250,2,FALSE),IF(VLOOKUP(F208,Companies!$B$3:$M$1250,4,FALSE)<>\"\",VLOOKUP(F208,Companies!$B$3:$M$1250,4,FALSE),IF(VLOOKUP(F208,Companies!$B$3:$M$1250,6,FALSE)<>\"\",VLOOKUP(F208,Companies!$B$3:$M$1250,6,FALSE),IF(VLOOKUP(F208,Companies!$B$3:$M$1250,8,FALSE)<>\"\",VLOOKUP(F208,Companies!$B$3:$M$1250,8,FALSE),IF(VLOOKUP(F208,Companies!$B$3:$M$1250,10,FALSE)<>\"\",VLOOKUP(F208,Companies!$B$3:$M$1250,10,FALSE),\"\")))))","v":""},{"$f":"IF(VLOOKUP(F208,Companies!$B$3:$M$1250,3,FALSE)<>\"\",VLOOKUP(F208,Companies!$B$3:$M$1250,3,FALSE),IF(VLOOKUP(F208,Companies!$B$3:$M$1250,5,FALSE)<>\"\",VLOOKUP(F208,Companies!$B$3:$M$1250,5,FALSE),IF(VLOOKUP(F208,Companies!$B$3:$M$1250,7,FALSE)<>\"\",VLOOKUP(F208,Companies!$B$3:$M$1250,7,FALSE),IF(VLOOKUP(F208,Companies!$B$3:$M$1250,9,FALSE)<>\"\",VLOOKUP(F208,Companies!$B$3:$M$1250,9,FALSE),IF(VLOOKUP(F208,Companies!$B$3:$M$1250,11,FALSE)<>\"\",VLOOKUP(F208,Companies!$B$3:$M$1250,11,FALSE),\"\")))))","v":""},{"$f":"IF(VLOOKUP(F208,Companies!$B$3:$M$1250,12,FALSE)<>\"\",VLOOKUP(F208,Companies!$B$3:$M$1250,12,FALSE),\"\")","v":""}]
[{"$nulls":3},"VSFR","411THEPROACTIVCOMPAN","The Proactiv Company Sàrl","2019-04-30","2019-05-30","Invoice","19.04.0141",{"v":2434.17,"d":"2,434.17 €"},{"$f":"IF(VLOOKUP(F209,Companies!$B$3:$M$1250,2,FALSE)<>\"\",VLOOKUP(F209,Companies!$B$3:$M$1250,2,FALSE),IF(VLOOKUP(F209,Companies!$B$3:$M$1250,4,FALSE)<>\"\",VLOOKUP(F209,Companies!$B$3:$M$1250,4,FALSE),IF(VLOOKUP(F209,Companies!$B$3:$M$1250,6,FALSE)<>\"\",VLOOKUP(F209,Companies!$B$3:$M$1250,6,FALSE),IF(VLOOKUP(F209,Companies!$B$3:$M$1250,8,FALSE)<>\"\",VLOOKUP(F209,Companies!$B$3:$M$1250,8,FALSE),IF(VLOOKUP(F209,Companies!$B$3:$M$1250,10,FALSE)<>\"\",VLOOKUP(F209,Companies!$B$3:$M$1250,10,FALSE),\"\")))))","v":""},{"$f":"IF(VLOOKUP(F209,Companies!$B$3:$M$1250,3,FALSE)<>\"\",VLOOKUP(F209,Companies!$B$3:$M$1250,3,FALSE),IF(VLOOKUP(F209,Companies!$B$3:$M$1250,5,FALSE)<>\"\",VLOOKUP(F209,Companies!$B$3:$M$1250,5,FALSE),IF(VLOOKUP(F209,Companies!$B$3:$M$1250,7,FALSE)<>\"\",VLOOKUP(F209,Companies!$B$3:$M$1250,7,FALSE),IF(VLOOKUP(F209,Companies!$B$3:$M$1250,9,FALSE)<>\"\",VLOOKUP(F209,Companies!$B$3:$M$1250,9,FALSE),IF(VLOOKUP(F209,Companies!$B$3:$M$1250,11,FALSE)<>\"\",VLOOKUP(F209,Companies!$B$3:$M$1250,11,FALSE),\"\")))))","v":""},{"$f":"IF(VLOOKUP(F209,Companies!$B$3:$M$1250,12,FALSE)<>\"\",VLOOKUP(F209,Companies!$B$3:$M$1250,12,FALSE),\"\")","v":""}]
[{"$nulls":3},"VSFR","411THEPROACTIVCOMPAN","The Proactiv Company Sàrl","2019-05-31","2019-06-30","Invoice","FA19050173",{"v":172.55,"d":"172.55 €"},{"$f":"IF(VLOOKUP(F210,Companies!$B$3:$M$1250,2,FALSE)<>\"\",VLOOKUP(F210,Companies!$B$3:$M$1250,2,FALSE),IF(VLOOKUP(F210,Companies!$B$3:$M$1250,4,FALSE)<>\"\",VLOOKUP(F210,Companies!$B$3:$M$1250,4,FALSE),IF(VLOOKUP(F210,Companies!$B$3:$M$1250,6,FALSE)<>\"\",VLOOKUP(F210,Companies!$B$3:$M$1250,6,FALSE),IF(VLOOKUP(F210,Companies!$B$3:$M$1250,8,FALSE)<>\"\",VLOOKUP(F210,Companies!$B$3:$M$1250,8,FALSE),IF(VLOOKUP(F210,Companies!$B$3:$M$1250,10,FALSE)<>\"\",VLOOKUP(F210,Companies!$B$3:$M$1250,10,FALSE),\"\")))))","v":""},{"$f":"IF(VLOOKUP(F210,Companies!$B$3:$M$1250,3,FALSE)<>\"\",VLOOKUP(F210,Companies!$B$3:$M$1250,3,FALSE),IF(VLOOKUP(F210,Companies!$B$3:$M$1250,5,FALSE)<>\"\",VLOOKUP(F210,Companies!$B$3:$M$1250,5,FALSE),IF(VLOOKUP(F210,Companies!$B$3:$M$1250,7,FALSE)<>\"\",VLOOKUP(F210,Companies!$B$3:$M$1250,7,FALSE),IF(VLOOKUP(F210,Companies!$B$3:$M$1250,9,FALSE)<>\"\",VLOOKUP(F210,Companies!$B$3:$M$1250,9,FALSE),IF(VLOOKUP(F210,Companies!$B$3:$M$1250,11,FALSE)<>\"\",VLOOKUP(F210,Companies!$B$3:$M$1250,11,FALSE),\"\")))))","v":""},{"$f":"IF(VLOOKUP(F210,Companies!$B$3:$M$1250,12,FALSE)<>\"\",VLOOKUP(F210,Companies!$B$3:$M$1250,12,FALSE),\"\")","v":""}]
[{"$nulls":3},"VSFR","411THEAFARMASPA","THEA FARMA SPA","2019-05-31","2019-06-30","Invoice","FA19050118",{"v":500,"d":"500.00 €"},{"$f":"IF(VLOOKUP(F211,Companies!$B$3:$M$1250,2,FALSE)<>\"\",VLOOKUP(F211,Companies!$B$3:$M$1250,2,FALSE),IF(VLOOKUP(F211,Companies!$B$3:$M$1250,4,FALSE)<>\"\",VLOOKUP(F211,Companies!$B$3:$M$1250,4,FALSE),IF(VLOOKUP(F211,Companies!$B$3:$M$1250,6,FALSE)<>\"\",VLOOKUP(F211,Companies!$B$3:$M$1250,6,FALSE),IF(VLOOKUP(F211,Companies!$B$3:$M$1250,8,FALSE)<>\"\",VLOOKUP(F211,Companies!$B$3:$M$1250,8,FALSE),IF(VLOOKUP(F211,Companies!$B$3:$M$1250,10,FALSE)<>\"\",VLOOKUP(F211,Companies!$B$3:$M$1250,10,FALSE),\"\")))))","v":""},{"$f":"IF(VLOOKUP(F211,Companies!$B$3:$M$1250,3,FALSE)<>\"\",VLOOKUP(F211,Companies!$B$3:$M$1250,3,FALSE),IF(VLOOKUP(F211,Companies!$B$3:$M$1250,5,FALSE)<>\"\",VLOOKUP(F211,Companies!$B$3:$M$1250,5,FALSE),IF(VLOOKUP(F211,Companies!$B$3:$M$1250,7,FALSE)<>\"\",VLOOKUP(F211,Companies!$B$3:$M$1250,7,FALSE),IF(VLOOKUP(F211,Companies!$B$3:$M$1250,9,FALSE)<>\"\",VLOOKUP(F211,Companies!$B$3:$M$1250,9,FALSE),IF(VLOOKUP(F211,Companies!$B$3:$M$1250,11,FALSE)<>\"\",VLOOKUP(F211,Companies!$B$3:$M$1250,11,FALSE),\"\")))))","v":""},{"$f":"IF(VLOOKUP(F211,Companies!$B$3:$M$1250,12,FALSE)<>\"\",VLOOKUP(F211,Companies!$B$3:$M$1250,12,FALSE),\"\")","v":""}]
[{"$nulls":3},"VSFR","411TUVNORDMOBILIBATG","TÜV NORD MOBILITÄT GmbH & Co Kg","2019-05-31","2019-06-30","Invoice",{"$f":"\"19050006\"","v":"19050006"},{"v":150,"d":"150.00 €"},{"$f":"IF(VLOOKUP(F212,Companies!$B$3:$M$1250,2,FALSE)<>\"\",VLOOKUP(F212,Companies!$B$3:$M$1250,2,FALSE),IF(VLOOKUP(F212,Companies!$B$3:$M$1250,4,FALSE)<>\"\",VLOOKUP(F212,Companies!$B$3:$M$1250,4,FALSE),IF(VLOOKUP(F212,Companies!$B$3:$M$1250,6,FALSE)<>\"\",VLOOKUP(F212,Companies!$B$3:$M$1250,6,FALSE),IF(VLOOKUP(F212,Companies!$B$3:$M$1250,8,FALSE)<>\"\",VLOOKUP(F212,Companies!$B$3:$M$1250,8,FALSE),IF(VLOOKUP(F212,Companies!$B$3:$M$1250,10,FALSE)<>\"\",VLOOKUP(F212,Companies!$B$3:$M$1250,10,FALSE),\"\")))))","v":""},{"$f":"IF(VLOOKUP(F212,Companies!$B$3:$M$1250,3,FALSE)<>\"\",VLOOKUP(F212,Companies!$B$3:$M$1250,3,FALSE),IF(VLOOKUP(F212,Companies!$B$3:$M$1250,5,FALSE)<>\"\",VLOOKUP(F212,Companies!$B$3:$M$1250,5,FALSE),IF(VLOOKUP(F212,Companies!$B$3:$M$1250,7,FALSE)<>\"\",VLOOKUP(F212,Companies!$B$3:$M$1250,7,FALSE),IF(VLOOKUP(F212,Companies!$B$3:$M$1250,9,FALSE)<>\"\",VLOOKUP(F212,Companies!$B$3:$M$1250,9,FALSE),IF(VLOOKUP(F212,Companies!$B$3:$M$1250,11,FALSE)<>\"\",VLOOKUP(F212,Companies!$B$3:$M$1250,11,FALSE),\"\")))))","v":""},{"$f":"IF(VLOOKUP(F212,Companies!$B$3:$M$1250,12,FALSE)<>\"\",VLOOKUP(F212,Companies!$B$3:$M$1250,12,FALSE),\"\")","v":""}]
[{"$nulls":3},"VSFR","411TÜVRHEINLANDAKADE","TÜV Rheinland Akademie GmbH","2019-05-31","2019-06-30","Invoice",{"$f":"\"19050015\"","v":"19050015"},{"v":150,"d":"150.00 €"},{"$f":"IF(VLOOKUP(F213,Companies!$B$3:$M$1250,2,FALSE)<>\"\",VLOOKUP(F213,Companies!$B$3:$M$1250,2,FALSE),IF(VLOOKUP(F213,Companies!$B$3:$M$1250,4,FALSE)<>\"\",VLOOKUP(F213,Companies!$B$3:$M$1250,4,FALSE),IF(VLOOKUP(F213,Companies!$B$3:$M$1250,6,FALSE)<>\"\",VLOOKUP(F213,Companies!$B$3:$M$1250,6,FALSE),IF(VLOOKUP(F213,Companies!$B$3:$M$1250,8,FALSE)<>\"\",VLOOKUP(F213,Companies!$B$3:$M$1250,8,FALSE),IF(VLOOKUP(F213,Companies!$B$3:$M$1250,10,FALSE)<>\"\",VLOOKUP(F213,Companies!$B$3:$M$1250,10,FALSE),\"\")))))","v":""},{"$f":"IF(VLOOKUP(F213,Companies!$B$3:$M$1250,3,FALSE)<>\"\",VLOOKUP(F213,Companies!$B$3:$M$1250,3,FALSE),IF(VLOOKUP(F213,Companies!$B$3:$M$1250,5,FALSE)<>\"\",VLOOKUP(F213,Companies!$B$3:$M$1250,5,FALSE),IF(VLOOKUP(F213,Companies!$B$3:$M$1250,7,FALSE)<>\"\",VLOOKUP(F213,Companies!$B$3:$M$1250,7,FALSE),IF(VLOOKUP(F213,Companies!$B$3:$M$1250,9,FALSE)<>\"\",VLOOKUP(F213,Companies!$B$3:$M$1250,9,FALSE),IF(VLOOKUP(F213,Companies!$B$3:$M$1250,11,FALSE)<>\"\",VLOOKUP(F213,Companies!$B$3:$M$1250,11,FALSE),\"\")))))","v":""},{"$f":"IF(VLOOKUP(F213,Companies!$B$3:$M$1250,12,FALSE)<>\"\",VLOOKUP(F213,Companies!$B$3:$M$1250,12,FALSE),\"\")","v":""}]
[{"$nulls":3},"VSFR","411UMS-URBANMININGSO","UMS - Urban Mining Solutions GmbH","2019-03-31","2019-04-30","Invoice","19.03.0207",{"v":761.66,"d":"761.66 €"},{"$f":"IF(VLOOKUP(F214,Companies!$B$3:$M$1250,2,FALSE)<>\"\",VLOOKUP(F214,Companies!$B$3:$M$1250,2,FALSE),IF(VLOOKUP(F214,Companies!$B$3:$M$1250,4,FALSE)<>\"\",VLOOKUP(F214,Companies!$B$3:$M$1250,4,FALSE),IF(VLOOKUP(F214,Companies!$B$3:$M$1250,6,FALSE)<>\"\",VLOOKUP(F214,Companies!$B$3:$M$1250,6,FALSE),IF(VLOOKUP(F214,Companies!$B$3:$M$1250,8,FALSE)<>\"\",VLOOKUP(F214,Companies!$B$3:$M$1250,8,FALSE),IF(VLOOKUP(F214,Companies!$B$3:$M$1250,10,FALSE)<>\"\",VLOOKUP(F214,Companies!$B$3:$M$1250,10,FALSE),\"\")))))","v":""},{"$f":"IF(VLOOKUP(F214,Companies!$B$3:$M$1250,3,FALSE)<>\"\",VLOOKUP(F214,Companies!$B$3:$M$1250,3,FALSE),IF(VLOOKUP(F214,Companies!$B$3:$M$1250,5,FALSE)<>\"\",VLOOKUP(F214,Companies!$B$3:$M$1250,5,FALSE),IF(VLOOKUP(F214,Companies!$B$3:$M$1250,7,FALSE)<>\"\",VLOOKUP(F214,Companies!$B$3:$M$1250,7,FALSE),IF(VLOOKUP(F214,Companies!$B$3:$M$1250,9,FALSE)<>\"\",VLOOKUP(F214,Companies!$B$3:$M$1250,9,FALSE),IF(VLOOKUP(F214,Companies!$B$3:$M$1250,11,FALSE)<>\"\",VLOOKUP(F214,Companies!$B$3:$M$1250,11,FALSE),\"\")))))","v":""},{"$f":"IF(VLOOKUP(F214,Companies!$B$3:$M$1250,12,FALSE)<>\"\",VLOOKUP(F214,Companies!$B$3:$M$1250,12,FALSE),\"\")","v":""}]
[{"$nulls":3},"VSFR","411UMS-URBANMININGSO","UMS - Urban Mining Solutions GmbH","2019-04-30","2019-05-30","Invoice","19.04.0200",{"v":110,"d":"110.00 €"},{"$f":"IF(VLOOKUP(F215,Companies!$B$3:$M$1250,2,FALSE)<>\"\",VLOOKUP(F215,Companies!$B$3:$M$1250,2,FALSE),IF(VLOOKUP(F215,Companies!$B$3:$M$1250,4,FALSE)<>\"\",VLOOKUP(F215,Companies!$B$3:$M$1250,4,FALSE),IF(VLOOKUP(F215,Companies!$B$3:$M$1250,6,FALSE)<>\"\",VLOOKUP(F215,Companies!$B$3:$M$1250,6,FALSE),IF(VLOOKUP(F215,Companies!$B$3:$M$1250,8,FALSE)<>\"\",VLOOKUP(F215,Companies!$B$3:$M$1250,8,FALSE),IF(VLOOKUP(F215,Companies!$B$3:$M$1250,10,FALSE)<>\"\",VLOOKUP(F215,Companies!$B$3:$M$1250,10,FALSE),\"\")))))","v":""},{"$f":"IF(VLOOKUP(F215,Companies!$B$3:$M$1250,3,FALSE)<>\"\",VLOOKUP(F215,Companies!$B$3:$M$1250,3,FALSE),IF(VLOOKUP(F215,Companies!$B$3:$M$1250,5,FALSE)<>\"\",VLOOKUP(F215,Companies!$B$3:$M$1250,5,FALSE),IF(VLOOKUP(F215,Companies!$B$3:$M$1250,7,FALSE)<>\"\",VLOOKUP(F215,Companies!$B$3:$M$1250,7,FALSE),IF(VLOOKUP(F215,Companies!$B$3:$M$1250,9,FALSE)<>\"\",VLOOKUP(F215,Companies!$B$3:$M$1250,9,FALSE),IF(VLOOKUP(F215,Companies!$B$3:$M$1250,11,FALSE)<>\"\",VLOOKUP(F215,Companies!$B$3:$M$1250,11,FALSE),\"\")))))","v":""},{"$f":"IF(VLOOKUP(F215,Companies!$B$3:$M$1250,12,FALSE)<>\"\",VLOOKUP(F215,Companies!$B$3:$M$1250,12,FALSE),\"\")","v":""}]
[{"$nulls":3},"VSFR","411VALEOSLOVAKIASRO","U-SHIN SLOVAKIA s.r.o.","2019-05-31","2019-06-30","Invoice","FA19050166",{"v":1317,"d":"1,317.00 €"},{"$f":"IF(VLOOKUP(F216,Companies!$B$3:$M$1250,2,FALSE)<>\"\",VLOOKUP(F216,Companies!$B$3:$M$1250,2,FALSE),IF(VLOOKUP(F216,Companies!$B$3:$M$1250,4,FALSE)<>\"\",VLOOKUP(F216,Companies!$B$3:$M$1250,4,FALSE),IF(VLOOKUP(F216,Companies!$B$3:$M$1250,6,FALSE)<>\"\",VLOOKUP(F216,Companies!$B$3:$M$1250,6,FALSE),IF(VLOOKUP(F216,Companies!$B$3:$M$1250,8,FALSE)<>\"\",VLOOKUP(F216,Companies!$B$3:$M$1250,8,FALSE),IF(VLOOKUP(F216,Companies!$B$3:$M$1250,10,FALSE)<>\"\",VLOOKUP(F216,Companies!$B$3:$M$1250,10,FALSE),\"\")))))","v":""},{"$f":"IF(VLOOKUP(F216,Companies!$B$3:$M$1250,3,FALSE)<>\"\",VLOOKUP(F216,Companies!$B$3:$M$1250,3,FALSE),IF(VLOOKUP(F216,Companies!$B$3:$M$1250,5,FALSE)<>\"\",VLOOKUP(F216,Companies!$B$3:$M$1250,5,FALSE),IF(VLOOKUP(F216,Companies!$B$3:$M$1250,7,FALSE)<>\"\",VLOOKUP(F216,Companies!$B$3:$M$1250,7,FALSE),IF(VLOOKUP(F216,Companies!$B$3:$M$1250,9,FALSE)<>\"\",VLOOKUP(F216,Companies!$B$3:$M$1250,9,FALSE),IF(VLOOKUP(F216,Companies!$B$3:$M$1250,11,FALSE)<>\"\",VLOOKUP(F216,Companies!$B$3:$M$1250,11,FALSE),\"\")))))","v":""},{"$f":"IF(VLOOKUP(F216,Companies!$B$3:$M$1250,12,FALSE)<>\"\",VLOOKUP(F216,Companies!$B$3:$M$1250,12,FALSE),\"\")","v":""}]
[{"$nulls":3},"VSFR","411VALEOAUTOSYSTEMYS","VALEO AUTOSYSTEMY SP. Z O.O.","2019-03-31","2019-04-30","Invoice","19.03.0202",{"v":4467.69,"d":"4,467.69 €"},{"$f":"IF(VLOOKUP(F217,Companies!$B$3:$M$1250,2,FALSE)<>\"\",VLOOKUP(F217,Companies!$B$3:$M$1250,2,FALSE),IF(VLOOKUP(F217,Companies!$B$3:$M$1250,4,FALSE)<>\"\",VLOOKUP(F217,Companies!$B$3:$M$1250,4,FALSE),IF(VLOOKUP(F217,Companies!$B$3:$M$1250,6,FALSE)<>\"\",VLOOKUP(F217,Companies!$B$3:$M$1250,6,FALSE),IF(VLOOKUP(F217,Companies!$B$3:$M$1250,8,FALSE)<>\"\",VLOOKUP(F217,Companies!$B$3:$M$1250,8,FALSE),IF(VLOOKUP(F217,Companies!$B$3:$M$1250,10,FALSE)<>\"\",VLOOKUP(F217,Companies!$B$3:$M$1250,10,FALSE),\"\")))))","v":""},{"$f":"IF(VLOOKUP(F217,Companies!$B$3:$M$1250,3,FALSE)<>\"\",VLOOKUP(F217,Companies!$B$3:$M$1250,3,FALSE),IF(VLOOKUP(F217,Companies!$B$3:$M$1250,5,FALSE)<>\"\",VLOOKUP(F217,Companies!$B$3:$M$1250,5,FALSE),IF(VLOOKUP(F217,Companies!$B$3:$M$1250,7,FALSE)<>\"\",VLOOKUP(F217,Companies!$B$3:$M$1250,7,FALSE),IF(VLOOKUP(F217,Companies!$B$3:$M$1250,9,FALSE)<>\"\",VLOOKUP(F217,Companies!$B$3:$M$1250,9,FALSE),IF(VLOOKUP(F217,Companies!$B$3:$M$1250,11,FALSE)<>\"\",VLOOKUP(F217,Companies!$B$3:$M$1250,11,FALSE),\"\")))))","v":""},{"$f":"IF(VLOOKUP(F217,Companies!$B$3:$M$1250,12,FALSE)<>\"\",VLOOKUP(F217,Companies!$B$3:$M$1250,12,FALSE),\"\")","v":""}]
[{"$nulls":3},"VSFR","411VALEOAUTOSYSTEMYS","VALEO AUTOSYSTEMY SP. Z O.O.","2019-04-30","2019-05-30","Invoice","19.04.0233",{"v":6813.34,"d":"6,813.34 €"},{"$f":"IF(VLOOKUP(F218,Companies!$B$3:$M$1250,2,FALSE)<>\"\",VLOOKUP(F218,Companies!$B$3:$M$1250,2,FALSE),IF(VLOOKUP(F218,Companies!$B$3:$M$1250,4,FALSE)<>\"\",VLOOKUP(F218,Companies!$B$3:$M$1250,4,FALSE),IF(VLOOKUP(F218,Companies!$B$3:$M$1250,6,FALSE)<>\"\",VLOOKUP(F218,Companies!$B$3:$M$1250,6,FALSE),IF(VLOOKUP(F218,Companies!$B$3:$M$1250,8,FALSE)<>\"\",VLOOKUP(F218,Companies!$B$3:$M$1250,8,FALSE),IF(VLOOKUP(F218,Companies!$B$3:$M$1250,10,FALSE)<>\"\",VLOOKUP(F218,Companies!$B$3:$M$1250,10,FALSE),\"\")))))","v":""},{"$f":"IF(VLOOKUP(F218,Companies!$B$3:$M$1250,3,FALSE)<>\"\",VLOOKUP(F218,Companies!$B$3:$M$1250,3,FALSE),IF(VLOOKUP(F218,Companies!$B$3:$M$1250,5,FALSE)<>\"\",VLOOKUP(F218,Companies!$B$3:$M$1250,5,FALSE),IF(VLOOKUP(F218,Companies!$B$3:$M$1250,7,FALSE)<>\"\",VLOOKUP(F218,Companies!$B$3:$M$1250,7,FALSE),IF(VLOOKUP(F218,Companies!$B$3:$M$1250,9,FALSE)<>\"\",VLOOKUP(F218,Companies!$B$3:$M$1250,9,FALSE),IF(VLOOKUP(F218,Companies!$B$3:$M$1250,11,FALSE)<>\"\",VLOOKUP(F218,Companies!$B$3:$M$1250,11,FALSE),\"\")))))","v":""},{"$f":"IF(VLOOKUP(F218,Companies!$B$3:$M$1250,12,FALSE)<>\"\",VLOOKUP(F218,Companies!$B$3:$M$1250,12,FALSE),\"\")","v":""}]
[{"$nulls":3},"VSFR","411VALEOAUTOSYSTEMYS","VALEO AUTOSYSTEMY SP. Z O.O.","2019-05-31","2019-06-30","Invoice","FA19050104",{"v":5106.97,"d":"5,106.97 €"},{"$f":"IF(VLOOKUP(F219,Companies!$B$3:$M$1250,2,FALSE)<>\"\",VLOOKUP(F219,Companies!$B$3:$M$1250,2,FALSE),IF(VLOOKUP(F219,Companies!$B$3:$M$1250,4,FALSE)<>\"\",VLOOKUP(F219,Companies!$B$3:$M$1250,4,FALSE),IF(VLOOKUP(F219,Companies!$B$3:$M$1250,6,FALSE)<>\"\",VLOOKUP(F219,Companies!$B$3:$M$1250,6,FALSE),IF(VLOOKUP(F219,Companies!$B$3:$M$1250,8,FALSE)<>\"\",VLOOKUP(F219,Companies!$B$3:$M$1250,8,FALSE),IF(VLOOKUP(F219,Companies!$B$3:$M$1250,10,FALSE)<>\"\",VLOOKUP(F219,Companies!$B$3:$M$1250,10,FALSE),\"\")))))","v":""},{"$f":"IF(VLOOKUP(F219,Companies!$B$3:$M$1250,3,FALSE)<>\"\",VLOOKUP(F219,Companies!$B$3:$M$1250,3,FALSE),IF(VLOOKUP(F219,Companies!$B$3:$M$1250,5,FALSE)<>\"\",VLOOKUP(F219,Companies!$B$3:$M$1250,5,FALSE),IF(VLOOKUP(F219,Companies!$B$3:$M$1250,7,FALSE)<>\"\",VLOOKUP(F219,Companies!$B$3:$M$1250,7,FALSE),IF(VLOOKUP(F219,Companies!$B$3:$M$1250,9,FALSE)<>\"\",VLOOKUP(F219,Companies!$B$3:$M$1250,9,FALSE),IF(VLOOKUP(F219,Companies!$B$3:$M$1250,11,FALSE)<>\"\",VLOOKUP(F219,Companies!$B$3:$M$1250,11,FALSE),\"\")))))","v":""},{"$f":"IF(VLOOKUP(F219,Companies!$B$3:$M$1250,12,FALSE)<>\"\",VLOOKUP(F219,Companies!$B$3:$M$1250,12,FALSE),\"\")","v":""}]
[{"$nulls":3},"VSFR","411VALEOCOMPRESSOR","VALEO COMPRESSOR EUROPE SRO","2019-05-31","2019-06-30","Invoice",{"$f":"\"19050009\"","v":"19050009"},{"v":1172.86,"d":"1,172.86 €"},{"$f":"IF(VLOOKUP(F220,Companies!$B$3:$M$1250,2,FALSE)<>\"\",VLOOKUP(F220,Companies!$B$3:$M$1250,2,FALSE),IF(VLOOKUP(F220,Companies!$B$3:$M$1250,4,FALSE)<>\"\",VLOOKUP(F220,Companies!$B$3:$M$1250,4,FALSE),IF(VLOOKUP(F220,Companies!$B$3:$M$1250,6,FALSE)<>\"\",VLOOKUP(F220,Companies!$B$3:$M$1250,6,FALSE),IF(VLOOKUP(F220,Companies!$B$3:$M$1250,8,FALSE)<>\"\",VLOOKUP(F220,Companies!$B$3:$M$1250,8,FALSE),IF(VLOOKUP(F220,Companies!$B$3:$M$1250,10,FALSE)<>\"\",VLOOKUP(F220,Companies!$B$3:$M$1250,10,FALSE),\"\")))))","v":""},{"$f":"IF(VLOOKUP(F220,Companies!$B$3:$M$1250,3,FALSE)<>\"\",VLOOKUP(F220,Companies!$B$3:$M$1250,3,FALSE),IF(VLOOKUP(F220,Companies!$B$3:$M$1250,5,FALSE)<>\"\",VLOOKUP(F220,Companies!$B$3:$M$1250,5,FALSE),IF(VLOOKUP(F220,Companies!$B$3:$M$1250,7,FALSE)<>\"\",VLOOKUP(F220,Companies!$B$3:$M$1250,7,FALSE),IF(VLOOKUP(F220,Companies!$B$3:$M$1250,9,FALSE)<>\"\",VLOOKUP(F220,Companies!$B$3:$M$1250,9,FALSE),IF(VLOOKUP(F220,Companies!$B$3:$M$1250,11,FALSE)<>\"\",VLOOKUP(F220,Companies!$B$3:$M$1250,11,FALSE),\"\")))))","v":""},{"$f":"IF(VLOOKUP(F220,Companies!$B$3:$M$1250,12,FALSE)<>\"\",VLOOKUP(F220,Companies!$B$3:$M$1250,12,FALSE),\"\")","v":""}]
[{"$nulls":3},"VSFR","411VALEOELECT&ELCTSY","VALEO ELECTRIC AND ELECTRONIC SYSTEMS SP. Z O.O.","2019-04-30","2019-05-30","Invoice","19.04.0234",{"v":6049.35,"d":"6,049.35 €"},{"$f":"IF(VLOOKUP(F221,Companies!$B$3:$M$1250,2,FALSE)<>\"\",VLOOKUP(F221,Companies!$B$3:$M$1250,2,FALSE),IF(VLOOKUP(F221,Companies!$B$3:$M$1250,4,FALSE)<>\"\",VLOOKUP(F221,Companies!$B$3:$M$1250,4,FALSE),IF(VLOOKUP(F221,Companies!$B$3:$M$1250,6,FALSE)<>\"\",VLOOKUP(F221,Companies!$B$3:$M$1250,6,FALSE),IF(VLOOKUP(F221,Companies!$B$3:$M$1250,8,FALSE)<>\"\",VLOOKUP(F221,Companies!$B$3:$M$1250,8,FALSE),IF(VLOOKUP(F221,Companies!$B$3:$M$1250,10,FALSE)<>\"\",VLOOKUP(F221,Companies!$B$3:$M$1250,10,FALSE),\"\")))))","v":""},{"$f":"IF(VLOOKUP(F221,Companies!$B$3:$M$1250,3,FALSE)<>\"\",VLOOKUP(F221,Companies!$B$3:$M$1250,3,FALSE),IF(VLOOKUP(F221,Companies!$B$3:$M$1250,5,FALSE)<>\"\",VLOOKUP(F221,Companies!$B$3:$M$1250,5,FALSE),IF(VLOOKUP(F221,Companies!$B$3:$M$1250,7,FALSE)<>\"\",VLOOKUP(F221,Companies!$B$3:$M$1250,7,FALSE),IF(VLOOKUP(F221,Companies!$B$3:$M$1250,9,FALSE)<>\"\",VLOOKUP(F221,Companies!$B$3:$M$1250,9,FALSE),IF(VLOOKUP(F221,Companies!$B$3:$M$1250,11,FALSE)<>\"\",VLOOKUP(F221,Companies!$B$3:$M$1250,11,FALSE),\"\")))))","v":""},{"$f":"IF(VLOOKUP(F221,Companies!$B$3:$M$1250,12,FALSE)<>\"\",VLOOKUP(F221,Companies!$B$3:$M$1250,12,FALSE),\"\")","v":""}]
[{"$nulls":3},"VSFR","411VALEOELECT&ELCTSY","VALEO ELECTRIC AND ELECTRONIC SYSTEMS SP. Z O.O.","2019-05-31","2019-06-30","Invoice","FA19050184",{"v":5884.35,"d":"5,884.35 €"},{"$f":"IF(VLOOKUP(F222,Companies!$B$3:$M$1250,2,FALSE)<>\"\",VLOOKUP(F222,Companies!$B$3:$M$1250,2,FALSE),IF(VLOOKUP(F222,Companies!$B$3:$M$1250,4,FALSE)<>\"\",VLOOKUP(F222,Companies!$B$3:$M$1250,4,FALSE),IF(VLOOKUP(F222,Companies!$B$3:$M$1250,6,FALSE)<>\"\",VLOOKUP(F222,Companies!$B$3:$M$1250,6,FALSE),IF(VLOOKUP(F222,Companies!$B$3:$M$1250,8,FALSE)<>\"\",VLOOKUP(F222,Companies!$B$3:$M$1250,8,FALSE),IF(VLOOKUP(F222,Companies!$B$3:$M$1250,10,FALSE)<>\"\",VLOOKUP(F222,Companies!$B$3:$M$1250,10,FALSE),\"\")))))","v":""},{"$f":"IF(VLOOKUP(F222,Companies!$B$3:$M$1250,3,FALSE)<>\"\",VLOOKUP(F222,Companies!$B$3:$M$1250,3,FALSE),IF(VLOOKUP(F222,Companies!$B$3:$M$1250,5,FALSE)<>\"\",VLOOKUP(F222,Companies!$B$3:$M$1250,5,FALSE),IF(VLOOKUP(F222,Companies!$B$3:$M$1250,7,FALSE)<>\"\",VLOOKUP(F222,Companies!$B$3:$M$1250,7,FALSE),IF(VLOOKUP(F222,Companies!$B$3:$M$1250,9,FALSE)<>\"\",VLOOKUP(F222,Companies!$B$3:$M$1250,9,FALSE),IF(VLOOKUP(F222,Companies!$B$3:$M$1250,11,FALSE)<>\"\",VLOOKUP(F222,Companies!$B$3:$M$1250,11,FALSE),\"\")))))","v":""},{"$f":"IF(VLOOKUP(F222,Companies!$B$3:$M$1250,12,FALSE)<>\"\",VLOOKUP(F222,Companies!$B$3:$M$1250,12,FALSE),\"\")","v":""}]
[{"$nulls":3},"VSFR","411VALEOELECT&ELCTSY","VALEO ELECTRIC AND ELECTRONIC SYSTEMS SP. Z O.O.","2019-05-31","2019-06-30","Invoice","FA19050185",{"v":4834.66,"d":"4,834.66 €"},{"$f":"IF(VLOOKUP(F223,Companies!$B$3:$M$1250,2,FALSE)<>\"\",VLOOKUP(F223,Companies!$B$3:$M$1250,2,FALSE),IF(VLOOKUP(F223,Companies!$B$3:$M$1250,4,FALSE)<>\"\",VLOOKUP(F223,Companies!$B$3:$M$1250,4,FALSE),IF(VLOOKUP(F223,Companies!$B$3:$M$1250,6,FALSE)<>\"\",VLOOKUP(F223,Companies!$B$3:$M$1250,6,FALSE),IF(VLOOKUP(F223,Companies!$B$3:$M$1250,8,FALSE)<>\"\",VLOOKUP(F223,Companies!$B$3:$M$1250,8,FALSE),IF(VLOOKUP(F223,Companies!$B$3:$M$1250,10,FALSE)<>\"\",VLOOKUP(F223,Companies!$B$3:$M$1250,10,FALSE),\"\")))))","v":""},{"$f":"IF(VLOOKUP(F223,Companies!$B$3:$M$1250,3,FALSE)<>\"\",VLOOKUP(F223,Companies!$B$3:$M$1250,3,FALSE),IF(VLOOKUP(F223,Companies!$B$3:$M$1250,5,FALSE)<>\"\",VLOOKUP(F223,Companies!$B$3:$M$1250,5,FALSE),IF(VLOOKUP(F223,Companies!$B$3:$M$1250,7,FALSE)<>\"\",VLOOKUP(F223,Companies!$B$3:$M$1250,7,FALSE),IF(VLOOKUP(F223,Companies!$B$3:$M$1250,9,FALSE)<>\"\",VLOOKUP(F223,Companies!$B$3:$M$1250,9,FALSE),IF(VLOOKUP(F223,Companies!$B$3:$M$1250,11,FALSE)<>\"\",VLOOKUP(F223,Companies!$B$3:$M$1250,11,FALSE),\"\")))))","v":""},{"$f":"IF(VLOOKUP(F223,Companies!$B$3:$M$1250,12,FALSE)<>\"\",VLOOKUP(F223,Companies!$B$3:$M$1250,12,FALSE),\"\")","v":""}]
[{"$nulls":3},"VSFR","411VALEOSYSTEMESDESS","VALEO SYSTEMES D ESSUYAGE","2019-05-31","2019-06-30","Invoice","FA19050067",{"v":360,"d":"360.00 €"},{"$f":"IF(VLOOKUP(F224,Companies!$B$3:$M$1250,2,FALSE)<>\"\",VLOOKUP(F224,Companies!$B$3:$M$1250,2,FALSE),IF(VLOOKUP(F224,Companies!$B$3:$M$1250,4,FALSE)<>\"\",VLOOKUP(F224,Companies!$B$3:$M$1250,4,FALSE),IF(VLOOKUP(F224,Companies!$B$3:$M$1250,6,FALSE)<>\"\",VLOOKUP(F224,Companies!$B$3:$M$1250,6,FALSE),IF(VLOOKUP(F224,Companies!$B$3:$M$1250,8,FALSE)<>\"\",VLOOKUP(F224,Companies!$B$3:$M$1250,8,FALSE),IF(VLOOKUP(F224,Companies!$B$3:$M$1250,10,FALSE)<>\"\",VLOOKUP(F224,Companies!$B$3:$M$1250,10,FALSE),\"\")))))","v":""},{"$f":"IF(VLOOKUP(F224,Companies!$B$3:$M$1250,3,FALSE)<>\"\",VLOOKUP(F224,Companies!$B$3:$M$1250,3,FALSE),IF(VLOOKUP(F224,Companies!$B$3:$M$1250,5,FALSE)<>\"\",VLOOKUP(F224,Companies!$B$3:$M$1250,5,FALSE),IF(VLOOKUP(F224,Companies!$B$3:$M$1250,7,FALSE)<>\"\",VLOOKUP(F224,Companies!$B$3:$M$1250,7,FALSE),IF(VLOOKUP(F224,Companies!$B$3:$M$1250,9,FALSE)<>\"\",VLOOKUP(F224,Companies!$B$3:$M$1250,9,FALSE),IF(VLOOKUP(F224,Companies!$B$3:$M$1250,11,FALSE)<>\"\",VLOOKUP(F224,Companies!$B$3:$M$1250,11,FALSE),\"\")))))","v":""},{"$f":"IF(VLOOKUP(F224,Companies!$B$3:$M$1250,12,FALSE)<>\"\",VLOOKUP(F224,Companies!$B$3:$M$1250,12,FALSE),\"\")","v":""}]
[{"$nulls":3},"VSFR","411VALEOSYSTEMEDECON","VALEO SYSTEMES DE CONTRÔLE","2019-04-30","2019-05-30","Invoice","19.04.0159",{"v":1765.99,"d":"1,765.99 €"},{"$f":"IF(VLOOKUP(F225,Companies!$B$3:$M$1250,2,FALSE)<>\"\",VLOOKUP(F225,Companies!$B$3:$M$1250,2,FALSE),IF(VLOOKUP(F225,Companies!$B$3:$M$1250,4,FALSE)<>\"\",VLOOKUP(F225,Companies!$B$3:$M$1250,4,FALSE),IF(VLOOKUP(F225,Companies!$B$3:$M$1250,6,FALSE)<>\"\",VLOOKUP(F225,Companies!$B$3:$M$1250,6,FALSE),IF(VLOOKUP(F225,Companies!$B$3:$M$1250,8,FALSE)<>\"\",VLOOKUP(F225,Companies!$B$3:$M$1250,8,FALSE),IF(VLOOKUP(F225,Companies!$B$3:$M$1250,10,FALSE)<>\"\",VLOOKUP(F225,Companies!$B$3:$M$1250,10,FALSE),\"\")))))","v":""},{"$f":"IF(VLOOKUP(F225,Companies!$B$3:$M$1250,3,FALSE)<>\"\",VLOOKUP(F225,Companies!$B$3:$M$1250,3,FALSE),IF(VLOOKUP(F225,Companies!$B$3:$M$1250,5,FALSE)<>\"\",VLOOKUP(F225,Companies!$B$3:$M$1250,5,FALSE),IF(VLOOKUP(F225,Companies!$B$3:$M$1250,7,FALSE)<>\"\",VLOOKUP(F225,Companies!$B$3:$M$1250,7,FALSE),IF(VLOOKUP(F225,Companies!$B$3:$M$1250,9,FALSE)<>\"\",VLOOKUP(F225,Companies!$B$3:$M$1250,9,FALSE),IF(VLOOKUP(F225,Companies!$B$3:$M$1250,11,FALSE)<>\"\",VLOOKUP(F225,Companies!$B$3:$M$1250,11,FALSE),\"\")))))","v":""},{"$f":"IF(VLOOKUP(F225,Companies!$B$3:$M$1250,12,FALSE)<>\"\",VLOOKUP(F225,Companies!$B$3:$M$1250,12,FALSE),\"\")","v":""}]
[{"$nulls":3},"VSFR","411VALEOSYSTEMEDECON","VALEO SYSTEMES DE CONTRÔLE","2019-05-31","2019-06-30","Invoice","FA19050079",{"v":1044,"d":"1,044.00 €"},{"$f":"IF(VLOOKUP(F226,Companies!$B$3:$M$1250,2,FALSE)<>\"\",VLOOKUP(F226,Companies!$B$3:$M$1250,2,FALSE),IF(VLOOKUP(F226,Companies!$B$3:$M$1250,4,FALSE)<>\"\",VLOOKUP(F226,Companies!$B$3:$M$1250,4,FALSE),IF(VLOOKUP(F226,Companies!$B$3:$M$1250,6,FALSE)<>\"\",VLOOKUP(F226,Companies!$B$3:$M$1250,6,FALSE),IF(VLOOKUP(F226,Companies!$B$3:$M$1250,8,FALSE)<>\"\",VLOOKUP(F226,Companies!$B$3:$M$1250,8,FALSE),IF(VLOOKUP(F226,Companies!$B$3:$M$1250,10,FALSE)<>\"\",VLOOKUP(F226,Companies!$B$3:$M$1250,10,FALSE),\"\")))))","v":""},{"$f":"IF(VLOOKUP(F226,Companies!$B$3:$M$1250,3,FALSE)<>\"\",VLOOKUP(F226,Companies!$B$3:$M$1250,3,FALSE),IF(VLOOKUP(F226,Companies!$B$3:$M$1250,5,FALSE)<>\"\",VLOOKUP(F226,Companies!$B$3:$M$1250,5,FALSE),IF(VLOOKUP(F226,Companies!$B$3:$M$1250,7,FALSE)<>\"\",VLOOKUP(F226,Companies!$B$3:$M$1250,7,FALSE),IF(VLOOKUP(F226,Companies!$B$3:$M$1250,9,FALSE)<>\"\",VLOOKUP(F226,Companies!$B$3:$M$1250,9,FALSE),IF(VLOOKUP(F226,Companies!$B$3:$M$1250,11,FALSE)<>\"\",VLOOKUP(F226,Companies!$B$3:$M$1250,11,FALSE),\"\")))))","v":""},{"$f":"IF(VLOOKUP(F226,Companies!$B$3:$M$1250,12,FALSE)<>\"\",VLOOKUP(F226,Companies!$B$3:$M$1250,12,FALSE),\"\")","v":""}]
[{"$nulls":3},"VSFR","411VALEOSYSTEMESTHER","Valeo Systèmes Thermiques SAS","2019-05-31","2019-06-30","Invoice","FA19050075",{"v":1477.99,"d":"1,477.99 €"},{"$f":"IF(VLOOKUP(F227,Companies!$B$3:$M$1250,2,FALSE)<>\"\",VLOOKUP(F227,Companies!$B$3:$M$1250,2,FALSE),IF(VLOOKUP(F227,Companies!$B$3:$M$1250,4,FALSE)<>\"\",VLOOKUP(F227,Companies!$B$3:$M$1250,4,FALSE),IF(VLOOKUP(F227,Companies!$B$3:$M$1250,6,FALSE)<>\"\",VLOOKUP(F227,Companies!$B$3:$M$1250,6,FALSE),IF(VLOOKUP(F227,Companies!$B$3:$M$1250,8,FALSE)<>\"\",VLOOKUP(F227,Companies!$B$3:$M$1250,8,FALSE),IF(VLOOKUP(F227,Companies!$B$3:$M$1250,10,FALSE)<>\"\",VLOOKUP(F227,Companies!$B$3:$M$1250,10,FALSE),\"\")))))","v":""},{"$f":"IF(VLOOKUP(F227,Companies!$B$3:$M$1250,3,FALSE)<>\"\",VLOOKUP(F227,Companies!$B$3:$M$1250,3,FALSE),IF(VLOOKUP(F227,Companies!$B$3:$M$1250,5,FALSE)<>\"\",VLOOKUP(F227,Companies!$B$3:$M$1250,5,FALSE),IF(VLOOKUP(F227,Companies!$B$3:$M$1250,7,FALSE)<>\"\",VLOOKUP(F227,Companies!$B$3:$M$1250,7,FALSE),IF(VLOOKUP(F227,Companies!$B$3:$M$1250,9,FALSE)<>\"\",VLOOKUP(F227,Companies!$B$3:$M$1250,9,FALSE),IF(VLOOKUP(F227,Companies!$B$3:$M$1250,11,FALSE)<>\"\",VLOOKUP(F227,Companies!$B$3:$M$1250,11,FALSE),\"\")))))","v":""},{"$f":"IF(VLOOKUP(F227,Companies!$B$3:$M$1250,12,FALSE)<>\"\",VLOOKUP(F227,Companies!$B$3:$M$1250,12,FALSE),\"\")","v":""}]
[{"$nulls":3},"VSFR","411VALEOVISIONSA","VALEO VISION SAS","2019-05-31","2019-06-30","Invoice","FA19050065",{"v":2142.8,"d":"2,142.80 €"},{"$f":"IF(VLOOKUP(F228,Companies!$B$3:$M$1250,2,FALSE)<>\"\",VLOOKUP(F228,Companies!$B$3:$M$1250,2,FALSE),IF(VLOOKUP(F228,Companies!$B$3:$M$1250,4,FALSE)<>\"\",VLOOKUP(F228,Companies!$B$3:$M$1250,4,FALSE),IF(VLOOKUP(F228,Companies!$B$3:$M$1250,6,FALSE)<>\"\",VLOOKUP(F228,Companies!$B$3:$M$1250,6,FALSE),IF(VLOOKUP(F228,Companies!$B$3:$M$1250,8,FALSE)<>\"\",VLOOKUP(F228,Companies!$B$3:$M$1250,8,FALSE),IF(VLOOKUP(F228,Companies!$B$3:$M$1250,10,FALSE)<>\"\",VLOOKUP(F228,Companies!$B$3:$M$1250,10,FALSE),\"\")))))","v":""},{"$f":"IF(VLOOKUP(F228,Companies!$B$3:$M$1250,3,FALSE)<>\"\",VLOOKUP(F228,Companies!$B$3:$M$1250,3,FALSE),IF(VLOOKUP(F228,Companies!$B$3:$M$1250,5,FALSE)<>\"\",VLOOKUP(F228,Companies!$B$3:$M$1250,5,FALSE),IF(VLOOKUP(F228,Companies!$B$3:$M$1250,7,FALSE)<>\"\",VLOOKUP(F228,Companies!$B$3:$M$1250,7,FALSE),IF(VLOOKUP(F228,Companies!$B$3:$M$1250,9,FALSE)<>\"\",VLOOKUP(F228,Companies!$B$3:$M$1250,9,FALSE),IF(VLOOKUP(F228,Companies!$B$3:$M$1250,11,FALSE)<>\"\",VLOOKUP(F228,Companies!$B$3:$M$1250,11,FALSE),\"\")))))","v":"candy.kobli@gmail.com"},{"$f":"IF(VLOOKUP(F228,Companies!$B$3:$M$1250,12,FALSE)<>\"\",VLOOKUP(F228,Companies!$B$3:$M$1250,12,FALSE),\"\")","v":""}]
[{"$nulls":3},"VSUK","411VEITSCHRADEXVERTR","VEITSCH RADEX VERTRIEBS GMBH","2019-05-31","2019-06-30","Invoice","IN05190006",{"v":853.33,"d":"853.33 €"},{"$f":"IF(VLOOKUP(F229,Companies!$B$3:$M$1250,2,FALSE)<>\"\",VLOOKUP(F229,Companies!$B$3:$M$1250,2,FALSE),IF(VLOOKUP(F229,Companies!$B$3:$M$1250,4,FALSE)<>\"\",VLOOKUP(F229,Companies!$B$3:$M$1250,4,FALSE),IF(VLOOKUP(F229,Companies!$B$3:$M$1250,6,FALSE)<>\"\",VLOOKUP(F229,Companies!$B$3:$M$1250,6,FALSE),IF(VLOOKUP(F229,Companies!$B$3:$M$1250,8,FALSE)<>\"\",VLOOKUP(F229,Companies!$B$3:$M$1250,8,FALSE),IF(VLOOKUP(F229,Companies!$B$3:$M$1250,10,FALSE)<>\"\",VLOOKUP(F229,Companies!$B$3:$M$1250,10,FALSE),\"\")))))","v":""},{"$f":"IF(VLOOKUP(F229,Companies!$B$3:$M$1250,3,FALSE)<>\"\",VLOOKUP(F229,Companies!$B$3:$M$1250,3,FALSE),IF(VLOOKUP(F229,Companies!$B$3:$M$1250,5,FALSE)<>\"\",VLOOKUP(F229,Companies!$B$3:$M$1250,5,FALSE),IF(VLOOKUP(F229,Companies!$B$3:$M$1250,7,FALSE)<>\"\",VLOOKUP(F229,Companies!$B$3:$M$1250,7,FALSE),IF(VLOOKUP(F229,Companies!$B$3:$M$1250,9,FALSE)<>\"\",VLOOKUP(F229,Companies!$B$3:$M$1250,9,FALSE),IF(VLOOKUP(F229,Companies!$B$3:$M$1250,11,FALSE)<>\"\",VLOOKUP(F229,Companies!$B$3:$M$1250,11,FALSE),\"\")))))","v":""},{"$f":"IF(VLOOKUP(F229,Companies!$B$3:$M$1250,12,FALSE)<>\"\",VLOOKUP(F229,Companies!$B$3:$M$1250,12,FALSE),\"\")","v":""}]
[{"$nulls":9},"TOTAL",{"$f":"SUBTOTAL(9,K2:K229)","v":{"v":541376.85,"d":"541,376.85 €"}}]
[]
[]
[]
[{"$nulls":9},"Subtotal",{"$f":"SUBTOTAL(9,K2:K229)","v":{"v":541376.85,"d":"541,376.85 €"}}]
[{"$nulls":9},"Total",{"$f":"SUM(K2:K229)","v":{"v":541376.85,"d":"541,376.85 €"}}]
[]
[]
[]
[{"$nulls":9},"VSPT",{"$f":"SUMIF(D2:D229,\"VSPT\",K2:K229)","v":{"v":33515.11,"d":"33,515.11 €"}}]
[{"$nulls":9},"VSUK",{"$f":"SUMIF(D2:D229,\"VSUK\",K2:K229)","v":{"v":75539.92,"d":"75,539.92 €"}}]
[{"$nulls":9},"VSFR",{"$f":"SUMIF(D2:D229,\"VSFR\",K2:K229)","v":{"v":432321.81999999995,"d":"432,321.82 €"}}]

{"sheet":"Access","index":2,"n_rows":3,"n_cols":11,"rows_kept":3}
["Company concerned","Document Date","Due \nDate","Document Type","Document No.","Remaining Amount",null,"Contact Name","Email Address","Consultant","Invoices N°"]
["Access","2018-09-30","2018-11-14","Invoice","18.09.0065",{"v":309.59,"d":"309.59 €"},null,"kobli","jkjregihgtrnnbtr","papap","18.09.0065"]
[{"$nulls":4},"TOTAL",{"v":309.59,"d":"309.59 €"}]