{"text_format":"3","workbook":"xlsx","n_sheets":3,"sheets":["Companies","Unpaid_details","Access"],"not_rendered":{"macros":1,"defined_names":2},"read":"whole","date_system":"1900"}

{"sheet":"Companies","index":0,"n_rows":1218,"n_cols":13,"rows_kept":1218,"merged":[[0,0,1,0],[0,1,1,1],[0,2,0,12],[1,2,1,3],[1,4,1,5],[1,6,1,7],[1,8,1,9],[1,10,1,11]]}
["Cstmr No.","COSTUMERS","CONTACTS (Family Name and email)"]
[null,null,"Unpaid contact",null,"Invoicing contact 1",null,"Invoicing contact 2",null,"Accounting",null,"Other",null,"CONSULTANTS"]
[108,"Batm Advanced Communications Ltd",{"$nulls":9},"sigalit@batm.co.il","mamamamama"]
[2089,"EMERSON PROCESS MANAGEMENT bv",{"$nulls":9},"leo.zwinkels@emerson.com"]
[2155,"AR Metallizing NV",{"$nulls":7},"e.eerdekens@armetallizing.com"]
[2317,"Amcor Flexibles France SAS",{"$nulls":3},"stephanie.toussaint@amcor.com"]
[2364,"GMR MARKETING GMBH",{"$nulls":9},"yostermann@gmrmarketing.com"]
[2390,"FLUOR ENGINEERING N.V.",{"$nulls":3},"arno.van.slooten@fluor.com"]
[2404,"SCA Hygiene Slovakia sro (old Georgia-Pacific_Slovakia_sr.o)",{"$nulls":7},"freddy.jordens@sca.com"]
[2481,"TEERAG ASDAG",{"$nulls":3},"gerlinde.kloettler@porr.at"]
[4004,"MOTA-ENGIL SGPS S.A.",{"$nulls":3},"jose.a.pinto@mota-engil.pt ",null,"luis.miguel.sousa@mota-engil.pt"]
[8174,"MAGNA Powertrain GmbH & Co KG",{"$nulls":3},"bianca.macher@magna.com",null,"martina.vanik@magna.com"]
[8175,"MAGNA STEYR FAHRZEUGTECHNIK AG & CO KG",{"$nulls":3},"manfred.zatsch@magna.com",null,"hermine.kindermann@magna.com"]
[8530,"Mota-Engil, Engenharia e Construção, S.A.",{"$nulls":3},"jose.a.pinto@mota-engil.pt ",null,"luis.miguel.sousa@mota-engil.pt"]
[8854,"PACIFIC TEST COMPANY 1",{"$nulls":7},"josemiguelrst@gmail.com"]
[8876,"Thomas Cook Services Center",{"$nulls":7},"johan.bohyn@thomascook.be"]
[9546,"BEUMER Group A/S",{"$nulls":3},"kirsten.munk-stengaard@beumergroup.com"]
[10598,"Icopal Danmark A/S"]
[11408,"ERNST & YOUNG TAX CONSULTANTS",{"$nulls":3},"houssame.achouri@be.ey.com"]
[11705,"ALGECO GMBH",{"$nulls":7},"stefanie.mayerl@algeco.de"]
{"$rows_left_out":1199}
{"sheet":"Unpaid_details","index":1,"n_rows":241,"n_cols":14,"rows_kept":241}
[{"$nulls":3},"Company","Client No.","Company concerned","Document Date","Due \nDate","Document Type","Document No.","Remaining Amount","Contact name","Email address to send","Consultant"]
[{"$nulls":3},"VSUK","411AALBORGPORTLANDBE","Aalborg Portland Belgium","2019-05-31","2019-06-30","Invoice","IN05190008",{"v":571.67,"d":"571.67 €"},{"$f":"IF(VLOOKUP(F2,Companies!$B$3:$M$1250,2,FALSE)<>\"\",VLOOKUP(F2,Companies!$B$3:$M$1250,2,FALSE),IF(VLOOKUP(F2,Companies!$B$3:$M$1250,4,FALSE)<>\"\",VLOOKUP(F2,Companies!$B$3:$M$1250,4,FALSE),IF(VLOOKUP(F2,Companies!$B$3:$M$1250,6,FALSE)<>\"\",VLOOKUP(F2,Companies!$B$3:$M$1250,6,FALSE),IF(VLOOKUP(F2,Companies!$B$3:$M$1250,8,FALSE)<>\"\",VLOOKUP(F2,Companies!$B$3:$M$1250,8,FALSE),IF(VLOOKUP(F2,Companies!$B$3:$M$1250,10,FALSE)<>\"\",VLOOKUP(F2,Companies!$B$3:$M$1250,10,FALSE),\"\")))))","v":""},{"$f":"IF(VLOOKUP(F2,Companies!$B$3:$M$1250,3,FALSE)<>\"\",VLOOKUP(F2,Companies!$B$3:$M$1250,3,FALSE),IF(VLOOKUP(F2,Companies!$B$3:$M$1250,5,FALSE)<>\"\",VLOOKUP(F2,Companies!$B$3:$M$1250,5,FALSE),IF(VLOOKUP(F2,Companies!$B$3:$M$1250,7,FALSE)<>\"\",VLOOKUP(F2,Companies!$B$3:$M$1250,7,FALSE),IF(VLOOKUP(F2,Companies!$B$3:$M$1250,9,FALSE)<>\"\",VLOOKUP(F2,Companies!$B$3:$M$1250,9,FALSE),IF(VLOOKUP(F2,Companies!$B$3:$M$1250,11,FALSE)<>\"\",VLOOKUP(F2,Companies!$B$3:$M$1250,11,FALSE),\"\")))))","v":"papapapapapapa"},"candy"]
[{"$nulls":3},"VSFR","411ACCESS","Access","2018-09-30","2018-11-14","Invoice","18.09.0065",{"v":309.59,"d":"309.59 €"},"kobli",{"$f":"IF(VLOOKUP(F3,Companies!$B$3:$M$1250,3,FALSE)<>\"\",VLOOKUP(F3,Companies!$B$3:$M$1250,3,FALSE),IF(VLOOKUP(F3,Companies!$B$3:$M$1250,5,FALSE)<>\"\",VLOOKUP(F3,Companies!$B$3:$M$1250,5,FALSE),IF(VLOOKUP(F3,Companies!$B$3:$M$1250,7,FALSE)<>\"\",VLOOKUP(F3,Companies!$B$3:$M$1250,7,FALSE),IF(VLOOKUP(F3,Companies!$B$3:$M$1250,9,FALSE)<>\"\",VLOOKUP(F3,Companies!$B$3:$M$1250,9,FALSE),IF(VLOOKUP(F3,Companies!$B$3:$M$1250,11,FALSE)<>\"\",VLOOKUP(F3,Companies!$B$3:$M$1250,11,FALSE),\"\")))))","v":"jkjregihgtrnnbtr"},"papap"]
[{"$nulls":3},"VSFR","411ALTERCOSMETODIFUS","ALTERCOSMETO DIFFUSION","2019-05-31","2019-06-30","Invoice","FA19050100",{"v":420,"d":"420.00 €"},{"$f":"IF(VLOOKUP(F4,Companies!$B$3:$M$1250,2,FALSE)<>\"\",VLOOKUP(F4,Companies!$B$3:$M$1250,2,FALSE),IF(VLOOKUP(F4,Companies!$B$3:$M$1250,4,FALSE)<>\"\",VLOOKUP(F4,Companies!$B$3:$M$1250,4,FALSE),IF(VLOOKUP(F4,Companies!$B$3:$M$1250,6,FALSE)<>\"\",VLOOKUP(F4,Companies!$B$3:$M$1250,6,FALSE),IF(VLOOKUP(F4,Companies!$B$3:$M$1250,8,FALSE)<>\"\",VLOOKUP(F4,Companies!$B$3:$M$1250,8,FALSE),IF(VLOOKUP(F4,Companies!$B$3:$M$1250,10,FALSE)<>\"\",VLOOKUP(F4,Companies!$B$3:$M$1250,10,FALSE),\"\")))))","v":""},{"$f":"IF(VLOOKUP(F4,Companies!$B$3:$M$1250,3,FALSE)<>\"\",VLOOKUP(F4,Companies!$B$3:$M$1250,3,FALSE),IF(VLOOKUP(F4,Companies!$B$3:$M$1250,5,FALSE)<>\"\",VLOOKUP(F4,Companies!$B$3:$M$1250,5,FALSE),IF(VLOOKUP(F4,Companies!$B$3:$M$1250,7,FALSE)<>\"\",VLOOKUP(F4,Companies!$B$3:$M$1250,7,FALSE),IF(VLOOKUP(F4,Companies!$B$3:$M$1250,9,FALSE)<>\"\",VLOOKUP(F4,Companies!$B$3:$M$1250,9,FALSE),IF(VLOOKUP(F4,Companies!$B$3:$M$1250,11,FALSE)<>\"\",VLOOKUP(F4,Companies!$B$3:$M$1250,11,FALSE),\"\")))))","v":"vtbytnbhnhntfe"},{"$f":"IF(VLOOKUP(F4,Companies!$B$3:$M$1250,12,FALSE)<>\"\",VLOOKUP(F4,Companies!$B$3:$M$1250,12,FALSE),\"\")","v":""}]
[{"$nulls":3},"VSFR","411AMCOREUROPEANGROU","Amcor Europe Group Management","2019-04-23","2019-05-23","Invoice","19.04.0014",{"v":132.36,"d":"132.36 €"},{"$f":"IF(VLOOKUP(F5,Companies!$B$3:$M$1250,2,FALSE)<>\"\",VLOOKUP(F5,Companies!$B$3:$M$1250,2,FALSE),IF(VLOOKUP(F5,Companies!$B$3:$M$1250,4,FALSE)<>\"\",VLOOKUP(F5,Companies!$B$3:$M$1250,4,FALSE),IF(VLOOKUP(F5,Companies!$B$3:$M$1250,6,FALSE)<>\"\",VLOOKUP(F5,Companies!$B$3:$M$1250,6,FALSE),IF(VLOOKUP(F5,Companies!$B$3:$M$1250,8,FALSE)<>\"\",VLOOKUP(F5,Companies!$B$3:$M$1250,8,FALSE),IF(VLOOKUP(F5,Companies!$B$3:$M$1250,10,FALSE)<>\"\",VLOOKUP(F5,Companies!$B$3:$M$1250,10,FALSE),\"\")))))","v":""},{"$f":"IF(VLOOKUP(F5,Companies!$B$3:$M$1250,3,FALSE)<>\"\",VLOOKUP(F5,Companies!$B$3:$M$1250,3,FALSE),IF(VLOOKUP(F5,Companies!$B$3:$M$1250,5,FALSE)<>\"\",VLOOKUP(F5,Companies!$B$3:$M$1250,5,FALSE),IF(VLOOKUP(F5,Companies!$B$3:$M$1250,7,FALSE)<>\"\",VLOOKUP(F5,Companies!$B$3:$M$1250,7,FALSE),IF(VLOOKUP(F5,Companies!$B$3:$M$1250,9,FALSE)<>\"\",VLOOKUP(F5,Companies!$B$3:$M$1250,9,FALSE),IF(VLOOKUP(F5,Companies!$B$3:$M$1250,11,FALSE)<>\"\",VLOOKUP(F5,Companies!$B$3:$M$1250,11,FALSE),\"\")))))","v":""},{"$f":"IF(VLOOKUP(F5,Companies!$B$3:$M$1250,12,FALSE)<>\"\",VLOOKUP(F5,Companies!$B$3:$M$1250,12,FALSE),\"\")","v":""}]
[{"$nulls":3},"VSFR","411AMCOREUROPEANGROU","Amcor Europe Group Management","2019-04-30","2019-05-30","Invoice","19.04.0060",{"v":43.94,"d":"43.94 €"},{"$f":"IF(VLOOKUP(F6,Companies!$B$3:$M$1250,2,FALSE)<>\"\",VLOOKUP(F6,Companies!$B$3:$M$1250,2,FALSE),IF(VLOOKUP(F6,Companies!$B$3:$M$1250,4,FALSE)<>\"\",VLOOKUP(F6,Companies!$B$3:$M$1250,4,FALSE),IF(VLOOKUP(F6,Companies!$B$3:$M$1250,6,FALSE)<>\"\",VLOOKUP(F6,Companies!$B$3:$M$1250,6,FALSE),IF(VLOOKUP(F6,Companies!$B$3:$M$1250,8,FALSE)<>\"\",VLOOKUP(F6,Companies!$B$3:$M$1250,8,FALSE),IF(VLOOKUP(F6,Companies!$B$3:$M$1250,10,FALSE)<>\"\",VLOOKUP(F6,Companies!$B$3:$M$1250,10,FALSE),\"\")))))","v":""},{"$f":"IF(VLOOKUP(F6,Companies!$B$3:$M$1250,3,FALSE)<>\"\",VLOOKUP(F6,Companies!$B$3:$M$1250,3,FALSE),IF(VLOOKUP(F6,Companies!$B$3:$M$1250,5,FALSE)<>\"\",VLOOKUP(F6,Companies!$B$3:$M$1250,5,FALSE),IF(VLOOKUP(F6,Companies!$B$3:$M$1250,7,FALSE)<>\"\",VLOOKUP(F6,Companies!$B$3:$M$1250,7,FALSE),IF(VLOOKUP(F6,Companies!$B$3:$M$1250,9,FALSE)<>\"\",VLOOKUP(F6,Companies!$B$3:$M$1250,9,FALSE),IF(VLOOKUP(F6,Companies!$B$3:$M$1250,11,FALSE)<>\"\",VLOOKUP(F6,Companies!$B$3:$M$1250,11,FALSE),\"\")))))","v":""},{"$f":"IF(VLOOKUP(F6,Companies!$B$3:$M$1250,12,FALSE)<>\"\",VLOOKUP(F6,Companies!$B$3:$M$1250,12,FALSE),\"\")","v":""}]
[{"$nulls":3},"VSFR","411AMCOREUROPEANGROU","Amcor Europe Group Management","2019-05-31","2019-06-30","Invoice",{"$f":"\"19050017\"","v":"19050017"},{"v":300,"d":"300.00 €"},{"$f":"IF(VLOOKUP(F7,Companies!$B$3:$M$1250,2,FALSE)<>\"\",VLOOKUP(F7,Companies!$B$3:$M$1250,2,FALSE),IF(VLOOKUP(F7,Companies!$B$3:$M$1250,4,FALSE)<>\"\",VLOOKUP(F7,Companies!$B$3:$M$1250,4,FALSE),IF(VLOOKUP(F7,Companies!$B$3:$M$1250,6,FALSE)<>\"\",VLOOKUP(F7,Companies!$B$3:$M$1250,6,FALSE),IF(VLOOKUP(F7,Companies!$B$3:$M$1250,8,FALSE)<>\"\",VLOOKUP(F7,Companies!$B$3:$M$1250,8,FALSE),IF(VLOOKUP(F7,Companies!$B$3:$M$1250,10,FALSE)<>\"\",VLOOKUP(F7,Companies!$B$3:$M$1250,10,FALSE),\"\")))))","v":""},{"$f":"IF(VLOOKUP(F7,Companies!$B$3:$M$1250,3,FALSE)<>\"\",VLOOKUP(F7,Companies!$B$3:$M$1250,3,FALSE),IF(VLOOKUP(F7,Companies!$B$3:$M$1250,5,FALSE)<>\"\",VLOOKUP(F7,Companies!$B$3:$M$1250,5,FALSE),IF(VLOOKUP(F7,Companies!$B$3:$M$1250,7,FALSE)<>\"\",VLOOKUP(F7,Companies!$B$3:$M$1250,7,FALSE),IF(VLOOKUP(F7,Companies!$B$3:$M$1250,9,FALSE)<>\"\",VLOOKUP(F7,Companies!$B$3:$M$1250,9,FALSE),IF(VLOOKUP(F7,Companies!$B$3:$M$1250,11,FALSE)<>\"\",VLOOKUP(F7,Companies!$B$3:$M$1250,11,FALSE),\"\")))))","v":""},{"$f":"IF(VLOOKUP(F7,Companies!$B$3:$M$1250,12,FALSE)<>\"\",VLOOKUP(F7,Companies!$B$3:$M$1250,12,FALSE),\"\")","v":""}]
[{"$nulls":3},"VSPT","C000381071","Asociacion Latinoamericana de Administradores","2019-05-31","2019-06-30","Invoice","FA 2019/64",{"v":55,"d":"55.00 €"},{"$f":"IF(VLOOKUP(F8,Companies!$B$3:$M$1250,2,FALSE)<>\"\",VLOOKUP(F8,Companies!$B$3:$M$1250,2,FALSE),IF(VLOOKUP(F8,Companies!$B$3:$M$1250,4,FALSE)<>\"\",VLOOKUP(F8,Companies!$B$3:$M$1250,4,FALSE),IF(VLOOKUP(F8,Companies!$B$3:$M$1250,6,FALSE)<>\"\",VLOOKUP(F8,Companies!$B$3:$M$1250,6,FALSE),IF(VLOOKUP(F8,Companies!$B$3:$M$1250,8,FALSE)<>\"\",VLOOKUP(F8,Companies!$B$3:$M$1250,8,FALSE),IF(VLOOKUP(F8,Companies!$B$3:$M$1250,10,FALSE)<>\"\",VLOOKUP(F8,Companies!$B$3:$M$1250,10,FALSE),\"\")))))","v":""},{"$f":"IF(VLOOKUP(F8,Companies!$B$3:$M$1250,3,FALSE)<>\"\",VLOOKUP(F8,Companies!$B$3:$M$1250,3,FALSE),IF(VLOOKUP(F8,Companies!$B$3:$M$1250,5,FALSE)<>\"\",VLOOKUP(F8,Companies!$B$3:$M$1250,5,FALSE),IF(VLOOKUP(F8,Companies!$B$3:$M$1250,7,FALSE)<>\"\",VLOOKUP(F8,Companies!$B$3:$M$1250,7,FALSE),IF(VLOOKUP(F8,Companies!$B$3:$M$1250,9,FALSE)<>\"\",VLOOKUP(F8,Companies!$B$3:$M$1250,9,FALSE),IF(VLOOKUP(F8,Companies!$B$3:$M$1250,11,FALSE)<>\"\",VLOOKUP(F8,Companies!$B$3:$M$1250,11,FALSE),\"\")))))","v":""},{"$f":"IF(VLOOKUP(F8,Companies!$B$3:$M$1250,12,FALSE)<>\"\",VLOOKUP(F8,Companies!$B$3:$M$1250,12,FALSE),\"\")","v":""}]
[{"$nulls":3},"VSPT","C000381071","Asociacion Latinoamericana de Administradores","2018-12-31","2019-01-30","Invoice","FA 2018/127",{"v":522.01,"d":"522.01 €"},{"$f":"IF(VLOOKUP(F9,Companies!$B$3:$M$1250,2,FALSE)<>\"\",VLOOKUP(F9,Companies!$B$3:$M$1250,2,FALSE),IF(VLOOKUP(F9,Companies!$B$3:$M$1250,4,FALSE)<>\"\",VLOOKUP(F9,Companies!$B$3:$M$1250,4,FALSE),IF(VLOOKUP(F9,Companies!$B$3:$M$1250,6,FALSE)<>\"\",VLOOKUP(F9,Companies!$B$3:$M$1250,6,FALSE),IF(VLOOKUP(F9,Companies!$B$3:$M$1250,8,FALSE)<>\"\",VLOOKUP(F9,Companies!$B$3:$M$1250,8,FALSE),IF(VLOOKUP(F9,Companies!$B$3:$M$1250,10,FALSE)<>\"\",VLOOKUP(F9,Companies!$B$3:$M$1250,10,FALSE),\"\")))))","v":""},{"$f":"IF(VLOOKUP(F9,Companies!$B$3:$M$1250,3,FALSE)<>\"\",VLOOKUP(F9,Companies!$B$3:$M$1250,3,FALSE),IF(VLOOKUP(F9,Companies!$B$3:$M$1250,5,FALSE)<>\"\",VLOOKUP(F9,Companies!$B$3:$M$1250,5,FALSE),IF(VLOOKUP(F9,Companies!$B$3:$M$1250,7,FALSE)<>\"\",VLOOKUP(F9,Companies!$B$3:$M$1250,7,FALSE),IF(VLOOKUP(F9,Companies!$B$3:$M$1250,9,FALSE)<>\"\",VLOOKUP(F9,Companies!$B$3:$M$1250,9,FALSE),IF(VLOOKUP(F9,Companies!$B$3:$M$1250,11,FALSE)<>\"\",VLOOKUP(F9,Companies!$B$3:$M$1250,11,FALSE),\"\")))))","v":""},{"$f":"IF(VLOOKUP(F9,Companies!$B$3:$M$1250,12,FALSE)<>\"\",VLOOKUP(F9,Companies!$B$3:$M$1250,12,FALSE),\"\")","v":""}]
[{"$nulls":3},"VSPT","C000381071","Asociacion Latinoamericana de Administradores","2019-01-31","2019-03-02","Invoice","FA 2019/12",{"v":297.5,"d":"297.50 €"},{"$f":"IF(VLOOKUP(F10,Companies!$B$3:$M$1250,2,FALSE)<>\"\",VLOOKUP(F10,Companies!$B$3:$M$1250,2,FALSE),IF(VLOOKUP(F10,Companies!$B$3:$M$1250,4,FALSE)<>\"\",VLOOKUP(F10,Companies!$B$3:$M$1250,4,FALSE),IF(VLOOKUP(F10,Companies!$B$3:$M$1250,6,FALSE)<>\"\",VLOOKUP(F10,Companies!$B$3:$M$1250,6,FALSE),IF(VLOOKUP(F10,Companies!$B$3:$M$1250,8,FALSE)<>\"\",VLOOKUP(F10,Companies!$B$3:$M$1250,8,FALSE),IF(VLOOKUP(F10,Companies!$B$3:$M$1250,10,FALSE)<>\"\",VLOOKUP(F10,Companies!$B$3:$M$1250,10,FALSE),\"\")))))","v":""},{"$f":"IF(VLOOKUP(F10,Companies!$B$3:$M$1250,3,FALSE)<>\"\",VLOOKUP(F10,Companies!$B$3:$M$1250,3,FALSE),IF(VLOOKUP(F10,Companies!$B$3:$M$1250,5,FALSE)<>\"\",VLOOKUP(F10,Companies!$B$3:$M$1250,5,FALSE),IF(VLOOKUP(F10,Companies!$B$3:$M$1250,7,FALSE)<>\"\",VLOOKUP(F10,Companies!$B$3:$M$1250,7,FALSE),IF(VLOOKUP(F10,Companies!$B$3:$M$1250,9,FALSE)<>\"\",VLOOKUP(F10,Companies!$B$3:$M$1250,9,FALSE),IF(VLOOKUP(F10,Companies!$B$3:$M$1250,11,FALSE)<>\"\",VLOOKUP(F10,Companies!$B$3:$M$1250,11,FALSE),\"\")))))","v":""},{"$f":"IF(VLOOKUP(F10,Companies!$B$3:$M$1250,12,FALSE)<>\"\",VLOOKUP(F10,Companies!$B$3:$M$1250,12,FALSE),\"\")","v":""}]
[{"$nulls":3},"VSPT","C000381071","Asociacion Latinoamericana de Administradores","2019-03-29","2019-04-28","Invoice","FA 2019/32",{"v":54.83,"d":"54.83 €"},"Joachim","ferfregtrhtrhtr","rtytruytjy"]
[{"$nulls":3},"VSFR","411AUTONEUMBELGIUMNV","Autoneum Belgium NV","2018-10-31","2018-11-30","Invoice","18.10.0249",{"v":4349.34,"d":"4,349.34 €"},{"$f":"IF(VLOOKUP(F12,Companies!$B$3:$M$1250,2,FALSE)<>\"\",VLOOKUP(F12,Companies!$B$3:$M$1250,2,FALSE),IF(VLOOKUP(F12,Companies!$B$3:$M$1250,4,FALSE)<>\"\",VLOOKUP(F12,Companies!$B$3:$M$1250,4,FALSE),IF(VLOOKUP(F12,Companies!$B$3:$M$1250,6,FALSE)<>\"\",VLOOKUP(F12,Companies!$B$3:$M$1250,6,FALSE),IF(VLOOKUP(F12,Companies!$B$3:$M$1250,8,FALSE)<>\"\",VLOOKUP(F12,Companies!$B$3:$M$1250,8,FALSE),IF(VLOOKUP(F12,Companies!$B$3:$M$1250,10,FALSE)<>\"\",VLOOKUP(F12,Companies!$B$3:$M$1250,10,FALSE),\"\")))))","v":""},{"$f":"IF(VLOOKUP(F12,Companies!$B$3:$M$1250,3,FALSE)<>\"\",VLOOKUP(F12,Companies!$B$3:$M$1250,3,FALSE),IF(VLOOKUP(F12,Companies!$B$3:$M$1250,5,FALSE)<>\"\",VLOOKUP(F12,Companies!$B$3:$M$1250,5,FALSE),IF(VLOOKUP(F12,Companies!$B$3:$M$1250,7,FALSE)<>\"\",VLOOKUP(F12,Companies!$B$3:$M$1250,7,FALSE),IF(VLOOKUP(F12,Companies!$B$3:$M$1250,9,FALSE)<>\"\",VLOOKUP(F12,Companies!$B$3:$M$1250,9,FALSE),IF(VLOOKUP(F12,Companies!$B$3:$M$1250,11,FALSE)<>\"\",VLOOKUP(F12,Companies!$B$3:$M$1250,11,FALSE),\"\")))))","v":""},{"$f":"IF(VLOOKUP(F12,Companies!$B$3:$M$1250,12,FALSE)<>\"\",VLOOKUP(F12,Companies!$B$3:$M$1250,12,FALSE),\"\")","v":""}]
[{"$nulls":3},"VSFR","411AUTONEUMBELGIUMNV","Autoneum Belgium NV","2018-11-30","2018-12-30","Invoice","18.11.0243",{"v":1866.67,"d":"1,866.67 €"},{"$f":"IF(VLOOKUP(F13,Companies!$B$3:$M$1250,2,FALSE)<>\"\",VLOOKUP(F13,Companies!$B$3:$M$1250,2,FALSE),IF(VLOOKUP(F13,Companies!$B$3:$M$1250,4,FALSE)<>\"\",VLOOKUP(F13,Companies!$B$3:$M$1250,4,FALSE),IF(VLOOKUP(F13,Companies!$B$3:$M$1250,6,FALSE)<>\"\",VLOOKUP(F13,Companies!$B$3:$M$1250,6,FALSE),IF(VLOOKUP(F13,Companies!$B$3:$M$1250,8,FALSE)<>\"\",VLOOKUP(F13,Companies!$B$3:$M$1250,8,FALSE),IF(VLOOKUP(F13,Companies!$B$3:$M$1250,10,FALSE)<>\"\",VLOOKUP(F13,Companies!$B$3:$M$1250,10,FALSE),\"\")))))","v":""},{"$f":"IF(VLOOKUP(F13,Companies!$B$3:$M$1250,3,FALSE)<>\"\",VLOOKUP(F13,Companies!$B$3:$M$1250,3,FALSE),IF(VLOOKUP(F13,Companies!$B$3:$M$1250,5,FALSE)<>\"\",VLOOKUP(F13,Companies!$B$3:$M$1250,5,FALSE),IF(VLOOKUP(F13,Companies!$B$3:$M$1250,7,FALSE)<>\"\",VLOOKUP(F13,Companies!$B$3:$M$1250,7,FALSE),IF(VLOOKUP(F13,Companies!$B$3:$M$1250,9,FALSE)<>\"\",VLOOKUP(F13,Companies!$B$3:$M$1250,9,FALSE),IF(VLOOKUP(F13,Companies!$B$3:$M$1250,11,FALSE)<>\"\",VLOOKUP(F13,Companies!$B$3:$M$1250,11,FALSE),\"\")))))","v":""},{"$f":"IF(VLOOKUP(F13,Companies!$B$3:$M$1250,12,FALSE)<>\"\",VLOOKUP(F13,Companies!$B$3:$M$1250,12,FALSE),\"\")","v":""}]
[{"$nulls":3},"VSFR","411AUTONEUMBELGIUMNV","Autoneum Belgium NV","2019-03-31","2019-04-30","Invoice","19.03.0196",{"v":1806.66,"d":"1,806.66 €"},{"$f":"IF(VLOOKUP(F14,Companies!$B$3:$M$1250,2,FALSE)<>\"\",VLOOKUP(F14,Companies!$B$3:$M$1250,2,FALSE),IF(VLOOKUP(F14,Companies!$B$3:$M$1250,4,FALSE)<>\"\",VLOOKUP(F14,Companies!$B$3:$M$1250,4,FALSE),IF(VLOOKUP(F14,Companies!$B$3:$M$1250,6,FALSE)<>\"\",VLOOKUP(F14,Companies!$B$3:$M$1250,6,FALSE),IF(VLOOKUP(F14,Companies!$B$3:$M$1250,8,FALSE)<>\"\",VLOOKUP(F14,Companies!$B$3:$M$1250,8,FALSE),IF(VLOOKUP(F14,Companies!$B$3:$M$1250,10,FALSE)<>\"\",VLOOKUP(F14,Companies!$B$3:$M$1250,10,FALSE),\"\")))))","v":""},{"$f":"IF(VLOOKUP(F14,Companies!$B$3:$M$1250,3,FALSE)<>\"\",VLOOKUP(F14,Companies!$B$3:$M$1250,3,FALSE),IF(VLOOKUP(F14,Companies!$B$3:$M$1250,5,FALSE)<>\"\",VLOOKUP(F14,Companies!$B$3:$M$1250,5,FALSE),IF(VLOOKUP(F14,Companies!$B$3:$M$1250,7,FALSE)<>\"\",VLOOKUP(F14,Companies!$B$3:$M$1250,7,FALSE),IF(VLOOKUP(F14,Companies!$B$3:$M$1250,9,FALSE)<>\"\",VLOOKUP(F14,Companies!$B$3:$M$1250,9,FALSE),IF(VLOOKUP(F14,Companies!$B$3:$M$1250,11,FALSE)<>\"\",VLOOKUP(F14,Companies!$B$3:$M$1250,11,FALSE),\"\")))))","v":""},{"$f":"IF(VLOOKUP(F14,Companies!$B$3:$M$1250,12,FALSE)<>\"\",VLOOKUP(F14,Companies!$B$3:$M$1250,12,FALSE),\"\")","v":""}]
[{"$nulls":3},"VSFR","411AUTONEUMGBLIMITED","Autoneum GB Limited","2019-04-30","2019-05-30","Invoice","19.04.0090",{"v":1213.33,"d":"1,213.33 €"},{"$f":"IF(VLOOKUP(F15,Companies!$B$3:$M$1250,2,FALSE)<>\"\",VLOOKUP(F15,Companies!$B$3:$M$1250,2,FALSE),IF(VLOOKUP(F15,Companies!$B$3:$M$1250,4,FALSE)<>\"\",VLOOKUP(F15,Companies!$B$3:$M$1250,4,FALSE),IF(VLOOKUP(F15,Companies!$B$3:$M$1250,6,FALSE)<>\"\",VLOOKUP(F15,Companies!$B$3:$M$1250,6,FALSE),IF(VLOOKUP(F15,Companies!$B$3:$M$1250,8,FALSE)<>\"\",VLOOKUP(F15,Companies!$B$3:$M$1250,8,FALSE),IF(VLOOKUP(F15,Companies!$B$3:$M$1250,10,FALSE)<>\"\",VLOOKUP(F15,Companies!$B$3:$M$1250,10,FALSE),\"\")))))","v":""},{"$f":"IF(VLOOKUP(F15,Companies!$B$3:$M$1250,3,FALSE)<>\"\",VLOOKUP(F15,Companies!$B$3:$M$1250,3,FALSE),IF(VLOOKUP(F15,Companies!$B$3:$M$1250,5,FALSE)<>\"\",VLOOKUP(F15,Companies!$B$3:$M$1250,5,FALSE),IF(VLOOKUP(F15,Companies!$B$3:$M$1250,7,FALSE)<>\"\",VLOOKUP(F15,Companies!$B$3:$M$1250,7,FALSE),IF(VLOOKUP(F15,Companies!$B$3:$M$1250,9,FALSE)<>\"\",VLOOKUP(F15,Companies!$B$3:$M$1250,9,FALSE),IF(VLOOKUP(F15,Companies!$B$3:$M$1250,11,FALSE)<>\"\",VLOOKUP(F15,Companies!$B$3:$M$1250,11,FALSE),\"\")))))","v":""},{"$f":"IF(VLOOKUP(F15,Companies!$B$3:$M$1250,12,FALSE)<>\"\",VLOOKUP(F15,Companies!$B$3:$M$1250,12,FALSE),\"\")","v":""}]
[{"$nulls":3},"VSFR","411AUTONEUMPOLANDSPZ","AUTONEUM POLAND Sp. Z o.o.","2019-04-30","2019-05-30","Invoice","19.04.0118",{"v":773.34,"d":"773.34 €"},{"$f":"IF(VLOOKUP(F16,Companies!$B$3:$M$1250,2,FALSE)<>\"\",VLOOKUP(F16,Companies!$B$3:$M$1250,2,FALSE),IF(VLOOKUP(F16,Companies!$B$3:$M$1250,4,FALSE)<>\"\",VLOOKUP(F16,Companies!$B$3:$M$1250,4,FALSE),IF(VLOOKUP(F16,Companies!$B$3:$M$1250,6,FALSE)<>\"\",VLOOKUP(F16,Companies!$B$3:$M$1250,6,FALSE),IF(VLOOKUP(F16,Companies!$B$3:$M$1250,8,FALSE)<>\"\",VLOOKUP(F16,Companies!$B$3:$M$1250,8,FALSE),IF(VLOOKUP(F16,Companies!$B$3:$M$1250,10,FALSE)<>\"\",VLOOKUP(F16,Companies!$B$3:$M$1250,10,FALSE),\"\")))))","v":""},{"$f":"IF(VLOOKUP(F16,Companies!$B$3:$M$1250,3,FALSE)<>\"\",VLOOKUP(F16,Companies!$B$3:$M$1250,3,FALSE),IF(VLOOKUP(F16,Companies!$B$3:$M$1250,5,FALSE)<>\"\",VLOOKUP(F16,Companies!$B$3:$M$1250,5,FALSE),IF(VLOOKUP(F16,Companies!$B$3:$M$1250,7,FALSE)<>\"\",VLOOKUP(F16,Companies!$B$3:$M$1250,7,FALSE),IF(VLOOKUP(F16,Companies!$B$3:$M$1250,9,FALSE)<>\"\",VLOOKUP(F16,Companies!$B$3:$M$1250,9,FALSE),IF(VLOOKUP(F16,Companies!$B$3:$M$1250,11,FALSE)<>\"\",VLOOKUP(F16,Companies!$B$3:$M$1250,11,FALSE),\"\")))))","v":""},{"$f":"IF(VLOOKUP(F16,Companies!$B$3:$M$1250,12,FALSE)<>\"\",VLOOKUP(F16,Companies!$B$3:$M$1250,12,FALSE),\"\")","v":""}]
[{"$nulls":3},"VSFR","411GOTAVERKENMILJOAB","BABCOCK & WILCOX VØLUND AB","2019-05-31","2019-06-30","Invoice","FA19050074",{"v":823.33,"d":"823.33 €"},{"$f":"IF(VLOOKUP(F17,Companies!$B$3:$M$1250,2,FALSE)<>\"\",VLOOKUP(F17,Companies!$B$3:$M$1250,2,FALSE),IF(VLOOKUP(F17,Companies!$B$3:$M$1250,4,FALSE)<>\"\",VLOOKUP(F17,Companies!$B$3:$M$1250,4,FALSE),IF(VLOOKUP(F17,Companies!$B$3:$M$1250,6,FALSE)<>\"\",VLOOKUP(F17,Companies!$B$3:$M$1250,6,FALSE),IF(VLOOKUP(F17,Companies!$B$3:$M$1250,8,FALSE)<>\"\",VLOOKUP(F17,Companies!$B$3:$M$1250,8,FALSE),IF(VLOOKUP(F17,Companies!$B$3:$M$1250,10,FALSE)<>\"\",VLOOKUP(F17,Companies!$B$3:$M$1250,10,FALSE),\"\")))))","v":""},{"$f":"IF(VLOOKUP(F17,Companies!$B$3:$M$1250,3,FALSE)<>\"\",VLOOKUP(F17,Companies!$B$3:$M$1250,3,FALSE),IF(VLOOKUP(F17,Companies!$B$3:$M$1250,5,FALSE)<>\"\",VLOOKUP(F17,Companies!$B$3:$M$1250,5,FALSE),IF(VLOOKUP(F17,Companies!$B$3:$M$1250,7,FALSE)<>\"\",VLOOKUP(F17,Companies!$B$3:$M$1250,7,FALSE),IF(VLOOKUP(F17,Companies!$B$3:$M$1250,9,FALSE)<>\"\",VLOOKUP(F17,Companies!$B$3:$M$1250,9,FALSE),IF(VLOOKUP(F17,Companies!$B$3:$M$1250,11,FALSE)<>\"\",VLOOKUP(F17,Companies!$B$3:$M$1250,11,FALSE),\"\")))))","v":""},{"$f":"IF(VLOOKUP(F17,Companies!$B$3:$M$1250,12,FALSE)<>\"\",VLOOKUP(F17,Companies!$B$3:$M$1250,12,FALSE),\"\")","v":""}]
[{"$nulls":3},"VSUK","411BWVUKENERGYLTD","Babcock & Wilcox Vølund Limited","2019-03-31","2019-04-30","Invoice","03.19.0034",{"v":132,"d":"132.00 €"},{"$f":"IF(VLOOKUP(F18,Companies!$B$3:$M$1250,2,FALSE)<>\"\",VLOOKUP(F18,Companies!$B$3:$M$1250,2,FALSE),IF(VLOOKUP(F18,Companies!$B$3:$M$1250,4,FALSE)<>\"\",VLOOKUP(F18,Companies!$B$3:$M$1250,4,FALSE),IF(VLOOKUP(F18,Companies!$B$3:$M$1250,6,FALSE)<>\"\",VLOOKUP(F18,Companies!$B$3:$M$1250,6,FALSE),IF(VLOOKUP(F18,Companies!$B$3:$M$1250,8,FALSE)<>\"\",VLOOKUP(F18,Companies!$B$3:$M$1250,8,FALSE),IF(VLOOKUP(F18,Companies!$B$3:$M$1250,10,FALSE)<>\"\",VLOOKUP(F18,Companies!$B$3:$M$1250,10,FALSE),\"\")))))","v":""},{"$f":"IF(VLOOKUP(F18,Companies!$B$3:$M$1250,3,FALSE)<>\"\",VLOOKUP(F18,Companies!$B$3:$M$1250,3,FALSE),IF(VLOOKUP(F18,Companies!$B$3:$M$1250,5,FALSE)<>\"\",VLOOKUP(F18,Companies!$B$3:$M$1250,5,FALSE),IF(VLOOKUP(F18,Companies!$B$3:$M$1250,7,FALSE)<>\"\",VLOOKUP(F18,Companies!$B$3:$M$1250,7,FALSE),IF(VLOOKUP(F18,Companies!$B$3:$M$1250,9,FALSE)<>\"\",VLOOKUP(F18,Companies!$B$3:$M$1250,9,FALSE),IF(VLOOKUP(F18,Companies!$B$3:$M$1250,11,FALSE)<>\"\",VLOOKUP(F18,Companies!$B$3:$M$1250,11,FALSE),\"\")))))","v":""},{"$f":"IF(VLOOKUP(F18,Companies!$B$3:$M$1250,12,FALSE)<>\"\",VLOOKUP(F18,Companies!$B$3:$M$1250,12,FALSE),\"\")","v":""}]
[{"$nulls":3},"VSFR","411BNPPARIBASRESTATE","BNP Paribas Real estate consult GMBH","2019-03-31","2019-04-30","Invoice","19.03.0113",{"v":1264.83,"d":"1,264.83 €"},{"$f":"IF(VLOOKUP(F19,Companies!$B$3:$M$1250,2,FALSE)<>\"\",VLOOKUP(F19,Companies!$B$3:$M$1250,2,FALSE),IF(VLOOKUP(F19,Companies!$B$3:$M$1250,4,FALSE)<>\"\",VLOOKUP(F19,Companies!$B$3:$M$1250,4,FALSE),IF(VLOOKUP(F19,Companies!$B$3:$M$1250,6,FALSE)<>\"\",VLOOKUP(F19,Companies!$B$3:$M$1250,6,FALSE),IF(VLOOKUP(F19,Companies!$B$3:$M$1250,8,FALSE)<>\"\",VLOOKUP(F19,Companies!$B$3:$M$1250,8,FALSE),IF(VLOOKUP(F19,Companies!$B$3:$M$1250,10,FALSE)<>\"\",VLOOKUP(F19,Companies!$B$3:$M$1250,10,FALSE),\"\")))))","v":""},{"$f":"IF(VLOOKUP(F19,Companies!$B$3:$M$1250,3,FALSE)<>\"\",VLOOKUP(F19,Companies!$B$3:$M$1250,3,FALSE),IF(VLOOKUP(F19,Companies!$B$3:$M$1250,5,FALSE)<>\"\",VLOOKUP(F19,Companies!$B$3:$M$1250,5,FALSE),IF(VLOOKUP(F19,Companies!$B$3:$M$1250,7,FALSE)<>\"\",VLOOKUP(F19,Companies!$B$3:$M$1250,7,FALSE),IF(VLOOKUP(F19,Companies!$B$3:$M$1250,9,FALSE)<>\"\",VLOOKUP(F19,Companies!$B$3:$M$1250,9,FALSE),IF(VLOOKUP(F19,Companies!$B$3:$M$1250,11,FALSE)<>\"\",VLOOKUP(F19,Companies!$B$3:$M$1250,11,FALSE),\"\")))))","v":""},{"$f":"IF(VLOOKUP(F19,Companies!$B$3:$M$1250,12,FALSE)<>\"\",VLOOKUP(F19,Companies!$B$3:$M$1250,12,FALSE),\"\")","v":""}]
[{"$nulls":3},"VSFR","411BNPPARIBASRESTATE","BNP Paribas Real estate consult GMBH","2019-04-30","2019-05-30","Invoice","19.04.0111",{"v":3258.17,"d":"3,258.17 €"},{"$f":"IF(VLOOKUP(F20,Companies!$B$3:$M$1250,2,FALSE)<>\"\",VLOOKUP(F20,Companies!$B$3:$M$1250,2,FALSE),IF(VLOOKUP(F20,Companies!$B$3:$M$1250,4,FALSE)<>\"\",VLOOKUP(F20,Companies!$B$3:$M$1250,4,FALSE),IF(VLOOKUP(F20,Companies!$B$3:$M$1250,6,FALSE)<>\"\",VLOOKUP(F20,Companies!$B$3:$M$1250,6,FALSE),IF(VLOOKUP(F20,Companies!$B$3:$M$1250,8,FALSE)<>\"\",VLOOKUP(F20,Companies!$B$3:$M$1250,8,FALSE),IF(VLOOKUP(F20,Companies!$B$3:$M$1250,10,FALSE)<>\"\",VLOOKUP(F20,Companies!$B$3:$M$1250,10,FALSE),\"\")))))","v":""},{"$f":"IF(VLOOKUP(F20,Companies!$B$3:$M$1250,3,FALSE)<>\"\",VLOOKUP(F20,Companies!$B$3:$M$1250,3,FALSE),IF(VLOOKUP(F20,Companies!$B$3:$M$1250,5,FALSE)<>\"\",VLOOKUP(F20,Companies!$B$3:$M$1250,5,FALSE),IF(VLOOKUP(F20,Companies!$B$3:$M$1250,7,FALSE)<>\"\",VLOOKUP(F20,Companies!$B$3:$M$1250,7,FALSE),IF(VLOOKUP(F20,Companies!$B$3:$M$1250,9,FALSE)<>\"\",VLOOKUP(F20,Companies!$B$3:$M$1250,9,FALSE),IF(VLOOKUP(F20,Companies!$B$3:$M$1250,11,FALSE)<>\"\",VLOOKUP(F20,Companies!$B$3:$M$1250,11,FALSE),\"\")))))","v":""},{"$f":"IF(VLOOKUP(F20,Companies!$B$3:$M$1250,12,FALSE)<>\"\",VLOOKUP(F20,Companies!$B$3:$M$1250,12,FALSE),\"\")","v":""}]
{"$rows_left_out":222}
{"sheet":"Access","index":2,"n_rows":3,"n_cols":11,"rows_kept":3}
["Company concerned","Document Date","Due \nDate","Document Type","Document No.","Remaining Amount",null,"Contact Name","Email Address","Consultant","Invoices N°"]
["Access","2018-09-30","2018-11-14","Invoice","18.09.0065",{"v":309.59,"d":"309.59 €"},null,"kobli","jkjregihgtrnnbtr","papap","18.09.0065"]
[{"$nulls":4},"TOTAL",{"v":309.59,"d":"309.59 €"}]