{"text_format":"3","workbook":"xlsx","n_sheets":12,"sheets":["Menu","Com Annule et remplace","Com 1","Com 2","Com 3","Com 4","Com 5","Com 6","Importation Commande","Feuil8","Feuil1","X"],"not_rendered":{"macros":1,"defined_names":7},"read":"whole","date_system":"1900"}

{"sheet":"Menu","index":0,"n_rows":120,"n_cols":59,"rows_kept":120,"merged":[[2,2,7,12],[21,2,21,12]]}
[{"$nulls":52},"Non coché","Non coché","Non coché","Non coché","Non coché","Non coché","Non coché"]
[{"$nulls":52},"Non coché","Non coché","Non coché","Non coché","Non coché","Non coché","Non coché"]
[null,null,"Commande de linge ",{"$nulls":49},{"$f":"IF(BA2=\"Coché\",2,0)","v":0},{"$f":"IF(BB2=\"Coché\",2,0)","v":0},0,0,0,0,0]
{"$rows_empty":9}
[{"$nulls":8},"Fait   le ",{"$f":"TODAY()","v":"2019-06-25"}]
[]
[{"$nulls":8},{"$f":"'Com Annule et remplace'!G6","v":"Com Annule et remplace"}]
[{"$nulls":8},{"$f":"'Com 1'!G6","v":"Com 1"}]
[{"$nulls":8},{"$f":"'Com 2'!G6","v":"Com 2"}]
[{"$nulls":8},{"$f":"'Com 3'!G6","v":"Com 3"}]
[{"$nulls":8},{"$f":"'Com 4'!G6","v":"Com 4"}]
[{"$nulls":8},{"$f":"'Com 5'!G6","v":"Com 5"}]
[{"$nulls":8},{"$f":"'Com 6'!G6","v":"Com 6"}]
{"$rows_empty":89}
["Commande de linge Semaine"]
[{"$f":"TODAY()+7","v":"2019-07-02"},{"$f":"WEEKNUM(A112,2)","v":27}]
[{"$f":"CONCATENATE(A111&\" \",B112)","v":"Commande de linge Semaine 27"}]
[{"$f":"CONCATENATE(A111&\" \",TEXT(A112,\"JJMMAA\"),\" \")","v":"Commande de linge Semaine 020719 "}]
[]
[]
[]
[]
[]
["Inventaire 250619.xlsm"]

{"sheet":"Com Annule et remplace","index":1,"n_rows":27,"n_cols":8,"rows_kept":27,"merged":[[0,0,0,4],[2,1,2,2],[9,0,9,2],[10,0,10,2],[11,0,11,2],[12,0,12,2],[13,0,13,2],[14,0,14,2],[15,0,15,2],[16,0,16,2],[17,0,17,2],[18,0,18,2],[19,0,19,2],[20,0,20,2],[21,0,21,2],[22,0,22,2],[23,0,23,2]]}
[{"$nulls":7},{"$f":"Menu!BA3","v":0}]
[]
["Commande de linge pour le  :"]
[{"$nulls":6},{"$f":"CONCATENATE(A5 & \" \",TEXT(A6,\"JJ   MMM\" & \" \"),A7)","v":"Samedi 00 janv Remplace"}]
[{"$f":"CHOOSE(WEEKDAY(A6),\"Dimanche\",\"Lundi\",\"Mardi\",\"Mercredi\",\"Jeudi\",\"Vendredi\",\"Samedi\")","v":"Samedi"}]
[{"$nulls":6},{"$f":"MID(CELL(\"filename\",G6),FIND(\"]\",CELL(\"filename\",G6))+1,32)","v":"Com Annule et remplace"}]
["Remplace"]
[]
[{"$nulls":3},"Commandé","Reçu"]
["Peignoir Eponge col chale bourdon gris"]
["Drap King Size Polypercale 300x310"]
["Drap 1 Personne Polypercale 180x330"]
["Housse de couette 220x225 cm 1 pers prestige"]
["Housse de couette 280x265 2 pers prestige"]
["Taie 50x75 rectangle bourdon gris"]
["Sous Taie rectangle"]
["Sous Taie carrée"]
["Taie 65x65 cm carrée bourdon gris"]
["Carré éponge 550 grs"]
["Serviette Eponge BAMBOU"]
["Drap de bain BAMBOU"]
["Descente de Lit Satin Blanc"]
["Tapis de bain BAMBOU"]
["Peignoir Enfant"]
[]
[]
[{"$nulls":3},"le",{"$f":"TODAY()","v":"2019-06-25"}]

{"sheet":"Com 1","index":2,"n_rows":27,"n_cols":8,"rows_kept":27,"merged":[[0,0,0,4],[2,1,2,2],[9,0,9,2],[10,0,10,2],[11,0,11,2],[12,0,12,2],[13,0,13,2],[14,0,14,2],[15,0,15,2],[16,0,16,2],[17,0,17,2],[18,0,18,2],[19,0,19,2],[20,0,20,2],[21,0,21,2],[22,0,22,2],[23,0,23,2]]}
[{"$nulls":7},{"$f":"Menu!BB3","v":0}]
[]
["Commande de linge pour le  :"]
[{"$nulls":6},{"$f":"CONCATENATE(A5 & \" \",TEXT(A6,\"JJ   MMMM\" & \" \"),A7)","v":"Samedi 00 janvier "}]
[{"$f":"CHOOSE(WEEKDAY(A6),\"Dimanche\",\"Lundi\",\"Mardi\",\"Mercredi\",\"Jeudi\",\"Vendredi\",\"Samedi\")","v":"Samedi"}]
[{"$nulls":6},{"$f":"MID(CELL(\"filename\",G6),FIND(\"]\",CELL(\"filename\",G6))+1,32)","v":"Com 1"}]
[]
[]
[{"$nulls":3},"Commandé","Reçu"]
["Peignoir Eponge col chale bourdon gris"]
["Drap King Size Polypercale 300x310"]
["Drap 1 Personne Polypercale 180x330"]
["Housse de couette 220x225 cm 1 pers prestige"]
["Housse de couette 280x265 2 pers prestige"]
["Taie 50x75 rectangle bourdon gris"]
["Sous Taie rectangle"]
["Sous Taie carrée"]
["Taie 65x65 cm carrée bourdon gris"]
["Carré éponge 550 grs"]
["Serviette Eponge BAMBOU"]
["Drap de bain BAMBOU"]
["Descente de Lit Satin Blanc"]
["Tapis de bain BAMBOU"]
["Peignoir Enfant"]
[]
[]
[{"$nulls":3},"le",{"$f":"TODAY()","v":"2019-06-25"}]

{"sheet":"Com 2","index":3,"n_rows":27,"n_cols":8,"rows_kept":27,"merged":[[0,0,0,4],[2,1,2,2],[9,0,9,2],[10,0,10,2],[11,0,11,2],[12,0,12,2],[13,0,13,2],[14,0,14,2],[15,0,15,2],[16,0,16,2],[17,0,17,2],[18,0,18,2],[19,0,19,2],[20,0,20,2],[21,0,21,2],[22,0,22,2],[23,0,23,2]]}
[{"$nulls":7},{"$f":"Menu!BC3","v":0}]
[]
["Commande de linge pour le  :"]
[{"$nulls":6},{"$f":"CONCATENATE(A5 & \" \",TEXT(A6,\"JJ   MMMM\" & \" \"),A7)","v":"Samedi 00 janvier "}]
[{"$f":"CHOOSE(WEEKDAY(A6),\"Dimanche\",\"Lundi\",\"Mardi\",\"Mercredi\",\"Jeudi\",\"Vendredi\",\"Samedi\")","v":"Samedi"}]
[{"$nulls":6},{"$f":"MID(CELL(\"filename\",G6),FIND(\"]\",CELL(\"filename\",G6))+1,32)","v":"Com 2"}]
[]
[]
[{"$nulls":3},"Commandé","Reçu"]
["Peignoir Eponge col chale bourdon gris"]
["Drap King Size Polypercale 300x310"]
["Drap 1 Personne Polypercale 180x330"]
["Housse de couette 220x225 cm 1 pers prestige"]
["Housse de couette 280x265 2 pers prestige"]
["Taie 50x75 rectangle bourdon gris"]
["Sous Taie rectangle"]
["Sous Taie carrée"]
["Taie 65x65 cm carrée bourdon gris"]
["Carré éponge 550 grs"]
["Serviette Eponge BAMBOU"]
["Drap de bain BAMBOU"]
["Descente de Lit Satin Blanc"]
["Tapis de bain BAMBOU"]
["Peignoir Enfant"]
[]
[]
[{"$nulls":3},"le",{"$f":"TODAY()","v":"2019-06-25"}]

{"sheet":"Com 3","index":4,"n_rows":27,"n_cols":8,"rows_kept":27,"merged":[[0,0,0,4],[2,1,2,2],[9,0,9,2],[10,0,10,2],[11,0,11,2],[12,0,12,2],[13,0,13,2],[14,0,14,2],[15,0,15,2],[16,0,16,2],[17,0,17,2],[18,0,18,2],[19,0,19,2],[20,0,20,2],[21,0,21,2],[22,0,22,2],[23,0,23,2]]}
[{"$nulls":7},{"$f":"Menu!BD3","v":0}]
[]
["Commande de linge pour le  :"]
[{"$nulls":6},{"$f":"CONCATENATE(A5 & \" \",TEXT(A6,\"JJ   MMMM\" & \" \"),A7)","v":"Samedi 00 janvier "}]
[{"$f":"CHOOSE(WEEKDAY(A6),\"Dimanche\",\"Lundi\",\"Mardi\",\"Mercredi\",\"Jeudi\",\"Vendredi\",\"Samedi\")","v":"Samedi"}]
[{"$nulls":6},{"$f":"MID(CELL(\"filename\",G6),FIND(\"]\",CELL(\"filename\",G6))+1,32)","v":"Com 3"}]
[]
[]
[{"$nulls":3},"Commandé","Reçu"]
["Peignoir Eponge col chale bourdon gris"]
["Drap King Size Polypercale 300x310"]
["Drap 1 Personne Polypercale 180x330"]
["Housse de couette 220x225 cm 1 pers prestige"]
["Housse de couette 280x265 2 pers prestige"]
["Taie 50x75 rectangle bourdon gris"]
["Sous Taie rectangle"]
["Sous Taie carrée"]
["Taie 65x65 cm carrée bourdon gris"]
["Carré éponge 550 grs"]
["Serviette Eponge BAMBOU"]
["Drap de bain BAMBOU"]
["Descente de Lit Satin Blanc"]
["Tapis de bain BAMBOU"]
["Peignoir Enfant"]
[]
[]
[{"$nulls":3},"le",{"$f":"TODAY()","v":"2019-06-25"}]

{"sheet":"Com 4","index":5,"n_rows":27,"n_cols":8,"rows_kept":27,"merged":[[0,0,0,4],[2,1,2,2],[9,0,9,2],[10,0,10,2],[11,0,11,2],[12,0,12,2],[13,0,13,2],[14,0,14,2],[15,0,15,2],[16,0,16,2],[17,0,17,2],[18,0,18,2],[19,0,19,2],[20,0,20,2],[21,0,21,2],[22,0,22,2],[23,0,23,2]]}
[{"$nulls":7},{"$f":"Menu!BE3","v":0}]
[]
["Commande de linge pour le  :"]
[{"$nulls":6},{"$f":"CONCATENATE(A5 & \" \",TEXT(A6,\"JJ   MMMM\" & \" \"),A7)","v":"Samedi 00 janvier "}]
[{"$f":"CHOOSE(WEEKDAY(A6),\"Dimanche\",\"Lundi\",\"Mardi\",\"Mercredi\",\"Jeudi\",\"Vendredi\",\"Samedi\")","v":"Samedi"}]
[{"$nulls":6},{"$f":"MID(CELL(\"filename\",G6),FIND(\"]\",CELL(\"filename\",G6))+1,32)","v":"Com 4"}]
[]
[]
[{"$nulls":3},"Commandé","Reçu"]
["Peignoir Eponge col chale bourdon gris"]
["Drap King Size Polypercale 300x310"]
["Drap 1 Personne Polypercale 180x330"]
["Housse de couette 220x225 cm 1 pers prestige"]
["Housse de couette 280x265 2 pers prestige"]
["Taie 50x75 rectangle bourdon gris"]
["Sous Taie rectangle"]
["Sous Taie carrée"]
["Taie 65x65 cm carrée bourdon gris"]
["Carré éponge 550 grs"]
["Serviette Eponge BAMBOU"]
["Drap de bain BAMBOU"]
["Descente de Lit Satin Blanc"]
["Tapis de bain BAMBOU"]
["Peignoir Enfant"]
[]
[]
[{"$nulls":3},"le",{"$f":"TODAY()","v":"2019-06-25"}]

{"sheet":"Com 5","index":6,"n_rows":27,"n_cols":8,"rows_kept":27,"merged":[[0,0,0,4],[2,1,2,2],[9,0,9,2],[10,0,10,2],[11,0,11,2],[12,0,12,2],[13,0,13,2],[14,0,14,2],[15,0,15,2],[16,0,16,2],[17,0,17,2],[18,0,18,2],[19,0,19,2],[20,0,20,2],[21,0,21,2],[22,0,22,2],[23,0,23,2]]}
[{"$nulls":7},{"$f":"Menu!BF3","v":0}]
[]
["Commande de linge pour le  :"]
[{"$nulls":6},{"$f":"CONCATENATE(A5 & \" \",TEXT(A6,\"JJ   MMMM\" & \" \"),A7)","v":"Samedi 00 janvier "}]
[{"$f":"CHOOSE(WEEKDAY(A6),\"Dimanche\",\"Lundi\",\"Mardi\",\"Mercredi\",\"Jeudi\",\"Vendredi\",\"Samedi\")","v":"Samedi"}]
[{"$nulls":6},{"$f":"MID(CELL(\"filename\",G6),FIND(\"]\",CELL(\"filename\",G6))+1,32)","v":"Com 5"}]
[]
[]
[{"$nulls":3},"Commandé","Reçu"]
["Peignoir Eponge col chale bourdon gris"]
["Drap King Size Polypercale 300x310"]
["Drap 1 Personne Polypercale 180x330"]
["Housse de couette 220x225 cm 1 pers prestige"]
["Housse de couette 280x265 2 pers prestige"]
["Taie 50x75 rectangle bourdon gris"]
["Sous Taie rectangle"]
["Sous Taie carrée"]
["Taie 65x65 cm carrée bourdon gris"]
["Carré éponge 550 grs"]
["Serviette Eponge BAMBOU"]
["Drap de bain BAMBOU"]
["Descente de Lit Satin Blanc"]
["Tapis de bain BAMBOU"]
["Peignoir Enfant"]
[]
[]
[{"$nulls":3},"le",{"$f":"TODAY()","v":"2019-06-25"}]

{"sheet":"Com 6","index":7,"n_rows":27,"n_cols":8,"rows_kept":27,"merged":[[0,0,0,4],[2,1,2,2],[9,0,9,2],[10,0,10,2],[11,0,11,2],[12,0,12,2],[13,0,13,2],[14,0,14,2],[15,0,15,2],[16,0,16,2],[17,0,17,2],[18,0,18,2],[19,0,19,2],[20,0,20,2],[21,0,21,2],[22,0,22,2],[23,0,23,2]]}
[{"$nulls":7},{"$f":"Menu!BG3","v":0}]
[]
["Commande de linge pour le  :"]
[{"$nulls":6},{"$f":"CONCATENATE(A5 & \" \",TEXT(A6,\"JJ   MMMM\" & \" \"),A7)","v":"Samedi 00 janvier "}]
[{"$f":"CHOOSE(WEEKDAY(A6),\"Dimanche\",\"Lundi\",\"Mardi\",\"Mercredi\",\"Jeudi\",\"Vendredi\",\"Samedi\")","v":"Samedi"}]
[{"$nulls":6},{"$f":"MID(CELL(\"filename\",G6),FIND(\"]\",CELL(\"filename\",G6))+1,32)","v":"Com 6"}]
[]
[]
[{"$nulls":3},"Commandé","Reçu"]
["Peignoir Eponge col chale bourdon gris"]
["Drap King Size Polypercale 300x310"]
["Drap 1 Personne Polypercale 180x330"]
["Housse de couette 220x225 cm 1 pers prestige"]
["Housse de couette 280x265 2 pers prestige"]
["Taie 50x75 rectangle bourdon gris"]
["Sous Taie rectangle"]
["Sous Taie carrée"]
["Taie 65x65 cm carrée bourdon gris"]
["Carré éponge 550 grs"]
["Serviette Eponge BAMBOU"]
["Drap de bain BAMBOU"]
["Descente de Lit Satin Blanc"]
["Tapis de bain BAMBOU"]
["Peignoir Enfant"]
[]
[]
[{"$nulls":3},"le",{"$f":"TODAY()","v":"2019-06-25"}]

{"sheet":"Importation Commande","index":8,"n_rows":76,"n_cols":71,"rows_kept":76,"merged":[[0,0,0,11],[1,37,3,59],[6,21,6,24],[6,25,6,28],[6,29,6,32],[6,33,6,36],[6,37,6,40],[6,41,6,44],[6,45,6,48],[6,49,6,52],[6,53,6,56],[6,57,6,60],[6,61,6,64],[7,0,7,9],[7,10,7,14],[7,21,7,24],[7,25,7,28],[7,29,7,32],[7,33,7,36],[7,37,7,40],[7,41,7,44],[7,45,7,48],[7,49,7,52],[7,53,7,56],[7,57,7,60],[7,61,7,64],[8,1,8,8],[8,9,8,16],[8,17,9,17],[8,18,8,19],[8,20,9,20],[9,21,9,24],[9,25,9,28],[9,29,9,32],[9,33,9,36],[9,37,9,40],[9,41,9,44],[9,45,9,48],[9,49,9,52],[9,53,9,56],[9,57,9,60],[9,61,9,64],[42,0,42,1],[42,9,42,10],[42,11,42,12],[43,9,43,10],[43,11,43,12],[44,9,44,10],[44,11,44,12],[45,9,45,10],[45,11,45,12],[46,9,46,10],[46,11,46,12],[47,9,47,10],[47,11,47,12],[48,9,48,10],[48,11,48,12],[49,9,49,10],[49,11,49,12],[50,9,50,10],[50,11,50,12],[51,9,51,10],[51,11,51,12],[52,9,52,10],[52,11,52,12],[55,12,57,35],[58,12,60,35],[61,12,63,35]]}
[]
[{"$nulls":37},"COMMANDE SEMAINE PROCHAINE"]
[]
[]
[]
[]
[null,null,"INVENTAIRE HEBDOMADAIRE DU LINGE",{"$nulls":18},"2019-06-19",{"$nulls":3},"2019-06-20",{"$nulls":3},"2019-06-21",{"$nulls":3},"2019-06-22"]
[{"$nulls":10},"2019-06-19",{"$nulls":10},"Mercredi",{"$nulls":3},"Jeudi",{"$nulls":3},"Vendredi",{"$nulls":3},"Samedi (=Ven + Sam)"]
[null,"réserve  théorique  ",{"$nulls":7},"Inventaire des offices",{"$nulls":7}," - 2 chariots","TOTAL",null,"Diff. Linge Théorique/          Etages","cmde","besoin","ds office","reste","cmde","besoin","ds office","reste","cmde","besoin","ds office","reste","cmde","besoin","ds office","reste"]
["Articles","etage 1","etage 2","etage 3","etage 4","etage 5","etage 6","etage 7","Etage 8","etage 1","etage 2","etage 3","etage 4","etage 5","etage 6","etage 7","Etage 8",null,"réserve  théorique  ","Etage Total",null,15,{"$nulls":3},50,{"$nulls":3},50,{"$nulls":3},91,{"$nulls":31},"reste ","besoin 1#","par # pour 50#","Moy sem 1 au 12","moy du 28/5 5/7","Moy 2017"]
["Peignoir Eponge col chale bourdon gris",5,5,5,5,5,5,5,5,35,0,0,0,0,0,0,0,0,40,35,-5,0,{"v":5.1000000000000005,"d":"5"},{"v":29.9,"d":"30"},{"v":-10.100000000000001,"d":"-10"},15,17,{"v":27.9,"d":"28"},{"v":-12.100000000000001,"d":"-12"},15,17,{"v":25.9,"d":"26"},{"v":-14.100000000000001,"d":"-14"},45,{"v":30.94,"d":"31"},{"v":39.96000000000001,"d":"40"},{"v":-0.03999999999999204,"d":"-0"},{"$nulls":28},{"v":0.6395,"d":"0.64"},0.34,{"v":0.8,"d":"0.80"},{"v":0.3493975903614458,"d":"0.35"},{"v":0.2908496732026144,"d":"0.29"},{"v":0.3846484427784785,"d":"0.38"}]
["Drap King Size Polypercale 300x310",10,10,10,10,10,10,10,5,70,0,0,0,0,0,0,0,0,75,70,-5,0,{"v":8.4,"d":"8"},{"v":61.6,"d":"62"},{"v":-13.399999999999999,"d":"-13"},30,{"v":28.000000000000004,"d":"28"},{"v":63.599999999999994,"d":"64"},{"v":-11.400000000000006,"d":"-11"},20,{"v":28.000000000000004,"d":"28"},{"v":55.599999999999994,"d":"56"},{"v":-19.400000000000006,"d":"-19"},70,{"v":50.96000000000001,"d":"51"},{"v":74.63999999999999,"d":"75"},{"v":-0.36000000000001364,"d":"-0"},{"$nulls":28},{"v":0.6362666666666662,"d":"0.64"},0.56,{"v":1.5,"d":"1.50"},{"v":0.7891566265060241,"d":"0.79"},{"v":0.7156862745098039,"d":"0.72"},{"v":0.6991834611722163,"d":"0.70"}]
["Drap 1 Personne Polypercale 180x330",6,6,6,6,6,6,4,0,61,0,0,0,0,0,0,0,0,40,61,21,0,{"v":2.85,"d":"3"},{"v":58.15,"d":"58"},{"v":18.15,"d":"18"},5,{"v":9.5,"d":"10"},{"v":53.65,"d":"54"},{"v":13.649999999999999,"d":"14"},15,{"v":9.5,"d":"10"},{"v":59.150000000000006,"d":"59"},{"v":19.150000000000006,"d":"19"},0,{"v":17.29,"d":"17"},{"v":41.86000000000001,"d":"42"},{"v":1.8600000000000065,"d":"2"},{"$nulls":28},{"v":0.83825,"d":"0.84"},0.19,{"v":0.8,"d":"0.80"},{"v":0.12650602409638553,"d":"0.13"},{"v":0.23202614379084968,"d":"0.23"},{"v":0.14562018910676883,"d":"0.15"}]
["Housse de couette 220x225 cm 1 pers",6,6,6,6,6,6,4,0,65,0,0,0,0,0,0,0,0,40,65,25,0,3,62,22,10,10,62,22,5,10,57,17,0,{"v":18.2,"d":"18"},{"v":38.8,"d":"39"},{"v":-1.2000000000000028,"d":"-1"},{"$nulls":28},{"v":0.8099999999999998,"d":"0.81"},{"v":0.2,"d":"0.20"},{"v":0.8,"d":"0.80"},{"v":0.0963855421686747,"d":"0.10"},{"v":0.1895424836601307,"d":"0.19"},{"v":0.15537410248271474,"d":"0.16"}]
["Housse de couette 280x265 2 pers ",10,10,10,10,10,10,10,5,80,0,0,0,0,0,0,0,0,75,80,5,0,{"v":9.75,"d":"10"},{"v":70.25,"d":"70"},{"v":-4.75,"d":"-5"},30,{"v":32.5,"d":"33"},{"v":67.75,"d":"68"},{"v":-7.25,"d":"-7"},35,{"v":32.5,"d":"33"},{"v":70.25,"d":"70"},{"v":-4.75,"d":"-5"},65,{"v":59.15,"d":"59"},{"v":76.1,"d":"76"},{"v":1.0999999999999943,"d":"1"},{"$nulls":28},{"v":0.6206666666666666,"d":"0.62"},0.65,{"v":1.5,"d":"1.50"},{"v":0.6024096385542169,"d":"0.60"},{"v":0.6209150326797386,"d":"0.62"},{"v":0.7034292822888046,"d":"0.70"}]
["Taie 50x75 rectangle bourdon gris",20,20,20,20,20,20,20,12,20,0,0,0,0,0,0,0,0,152,20,-132,0,{"v":24.75,"d":"25"},{"v":-4.75,"d":"-5"},{"v":-156.75,"d":"-157"},75,{"v":82.5,"d":"83"},{"v":-12.25,"d":"-12"},{"v":-164.25,"d":"-164"},70,{"v":82.5,"d":"83"},{"v":-24.75,"d":"-25"},{"v":-176.75,"d":"-177"},325,{"v":150.15,"d":"150"},{"v":150.1,"d":"150"},{"v":-1.9000000000000057,"d":"-2"},{"$nulls":28},{"v":0.5825657894736841,"d":"0.58"},1.65,3.04,{"v":1.6265060240963856,"d":"1.63"},{"v":1.7647058823529411,"d":"1.76"},{"v":1.6174283415759707,"d":"1.62"}]
["Sous Taie rectangle",8,8,8,8,8,7,7,6,56,0,0,0,0,0,0,0,0,60,56,-4,0,{"v":5.25,"d":"5"},{"v":50.75,"d":"51"},{"v":-9.25,"d":"-9"},20,{"v":17.5,"d":"18"},{"v":53.25,"d":"53"},{"v":-6.75,"d":"-7"},15,{"v":17.5,"d":"18"},{"v":50.75,"d":"51"},{"v":-9.25,"d":"-9"},40,{"v":31.849999999999998,"d":"32"},{"v":58.900000000000006,"d":"59"},{"v":-1.0999999999999943,"d":"-1"},{"$nulls":28},{"v":0.774166666666667,"d":"0.77"},0.35,{"v":1.2,"d":"1.20"},{"v":0.1144578313253012,"d":"0.11"},{"v":0.4084967320261438,"d":"0.41"},{"v":0.33312482976907004,"d":"0.33"}]
["Sous Taie carrée",8,8,8,8,8,7,7,6,48,0,0,0,0,0,0,0,0,60,48,-12,0,{"v":4.5,"d":"5"},{"v":43.5,"d":"44"},{"v":-16.5,"d":"-17"},10,15,{"v":38.5,"d":"39"},{"v":-21.5,"d":"-22"},20,15,{"v":43.5,"d":"44"},{"v":-16.5,"d":"-17"},45,{"v":27.3,"d":"27"},{"v":61.2,"d":"61"},{"v":1.2000000000000028,"d":"1"},{"$nulls":28},{"v":0.8183333333333335,"d":"0.82"},{"v":0.3,"d":"0.30"},{"v":1.2,"d":"1.20"},{"v":0.25301204819277107,"d":"0.25"},{"v":0.4084967320261438,"d":"0.41"},{"v":0.621611161852929,"d":"0.62"}]
["Taie 65x65 cm carrée bourdon gris",20,20,20,20,20,20,20,12,257,0,0,0,0,0,0,0,0,152,257,105,0,{"v":28.95,"d":"29"},{"v":228.05,"d":"228"},{"v":76.05000000000001,"d":"76"},85,{"v":96.5,"d":"97"},{"v":216.55,"d":"217"},{"v":64.55000000000001,"d":"65"},85,{"v":96.5,"d":"97"},{"v":205.05,"d":"205"},{"v":53.05000000000001,"d":"53"},125,{"v":175.63,"d":"176"},{"v":154.42000000000002,"d":"154"},{"v":2.420000000000016,"d":"2"},{"$nulls":28},{"v":0.47309210526315787,"d":"0.47"},1.93,3.04,{"v":0.9337349397590361,"d":"0.93"},{"v":1.696078431372549,"d":"1.70"},{"v":1.9256520042558614,"d":"1.93"}]
["Carré éponge 550 grs",32,32,32,32,32,32,32,11,326,0,0,0,0,0,0,0,0,235,326,91,0,{"v":52.050000000000004,"d":"52"},{"v":273.95,"d":"274"},{"v":38.94999999999999,"d":"39"},160,{"v":173.5,"d":"174"},{"v":260.45,"d":"260"},{"v":25.44999999999999,"d":"25"},155,{"v":173.5,"d":"174"},{"v":241.95,"d":"242"},{"v":6.949999999999989,"d":"7"},310,{"v":315.77000000000004,"d":"316"},{"v":236.18,"d":"236"},{"v":1.1800000000000068,"d":"1"},{"$nulls":28},{"v":0.4080425531914893,"d":"0.41"},3.47,{"v":4.7,"d":"4.70"},{"v":3.5240963855421685,"d":"3.52"},{"v":4.084967320261438,"d":"4.08"},{"v":3.6781433581081653,"d":"3.68"}]
["Serviette Eponge BAMBOU",20,20,20,20,20,18,18,10,213,0,0,0,0,0,0,0,0,146,213,67,0,{"v":27.900000000000002,"d":"28"},{"v":185.1,"d":"185"},{"v":39.099999999999994,"d":"39"},90,93,{"v":182.10000000000002,"d":"182"},{"v":36.10000000000002,"d":"36"},75,93,{"v":164.10000000000002,"d":"164"},{"v":18.100000000000023,"d":"18"},150,{"v":169.26000000000002,"d":"169"},{"v":144.84,"d":"145"},{"v":-1.1599999999999966,"d":"-1"},{"$nulls":28},{"v":0.5056164383561643,"d":"0.51"},1.86,2.92,{"v":1.9036144578313252,"d":"1.90"},{"v":1.84640522875817,"d":"1.85"},{"v":2.159286917590283,"d":"2.16"}]
["Drap de bain BAMBOU",17,17,17,17,17,17,17,10,199,0,0,0,0,0,0,0,0,129,199,70,0,{"v":27.900000000000002,"d":"28"},{"v":171.1,"d":"171"},{"v":42.099999999999994,"d":"42"},75,93,{"v":153.1,"d":"153"},{"v":24.099999999999994,"d":"24"},90,93,{"v":150.1,"d":"150"},{"v":21.099999999999994,"d":"21"},150,{"v":169.26000000000002,"d":"169"},{"v":130.84,"d":"131"},{"v":1.8400000000000034,"d":"2"},{"$nulls":28},{"v":0.4249612403100775,"d":"0.42"},1.86,2.58,1.52,{"v":1.9640522875816993,"d":"1.96"},{"v":1.9124555332178168,"d":"1.91"}]
["Descente de Lit Satin Blanc",18,18,15,15,15,15,15,8,153,0,0,0,0,0,0,0,0,119,153,34,0,{"v":22.5,"d":"23"},{"v":130.5,"d":"131"},{"v":11.5,"d":"12"},65,75,{"v":120.5,"d":"121"},{"v":1.5,"d":"2"},70,75,{"v":115.5,"d":"116"},{"v":-3.5,"d":"-4"},140,{"v":136.5,"d":"137"},119,0,{"$nulls":28},{"v":0.49159663865546216,"d":"0.49"},{"v":1.5,"d":"1.50"},2.38,{"v":1.4,"d":"1.40"},{"v":1.5849673202614378,"d":"1.58"},{"v":1.513922107868874,"d":"1.51"}]
["Tapis de bain BAMBOU",17,17,17,17,17,17,17,7,188,0,0,0,0,0,0,0,0,126,188,62,0,{"v":25.5,"d":"26"},{"v":162.5,"d":"163"},{"v":36.5,"d":"37"},85,85,{"v":162.5,"d":"163"},{"v":36.5,"d":"37"},65,85,{"v":142.5,"d":"143"},{"v":16.5,"d":"17"},140,{"v":154.7,"d":"155"},{"v":127.80000000000001,"d":"128"},{"v":1.8000000000000114,"d":"2"},{"$nulls":28},{"v":0.4436507936507939,"d":"0.44"},{"v":1.7,"d":"1.70"},2.52,{"v":1.7,"d":"1.70"},{"v":1.8006535947712419,"d":"1.80"},{"v":1.843374876131706,"d":"1.84"}]
["Peignoir Enfant",1,1,1,1,1,1,2,2,15,0,0,0,0,0,0,0,0,10,15,5,0,{"v":0.22499999999999998,"d":"0"},{"v":14.775,"d":"15"},{"v":4.775,"d":"5"},0,{"v":0.75,"d":"1"},{"v":14.025,"d":"14"},{"v":4.025,"d":"4"},0,{"v":0.75,"d":"1"},{"v":13.275,"d":"13"},{"v":3.2750000000000004,"d":"3"},0,{"v":1.365,"d":"1"},{"v":11.91,"d":"12"},{"v":1.9100000000000001,"d":"2"},{"$nulls":28},{"v":1.2305,"d":"1.23"},{"v":0.015,"d":"0.02"},{"v":0.2,"d":"0.20"},{"v":0.12650602409638553,"d":"0.13"},{"v":0.23202614379084968,"d":"0.23"},{"v":0.14562018910676883,"d":"0.15"}]
[]
[{"$nulls":39},{"v":14.659999999999993,"d":"15"},{"v":-14.659999999999993,"d":"-15"},null,null,{"v":1.6599999999999966,"d":"2"},{"v":-1.6599999999999966,"d":"-2"},null,null,{"v":17.299999999999997,"d":"17"},{"v":-17.299999999999997,"d":"-17"},null,null,{"v":16.58,"d":"17"},{"v":-16.58,"d":"-17"},null,null,{"v":15.18,"d":"15"},{"v":-15.18,"d":"-15"},null,null,{"v":29.42,"d":"29"},{"v":-29.42,"d":"-29"}]
[{"$nulls":39},{"v":24.440000000000012,"d":"24"},{"v":-24.440000000000012,"d":"-24"},null,null,{"v":2.440000000000012,"d":"2"},{"v":-2.440000000000012,"d":"-2"},null,null,{"v":28.200000000000017,"d":"28"},{"v":-28.200000000000017,"d":"-28"},null,null,{"v":16.72000000000002,"d":"17"},{"v":-16.72000000000002,"d":"-17"},null,null,{"v":34.12000000000002,"d":"34"},{"v":-34.12000000000002,"d":"-34"},null,null,{"v":42.28000000000004,"d":"42"},{"v":-42.28000000000004,"d":"-42"}]
[{"$nulls":39},{"v":6.309999999999995,"d":"6"},{"v":-6.309999999999995,"d":"-6"},null,null,{"v":5.809999999999995,"d":"6"},{"v":-5.809999999999995,"d":"-6"},null,null,{"v":4.549999999999997,"d":"5"},{"v":-4.549999999999997,"d":"-5"},null,null,{"v":7.530000000000001,"d":"8"},{"v":-7.530000000000001,"d":"-8"},null,null,{"v":5.130000000000003,"d":"5"},{"v":-5.130000000000003,"d":"-5"},null,null,{"v":21.470000000000002,"d":"21"},{"v":-21.470000000000002,"d":"-21"}]
[{"$nulls":39},{"v":9.800000000000004,"d":"10"},{"v":-9.800000000000004,"d":"-10"},null,null,0,{"v":0.19999999999999574,"d":"0"},null,null,{"v":9.000000000000007,"d":"9"},{"v":-9.000000000000007,"d":"-9"},null,null,{"v":7.400000000000006,"d":"7"},{"v":-7.400000000000006,"d":"-7"},null,null,{"v":15.400000000000006,"d":"15"},{"v":-15.400000000000006,"d":"-15"},null,null,{"v":12.600000000000005,"d":"13"},{"v":-12.600000000000005,"d":"-13"}]
[{"$nulls":39},{"v":26.85000000000001,"d":"27"},{"v":-26.85000000000001,"d":"-27"},null,null,{"v":9.350000000000009,"d":"9"},{"v":-9.350000000000009,"d":"-9"},null,null,{"v":19.250000000000014,"d":"19"},{"v":-19.250000000000014,"d":"-19"},null,null,{"v":31.55000000000001,"d":"32"},{"v":-31.55000000000001,"d":"-32"},null,null,{"v":32.55000000000001,"d":"33"},{"v":-32.55000000000001,"d":"-33"},null,null,{"v":48.45000000000001,"d":"48"},{"v":-48.45000000000001,"d":"-48"}]
[{"$nulls":39},{"v":72.85000000000001,"d":"73"},{"v":-72.85000000000001,"d":"-73"},null,null,{"v":5.350000000000023,"d":"5"},{"v":-5.350000000000023,"d":"-5"},null,null,{"v":71.25000000000001,"d":"71"},{"v":-71.25000000000001,"d":"-71"},null,null,{"v":75.55,"d":"76"},{"v":-75.55,"d":"-76"},null,null,{"v":71.55000000000001,"d":"72"},{"v":-71.55000000000001,"d":"-72"},null,null,{"v":148.45000000000002,"d":"148"},{"v":-148.45000000000002,"d":"-148"}]
[{"$nulls":39},{"v":16.14999999999999,"d":"16"},{"v":-16.14999999999999,"d":"-16"},null,null,{"v":3.6499999999999915,"d":"4"},{"v":-3.6499999999999915,"d":"-4"},null,null,{"v":9.749999999999986,"d":"10"},{"v":-9.749999999999986,"d":"-10"},null,null,{"v":19.44999999999999,"d":"19"},{"v":-19.44999999999999,"d":"-19"},null,null,{"v":13.449999999999989,"d":"13"},{"v":-13.449999999999989,"d":"-13"},null,null,{"v":28.549999999999986,"d":"29"},{"v":-28.549999999999986,"d":"-29"}]
[{"$nulls":39},{"v":11.699999999999996,"d":"12"},{"v":-11.699999999999996,"d":"-12"},null,null,{"v":6.699999999999989,"d":"7"},{"v":-6.699999999999989,"d":"-7"},null,null,{"v":10.499999999999993,"d":"11"},{"v":-10.499999999999993,"d":"-11"},null,null,{"v":13.099999999999994,"d":"13"},{"v":-13.099999999999994,"d":"-13"},null,null,{"v":10.099999999999994,"d":"10"},{"v":-10.099999999999994,"d":"-10"},null,null,{"v":30.899999999999995,"d":"31"},{"v":-30.899999999999995,"d":"-31"}]
[{"$nulls":39},{"v":80.56999999999998,"d":"81"},{"v":-80.56999999999998,"d":"-81"},null,null,{"v":17.069999999999993,"d":"17"},{"v":-17.069999999999993,"d":"-17"},null,null,{"v":75.85,"d":"76"},{"v":-75.85,"d":"-76"},null,null,{"v":86.91,"d":"87"},{"v":-86.91,"d":"-87"},null,null,{"v":89.11,"d":"89"},{"v":-89.11,"d":"-89"},null,null,{"v":165.09,"d":"165"},{"v":-165.09,"d":"-165"}]
[{"$nulls":39},{"v":148.03,"d":"148"},{"v":-148.03,"d":"-148"},null,null,{"v":21.529999999999973,"d":"22"},{"v":-21.529999999999973,"d":"-22"},null,null,{"v":141.14999999999998,"d":"141"},{"v":-141.14999999999998,"d":"-141"},null,null,{"v":156.89,"d":"157"},{"v":-156.89,"d":"-157"},null,null,{"v":155.69,"d":"156"},{"v":-155.69,"d":"-156"},null,null,{"v":304.11,"d":"304"},{"v":-304.11,"d":"-304"}]
[{"$nulls":39},{"v":81.14,"d":"81"},{"v":-81.14,"d":"-81"},null,null,{"v":14.139999999999986,"d":"14"},{"v":-14.139999999999986,"d":"-14"},null,null,{"v":69.69999999999999,"d":"70"},{"v":-69.69999999999999,"d":"-70"},null,null,{"v":87.82,"d":"88"},{"v":-87.82,"d":"-88"},null,null,{"v":77.22,"d":"77"},{"v":-77.22,"d":"-77"},null,null,{"v":172.18,"d":"172"},{"v":-172.18,"d":"-172"}]
[{"$nulls":39},{"v":78.14,"d":"78"},{"v":-78.14,"d":"-78"},null,null,{"v":11.139999999999986,"d":"11"},{"v":-11.139999999999986,"d":"-11"},null,null,{"v":76.69999999999999,"d":"77"},{"v":-76.69999999999999,"d":"-77"},null,null,{"v":84.82,"d":"85"},{"v":-84.82,"d":"-85"},null,null,{"v":79.22,"d":"79"},{"v":-79.22,"d":"-79"},null,null,{"v":164.18,"d":"164"},{"v":-164.18,"d":"-164"}]
[{"$nulls":39},{"v":64.5,"d":"65"},{"v":-64.5,"d":"-65"},null,null,{"v":9.5,"d":"10"},{"v":-9.5,"d":"-10"},null,null,{"v":58.5,"d":"59"},{"v":-58.5,"d":"-59"},null,null,{"v":66.5,"d":"67"},{"v":-66.5,"d":"-67"},null,null,{"v":71.5,"d":"72"},{"v":-71.5,"d":"-72"},null,null,{"v":130.5,"d":"131"},{"v":-130.5,"d":"-131"}]
[{"$nulls":39},{"v":71.29999999999998,"d":"71"},{"v":-71.29999999999998,"d":"-71"},null,null,{"v":16.299999999999983,"d":"16"},{"v":-16.299999999999983,"d":"-16"},null,null,{"v":64.49999999999999,"d":"65"},{"v":-64.49999999999999,"d":"-65"},null,null,{"v":75.89999999999998,"d":"76"},{"v":-75.89999999999998,"d":"-76"},null,null,{"v":78.89999999999998,"d":"79"},{"v":-78.89999999999998,"d":"-79"},null,null,{"v":145.09999999999997,"d":"145"},{"v":-145.09999999999997,"d":"-145"}]
[{"$nulls":39},0,{"v":1.2650000000000006,"d":"1"},null,null,0,{"v":0.5150000000000006,"d":"1"},null,null,{"v":0.17499999999999893,"d":"0"},{"v":-0.17499999999999893,"d":"-0"},null,null,{"v":0.8049999999999997,"d":"1"},{"v":-0.8049999999999997,"d":"-1"},null,null,{"v":1.4049999999999994,"d":"1"},{"v":-1.4049999999999994,"d":"-1"},null,null,{"v":2.6949999999999994,"d":"3"},{"v":-2.6949999999999994,"d":"-3"}]
[]
["Jour",{"$nulls":8},"Date",null,"Nbre de #"]
["Mercredi",{"$nulls":8},"2019-06-19",null,15]
["Jeudi",{"$nulls":8},"2019-06-20",null,50]
["Vendredi",{"$nulls":8},"2019-06-21",null,50]
["Samedi (=Ven + Sam)",{"$nulls":8},"2019-06-22",null,91]
["Lundi",{"$nulls":8},"2019-06-24",null,43]
["Mardi",{"$nulls":8},"2019-06-25",null,50]
["Mercredi",{"$nulls":8},"2019-06-26",null,46]
["Jeudi",{"$nulls":8},"2019-06-27",null,42]
["Vendredi",{"$nulls":8},"2019-06-28",null,40]
["Samedi (=Ven + Sam)",{"$nulls":8},"2019-06-29",null,86]
{"$rows_empty":17}
[{"$nulls":37},{"$f":"AL7","v":"00:00:00"},{"$nulls":3},{"$f":"AP7","v":"00:00:00"},{"$nulls":3},{"$f":"AT7","v":"00:00:00"},{"$nulls":3},{"$f":"AX7","v":"00:00:00"},{"$nulls":3},{"$f":"BB7","v":"00:00:00"},{"$nulls":3},{"$f":"BF7","v":"00:00:00"},{"$nulls":3},{"$f":"BJ7","v":"00:00:00"},{"$nulls":3},{"$f":"BN7","v":"00:00:00"},"00:00:00","00:00:00","00:00:00","00:00:00","00:00:00"]
[]
[]
["Commande de linge"]
[{"$f":"TODAY()","v":"2019-06-25"}]
[{"$f":"CONCATENATE(A74&\" \",TEXT(A75,\"JJMMAA\"),\" \")","v":"Commande de linge 250619 "}]

{"sheet":"Feuil8","index":9,"n_rows":15,"n_cols":10,"rows_kept":15,"hidden":true}
[]
["Coché","Coché","Coché"]
[]
[]
[{"$nulls":6},"COMMANDE DE LINGE"]
[]
[]
[]
[]
[{"$nulls":9},{"$f":"Feuil1!I4","v":"X"}]
[{"$nulls":9},{"$f":"Feuil1!I5","v":0}]
[{"$nulls":9},{"$f":"Feuil1!I6","v":0}]
[{"$nulls":9},{"$f":"Feuil1!I7","v":0}]
[{"$nulls":9},{"$f":"Feuil1!I8","v":0}]
[{"$nulls":9},{"$f":"Feuil1!I9","v":0}]

{"sheet":"Feuil1","index":10,"n_rows":9,"n_cols":9,"rows_kept":9,"hidden":true}
[{"$f":"X!H7","v":"X"},{"$f":"'Com Annule et remplace'!H1","v":0},{"$f":"'Com 1'!H1","v":0},{"$f":"'Com 2'!H1","v":0},{"$f":"'Com 3'!H1","v":0},{"$f":"'Com 4'!H1","v":0}]
["Non Coché","Non Coché","Non Coché","Coché","Coché","Non Coché"]
[]
[{"$nulls":8},{"$f":"X!H7","v":"X"}]
[{"$nulls":8},{"$f":"'Com Annule et remplace'!H1","v":0}]
[{"$nulls":8},{"$f":"'Com 1'!H1","v":0}]
[{"$nulls":8},{"$f":"'Com 2'!H1","v":0}]
[{"$nulls":8},{"$f":"'Com 3'!H1","v":0}]
[{"$nulls":8},{"$f":"'Com 4'!H1","v":0}]

{"sheet":"X","index":11,"n_rows":7,"n_cols":8,"rows_kept":7,"hidden":true}
[]
[]
[]
[null,null,"toto"]
[]
[]
[{"$nulls":7},{"$f":"MID(CELL(\"nomfichier\",A1),FIND(\"]\",CELL(\"nomfichier\",A1),1)+1,30)","v":"X"}]