{"text_format":"3","workbook":"xlsx","n_sheets":3,"sheets":["bdd","Menu","Planning"],"not_rendered":{"macros":1},"read":"whole","date_system":"1900"}

{"sheet":"bdd","index":0,"n_rows":843,"n_cols":10,"rows_kept":843}
["Nom","Prénom","Heures de base","Heures à récupérer","Heure à réaliser","Jour de repos 1","Jour de repos 1","Jour de repos 2 ","Adresse mail","Semaine paire ou impaire"]
["Morel","Léae",35,null,{"$f":"C2-D2","v":35},{"$f":"IF(E2>35,\"\",G2)","v":"Lundi"},"Lundi","Dimanche","\"@gmail.com\"","Paire"]
["Moragues","Maxime",48,null,{"$f":"C3-D3","v":48},"","Lundi","Dimanche","\"@gmail.com\"","Impaire"]
["Morel","Léo",48,6,42,"","Jeudi","Dimanche","\"@gmail.com\"","Paire"]
["Seimandoi","Christiner",38,null,38,{"$f":"IF(E5>35,\"\",G5)","v":""},"Mardi","Dimanche","\"@gmail.com\"","Impaire"]
["Santier","Laurie",35,null,35,"Mardi","Mardi","Dimanche","\"@gmail.com\"","Paire"]
["gatto","Pierre",38,13,25,"Samedi","Samedi","Dimanche","\"@gmail.com\"","Impaire"]
["Merriene","Chantaler",36,null,36,"","Dimanche","Dimanche","\"@gmail.com\"","Paire"]
["Marrec","Michael",35,null,35,"Lundi","Lundi","Dimanche","\"@gmail.com\"","Impaire"]
["dupond","Jéorme",35,null,35,"Mardi","Mardi","Dimanche","\"@gmail.com\"","Paire"]
["Lecoufflard","Sandra",35,null,35,"Mercredi","Mercredi","Dimanche","\"@gmail.com\"","Impaire"]
["Michel","Alexandre",35,null,35,"Jeudi","Jeudi","Dimanche","\"@gmail.com\"","Paire"]
["Melloucci","Maude",35,null,35,"Vendredi","Vendredi","Dimanche","\"@gmail.com\"","Impaire"]
["Fanion","Erwan",35,6,29,"Jeudi","Jeudi","Dimanche","\"@gmail.com\"","Paire"]
["Gérard","Alice",35,null,35,"Vendredi","Vendredi","Dimanche","\"@gmail.com\"","Impaire"]
["Giacomuzzi","Séverine",35,null,35,"Samedi","Samedi","Dimanche","\"@gmail.com\"","Paire"]
["Hocine","Annelle",35,null,35,{"$f":"IF(E17>35,\"\",G17)","v":"Jeudi"},"Jeudi","Dimanche","\"@gmail.com\"","Impaire"]
["Conan","Aurélie",35,null,35,"Lundi","Lundi","Dimanche","\"@gmail.com\"","Paire"]
["Hupé","Alexis",35,2,33,"Mardi","Mardi","Dimanche","\"@gmail.com\"","Impaire"]
["Aubry","Franck",35,null,35,"Mercredi","Mercredi","Dimanche","\"@gmail.com\"","Paire"]
["Médard","Sébsstien",35,12,23,{"$f":"IF(E21>35,\"\",G21)","v":"Jeudi"},"Jeudi","Dimanche","\"@gmail.com\"","Impaire"]
["Barrat","Leaticia",35,2,33,{"$f":"IF(E22>35,\"\",G22)","v":"Vendredi"},"Vendredi","Dimanche","\"@gmail.com\"","Paire"]
["Merrienne","Chantale",39,null,39,{"$f":"IF(E23>35,\"\",G23)","v":""},"Mercredi","Dimanche","\"@gmail.com\"","Impaire"]
["Michel","Tanguy",35,null,{"$f":"IF((C24-D24)=0,\"\",C24-D24)","v":35},"Samedi","Samedi","Dimanche","\"@gmail.com\"","Paire"]
["Michel","Justine ",35,null,{"$f":"IF((C25-D25)=0,\"\",C25-D25)","v":35},"Mercredi","Mercredi","Dimanche","\"@gmail.com\"","Impaire"]
["moragues","maxime",35,null,{"$f":"IF((C26-D26)=0,\"\",C26-D26)","v":35},"Lundi","Lundi","Dimanche","\"@gmail.com\"","Paire"]
["Michel","Justine",35,null,{"$f":"IF((C27-D27)=0,\"\",C27-D27)","v":35},{"$f":"IF(E27>35,\"\",G27)","v":"Mercredi"},"Mercredi","Dimanche","\"@gmail.com\"","Impaire"]
["Santier","Tanguy",35,null,35,"Samedi","Samedi","Dimanche","\"@gmail.com\"","Paire"]
["Santier","Tanguy",35,null,35,"Samedi","Samedi","Dimanche","\"@gmail.com\"","Paire"]
["Santier","Tanguy",35,null,35,"Samedi","Samedi","Dimanche","\"@gmail.com\"","Impaire"]
["bite","byeu",25,null,{"$f":"IF((C31-D31)=0,\"\",C31-D31)","v":25},{"$f":"IF(E31>35,\"\",G31)","v":"Jeudi"},"Jeudi","Dimanche","\"@gmail.com\"","Impaire"]
[{"$nulls":4},{"$f":"IF((C32-D32)=0,\"\",C32-D32)","v":""},""]
[{"$nulls":4},"",""]
[{"$nulls":4},"",""]
[{"$nulls":4},"",""]
[{"$nulls":4},"",""]
[{"$nulls":4},"",""]
[{"$nulls":4},"",""]
[{"$nulls":4},"",""]
[{"$nulls":4},"",""]
[{"$nulls":4},"",""]
[{"$nulls":4},"",""]
[{"$nulls":4},"",""]
[{"$nulls":4},"",""]
[{"$nulls":4},"",""]
[{"$nulls":4},"",""]
[{"$nulls":4},"",""]
[{"$nulls":4},"",""]
[{"$nulls":4},"",{"$f":"IF(E49>35,\"\",G49)","v":""}]
[{"$nulls":4},"",""]
[{"$nulls":4},"",""]
[{"$nulls":4},"",""]
[{"$nulls":4},"",""]
[{"$nulls":4},"",""]
[{"$nulls":4},"",""]
[{"$nulls":4},"",""]
[{"$nulls":4},"",""]
[{"$nulls":4},"",""]
[{"$nulls":4},"",""]
[{"$nulls":4},"",""]
[{"$nulls":4},"",""]
[{"$nulls":4},"",""]
[{"$nulls":4},"",""]
[{"$nulls":4},"",""]
[{"$nulls":4},"",""]
[{"$nulls":4},"",""]
[{"$nulls":4},"",""]
[{"$nulls":4},"",""]
[{"$nulls":4},"",""]
[{"$nulls":4},"",""]
[{"$nulls":4},"",""]
[{"$nulls":4},{"$f":"IF((C72-D72)=0,\"\",C72-D72)","v":""},""]
[{"$nulls":4},"",""]
[{"$nulls":4},"",""]
[{"$nulls":4},"",""]
[{"$nulls":4},"",""]
[{"$nulls":4},"",""]
[{"$nulls":4},"",""]
[{"$nulls":4},"",""]
[{"$nulls":4},"",""]
[{"$nulls":4},"",""]
[{"$nulls":4},"",""]
[{"$nulls":4},"",""]
[{"$nulls":4},"",""]
[{"$nulls":4},"",""]
[{"$nulls":4},"",""]
[{"$nulls":4},"",""]
[{"$nulls":4},"",""]
[{"$nulls":4},"",""]
[{"$nulls":4},"",""]
[{"$nulls":4},"",""]
[{"$nulls":4},"",""]
[{"$nulls":4},"",""]
[{"$nulls":4},"",""]
[{"$nulls":4},"",""]
[{"$nulls":4},"",""]
[{"$nulls":4},"",""]
[{"$nulls":4},"",""]
[{"$nulls":4},"",""]
[{"$nulls":4},"",""]
[{"$nulls":4},"",""]
[{"$nulls":4},"",""]
[{"$nulls":4},"",""]
[{"$nulls":4},"",""]
[{"$nulls":4},"",""]
[{"$nulls":4},"",""]
[{"$nulls":4},"",""]
[{"$nulls":4},"",""]
[{"$nulls":4},"",""]
[{"$nulls":4},"",""]
[{"$nulls":4},"",""]
[{"$nulls":4},"",""]
[{"$nulls":4},"",{"$f":"IF(E113>35,\"\",G113)","v":""}]
[{"$nulls":4},"",""]
[{"$nulls":4},"",""]
[{"$nulls":4},"",""]
[{"$nulls":4},"",""]
[{"$nulls":4},"",""]
[{"$nulls":4},"",""]
[{"$nulls":4},"",""]
[{"$nulls":4},"",""]
[{"$nulls":4},"",""]
[{"$nulls":4},"",""]
[{"$nulls":4},"",""]
[{"$nulls":4},"",""]
[{"$nulls":4},"",""]
[{"$nulls":4},"",""]
[{"$nulls":4},"",""]
[{"$nulls":4},"",""]
[{"$nulls":4},"",""]
[{"$nulls":4},"",""]
[{"$nulls":4},"",""]
[{"$nulls":4},"",""]
[{"$nulls":4},"",""]
[{"$nulls":4},"",""]
[{"$nulls":4},{"$f":"IF((C136-D136)=0,\"\",C136-D136)","v":""},""]
[{"$nulls":4},"",""]
[{"$nulls":4},"",""]
[{"$nulls":4},"",""]
[{"$nulls":4},"",""]
[{"$nulls":4},"",""]
[{"$nulls":4},"",""]
[{"$nulls":4},"",""]
[{"$nulls":4},"",""]
[{"$nulls":4},"",""]
[{"$nulls":4},"",""]
[{"$nulls":4},"",""]
[{"$nulls":4},"",""]
[{"$nulls":4},"",""]
[{"$nulls":4},"",""]
[{"$nulls":4},"",""]
[{"$nulls":4},"",""]
[{"$nulls":4},"",""]
[{"$nulls":4},"",""]
[{"$nulls":4},"",""]
[{"$nulls":4},"",""]
[{"$nulls":4},"",""]
[{"$nulls":4},"",""]
[{"$nulls":4},"",""]
[{"$nulls":4},"",""]
[{"$nulls":4},"",""]
[{"$nulls":4},"",""]
[{"$nulls":4},"",""]
[{"$nulls":4},"",""]
[{"$nulls":4},"",""]
[{"$nulls":4},"",""]
[{"$nulls":4},"",""]
[{"$nulls":4},"",""]
[{"$nulls":4},"",""]
[{"$nulls":4},"",""]
[{"$nulls":4},"",""]
[{"$nulls":4},"",""]
[{"$nulls":4},"",""]
[{"$nulls":4},"",""]
[{"$nulls":4},"",""]
[{"$nulls":4},"",""]
[{"$nulls":4},"",{"$f":"IF(E177>35,\"\",G177)","v":""}]
[{"$nulls":4},"",""]
[{"$nulls":4},"",""]
[{"$nulls":4},"",""]
[{"$nulls":4},"",""]
[{"$nulls":4},"",""]
[{"$nulls":4},"",""]
[{"$nulls":4},"",""]
[{"$nulls":4},"",""]
[{"$nulls":4},"",""]
[{"$nulls":4},"",""]
[{"$nulls":4},"",""]
[{"$nulls":4},"",""]
[{"$nulls":4},"",""]
[{"$nulls":4},"",""]
[{"$nulls":4},"",""]
[{"$nulls":4},"",""]
[{"$nulls":4},"",""]
[{"$nulls":4},"",""]
[{"$nulls":4},"",""]
[{"$nulls":4},"",""]
[{"$nulls":4},"",""]
[{"$nulls":4},"",""]
[{"$nulls":4},{"$f":"IF((C200-D200)=0,\"\",C200-D200)","v":""},""]
[{"$nulls":4},"",""]
[{"$nulls":4},"",""]
[{"$nulls":4},"",""]
[{"$nulls":4},"",""]
[{"$nulls":4},"",""]
[{"$nulls":4},"",""]
[{"$nulls":4},"",""]
[{"$nulls":4},"",""]
[{"$nulls":4},"",""]
[{"$nulls":4},"",""]
[{"$nulls":4},"",""]
[{"$nulls":4},"",""]
[{"$nulls":4},"",""]
[{"$nulls":4},"",""]
[{"$nulls":4},"",""]
[{"$nulls":4},"",""]
[{"$nulls":4},"",""]
[{"$nulls":4},"",""]
[{"$nulls":4},"",""]
[{"$nulls":4},"",""]
[{"$nulls":4},"",""]
[{"$nulls":4},"",""]
[{"$nulls":4},"",""]
[{"$nulls":4},"",""]
[{"$nulls":4},"",""]
[{"$nulls":4},"",""]
[{"$nulls":4},"",""]
[{"$nulls":4},"",""]
[{"$nulls":4},"",""]
[{"$nulls":4},"",""]
[{"$nulls":4},"",""]
[{"$nulls":4},"",""]
[{"$nulls":4},"",""]
[{"$nulls":4},"",""]
[{"$nulls":4},"",""]
[{"$nulls":4},"",""]
[{"$nulls":4},"",""]
[{"$nulls":4},"",""]
[{"$nulls":4},"",""]
[{"$nulls":4},"",""]
[{"$nulls":4},"",{"$f":"IF(E241>35,\"\",G241)","v":""}]
[{"$nulls":4},"",""]
[{"$nulls":4},"",""]
[{"$nulls":4},"",""]
[{"$nulls":4},"",""]
[{"$nulls":4},"",""]
[{"$nulls":4},"",""]
[{"$nulls":4},"",""]
[{"$nulls":4},"",""]
[{"$nulls":4},"",""]
[{"$nulls":4},"",""]
[{"$nulls":4},"",""]
[{"$nulls":4},"",""]
[{"$nulls":4},"",""]
[{"$nulls":4},"",""]
[{"$nulls":4},"",""]
[{"$nulls":4},"",""]
[{"$nulls":4},"",""]
[{"$nulls":4},"",""]
[{"$nulls":4},"",""]
[{"$nulls":4},"",""]
[{"$nulls":4},"",""]
[{"$nulls":4},"",""]
[{"$nulls":4},{"$f":"IF((C264-D264)=0,\"\",C264-D264)","v":""},""]
[{"$nulls":4},"",""]
[{"$nulls":4},"",""]
[{"$nulls":4},"",""]
[{"$nulls":4},"",""]
[{"$nulls":4},"",""]
[{"$nulls":4},"",""]
[{"$nulls":4},"",""]
[{"$nulls":4},"",""]
[{"$nulls":4},"",""]
[{"$nulls":4},"",""]
[{"$nulls":4},"",""]
[{"$nulls":4},"",""]
[{"$nulls":4},"",""]
[{"$nulls":4},"",""]
[{"$nulls":4},"",""]
[{"$nulls":4},"",""]
[{"$nulls":4},"",""]
[{"$nulls":4},"",""]
[{"$nulls":4},"",""]
[{"$nulls":4},"",""]
[{"$nulls":4},"",""]
[{"$nulls":4},"",""]
[{"$nulls":4},"",""]
[{"$nulls":4},"",""]
[{"$nulls":4},"",""]
[{"$nulls":4},"",""]
[{"$nulls":4},"",""]
[{"$nulls":4},"",""]
[{"$nulls":4},"",""]
[{"$nulls":4},"",""]
[{"$nulls":4},"",""]
[{"$nulls":4},"",""]
[{"$nulls":4},"",""]
[{"$nulls":4},"",""]
[{"$nulls":4},"",""]
[{"$nulls":4},"",""]
[{"$nulls":4},"",""]
[{"$nulls":4},"",""]
[{"$nulls":4},"",""]
[{"$nulls":4},"",""]
[{"$nulls":4},"",{"$f":"IF(E305>35,\"\",G305)","v":""}]
[{"$nulls":4},"",""]
[{"$nulls":4},"",""]
[{"$nulls":4},"",""]
[{"$nulls":4},"",""]
[{"$nulls":4},"",""]
[{"$nulls":4},"",""]
[{"$nulls":4},"",""]
[{"$nulls":4},"",""]
[{"$nulls":4},"",""]
[{"$nulls":4},"",""]
[{"$nulls":4},"",""]
[{"$nulls":4},"",""]
[{"$nulls":4},"",""]
[{"$nulls":4},"",""]
[{"$nulls":4},"",""]
[{"$nulls":4},"",""]
[{"$nulls":4},"",""]
[{"$nulls":4},"",""]
[{"$nulls":4},"",""]
[{"$nulls":4},"",""]
[{"$nulls":4},"",""]
[{"$nulls":4},"",""]
[{"$nulls":4},{"$f":"IF((C328-D328)=0,\"\",C328-D328)","v":""},""]
[{"$nulls":4},"",""]
[{"$nulls":4},"",""]
[{"$nulls":4},"",""]
[{"$nulls":4},"",""]
[{"$nulls":4},"",""]
[{"$nulls":4},"",""]
[{"$nulls":4},"",""]
[{"$nulls":4},"",""]
[{"$nulls":4},"",""]
[{"$nulls":4},"",""]
[{"$nulls":4},"",""]
[{"$nulls":4},"",""]
[{"$nulls":4},"",""]
[{"$nulls":4},"",""]
[{"$nulls":4},"",""]
[{"$nulls":4},"",""]
[{"$nulls":4},"",""]
[{"$nulls":4},"",""]
[{"$nulls":4},"",""]
[{"$nulls":4},"",""]
[{"$nulls":4},"",""]
[{"$nulls":4},"",""]
[{"$nulls":4},"",""]
[{"$nulls":4},"",""]
[{"$nulls":4},"",""]
[{"$nulls":4},"",""]
[{"$nulls":4},"",""]
[{"$nulls":4},"",""]
[{"$nulls":4},"",""]
[{"$nulls":4},"",""]
[{"$nulls":4},"",""]
[{"$nulls":4},"",""]
[{"$nulls":4},"",""]
[{"$nulls":4},"",""]
[{"$nulls":4},"",""]
[{"$nulls":4},"",""]
[{"$nulls":4},"",""]
[{"$nulls":4},"",""]
[{"$nulls":4},"",""]
[{"$nulls":4},"",""]
[{"$nulls":4},"",{"$f":"IF(E369>35,\"\",G369)","v":""}]
[{"$nulls":4},"",""]
[{"$nulls":4},"",""]
[{"$nulls":4},"",""]
[{"$nulls":4},"",""]
[{"$nulls":4},"",""]
[{"$nulls":4},"",""]
[{"$nulls":4},"",""]
[{"$nulls":4},"",""]
[{"$nulls":4},"",""]
[{"$nulls":4},"",""]
[{"$nulls":4},"",""]
[{"$nulls":4},"",""]
[{"$nulls":4},"",""]
[{"$nulls":4},"",""]
[{"$nulls":4},"",""]
[{"$nulls":4},"",""]
[{"$nulls":4},"",""]
[{"$nulls":4},"",""]
[{"$nulls":4},"",""]
[{"$nulls":4},"",""]
[{"$nulls":4},"",""]
[{"$nulls":4},"",""]
[{"$nulls":4},{"$f":"IF((C392-D392)=0,\"\",C392-D392)","v":""},""]
[{"$nulls":4},"",""]
[{"$nulls":4},"",""]
[{"$nulls":4},"",""]
[{"$nulls":4},"",""]
[{"$nulls":4},"",""]
[{"$nulls":4},"",""]
[{"$nulls":4},"",""]
[{"$nulls":4},"",""]
{"$rows_left_out":444}
{"sheet":"Menu","index":1,"n_rows":45,"n_cols":13,"rows_kept":45}
[]
[null,"Jour de la semaine",null,"Index","Heure de début","Heure de fin","Heure travaillé",null,null,"Semaine Paire ou Impaire"]
[null,"Lundi",null,1,6,9,{"$f":"F3-E3","v":3},null,null,"Paire","Matin"]
[null,"Mardi",null,2,6,10,{"$f":"F4-E4","v":4},null,null,"Impaire","Aprem"]
[null,"Mercredi",null,3,6,11,5]
[null,"Jeudi",null,4,6,12,6]
[null,"Vendredi",null,5,6,13,7]
[null,"Samedi",null,6,6,14,8]
[null,"Dimanche",null,7,12,20,8]
[{"$nulls":3},8,13,20,{"$f":"F10-E10","v":7}]
[{"$nulls":3},9,14,20,{"$f":"F11-E11","v":6}]
[{"$nulls":3},10,15,20,{"$f":"F12-E12","v":5}]
[{"$nulls":3},11,16,20,{"$f":"F13-E13","v":4}]
[{"$nulls":3},12,17,20,{"$f":"F14-E14","v":3}]
[]
[]
[]
[]
[null,"heure a réalisé","Jour travaillé","5 jour ","Heure par jour des 5 jours","Heure pour dernier jour semaine",null,"heure a réalisé","Jour travaillé",null,"4 jour","Heure par jour des 4 jours","Heure pour dernier jour semaine"]
[1,48,6,{"$f":"(C20-1)*G8","v":40},{"$f":"D20/5","v":8},{"$f":"B20-D20","v":8},null,35,5,{"$f":"H20/I20","v":7},{"$f":"(I20-1)*$G$7","v":28},{"$f":"K20/4","v":7},{"$f":"H20-K20","v":7}]
[2,47,6,{"$f":"(C21-1)*$G$8","v":40},{"$f":"D21/5","v":8},7,null,34,5,6.8,{"$f":"(I21-1)*$G$7","v":28},{"$f":"K21/4","v":7},{"$f":"H21-K21","v":6}]
[3,46,6,{"$f":"(C22-1)*$G$8","v":40},8,6,null,33,5,6.6,28,7,5]
[4,45,6,{"$f":"(C23-1)*$G$8","v":40},8,5,null,32,5,6.4,{"$f":"(I23-1)*$G$6","v":24},6,8]
[5,44,6,{"$f":"(C24-1)*$G$8","v":40},8,4,null,31,5,6.2,{"$f":"(I24-1)*$G$6","v":24},6,7]
[6,43,6,{"$f":"(C25-1)*$G$7","v":35},7,8,null,30,5,6,{"$f":"(I25-1)*$G$6","v":24},6,6]
[7,42,6,{"$f":"(C26-1)*$G$7","v":35},7,7,null,29,5,5.8,{"$f":"(I26-1)*$G$6","v":24},6,5]
[8,41,6,{"$f":"(C27-1)*$G$7","v":35},7,6,null,28,5,5.6,{"$f":"(I27-1)*$G$6","v":24},6,4]
[9,40,6,{"$f":"(C28-1)*$G$7","v":35},7,5,null,27,5,{"$f":"H28/I28","v":5.4},{"$f":"(I28-1)*$G$5","v":20},5,{"$f":"H28-K28","v":7}]
[10,39,6,{"$f":"(C29-1)*$G$7","v":35},7,4,null,26,5,5.2,{"$f":"(I29-1)*$G$5","v":20},5,6]
[11,38,6,{"$f":"(C30-1)*$G$6","v":30},6,8,null,25,5,5,{"$f":"(I30-1)*$G$5","v":20},5,5]
[12,37,6,{"$f":"(C31-1)*$G$6","v":30},6,7,null,24,5,4.8,{"$f":"(I31-1)*$G$5","v":20},5,4]
[13,36,6,{"$f":"(C32-1)*$G$6","v":30},6,6,null,23,5,4.6,{"$f":"(I32-1)*$G$5","v":20},{"$f":"K32/4","v":5},3]
[14,35,5,{"$f":"(C33-1)*$G$7","v":28},{"$f":"D33/4","v":7},7]
[15,34,5,{"$f":"(C34-1)*$G$7","v":28},{"$f":"D34/4","v":7},6]
[16,33,5,{"$f":"(C35-1)*$G$7","v":28},7,5]
[17,32,5,{"$f":"(C36-1)*$G$6","v":24},6,8]
[18,31,5,{"$f":"(C37-1)*$G$6","v":24},6,7]
[19,30,5,{"$f":"(C38-1)*$G$6","v":24},6,6,null,{"$f":"INDEX(B20:F45,MATCH(bdd!C2,Menu!B20:B45,0),2)","v":5}]
[20,29,5,{"$f":"(C39-1)*$G$6","v":24},6,5,null,{"$f":"H3","v":0}]
[21,28,5,{"$f":"(C40-1)*$G$6","v":24},6,4]
[22,27,5,{"$f":"(C41-1)*$G$5","v":20},5,7]
[23,26,5,{"$f":"(C42-1)*$G$5","v":20},5,6]
[24,25,5,{"$f":"(C43-1)*$G$5","v":20},5,5,null,{"$f":"INDEX(A20:F45,MATCH(bdd!C2,Menu!B20:B45,0),1)","v":14}]
[25,24,5,{"$f":"(C44-1)*$G$5","v":20},5,4]
[26,23,5,{"$f":"(C45-1)*$G$5","v":20},{"$f":"D45/4","v":5},3]

{"sheet":"Planning","index":2,"n_rows":31,"n_cols":12,"rows_kept":31}
["Nom ","Prénom",null,"Lundi","Mardi","Mercredi","Jeudi","Vendredi","Samedi"]
["Morel","Léae",{"$f":"INDEX(Menu!$B$20:$F$45,MATCH(bdd!C2,Menu!$B$20:$B$45,0),2)","v":5}]
["Moragues","Maxime",{"$f":"INDEX(Menu!$B$20:$F$45,MATCH(bdd!C3,Menu!$B$20:$B$45,0),2)","v":6}]
["Morel","Léo",{"$f":"INDEX(Menu!$B$20:$F$45,MATCH(bdd!C4,Menu!$B$20:$B$45,0),2)","v":6}]
["Seimandoi","Christiner",{"$f":"INDEX(Menu!$B$20:$F$45,MATCH(bdd!C5,Menu!$B$20:$B$45,0),2)","v":6}]
["Santier","Laurie",{"$f":"INDEX(Menu!$B$20:$F$45,MATCH(bdd!C6,Menu!$B$20:$B$45,0),2)","v":5}]
["gatto","Pierre",{"$f":"INDEX(Menu!$B$20:$F$45,MATCH(bdd!C7,Menu!$B$20:$B$45,0),2)","v":6},{"$nulls":8},{"$f":"Menu!E4&\"h\"&\" \"&\"-\"&\" \"&Menu!F4&\"h\"","v":"6h - 10h"}]
["Merriene","Chantaler",{"$f":"INDEX(Menu!$B$20:$F$45,MATCH(bdd!C8,Menu!$B$20:$B$45,0),2)","v":6}]
["Marrec","Michael",{"$f":"INDEX(Menu!$B$20:$F$45,MATCH(bdd!C9,Menu!$B$20:$B$45,0),2)","v":5}]
["dupond","Jéorme",{"$f":"INDEX(Menu!$B$20:$F$45,MATCH(bdd!C10,Menu!$B$20:$B$45,0),2)","v":5}]
["Lecoufflard","Sandra",{"$f":"INDEX(Menu!$B$20:$F$45,MATCH(bdd!C11,Menu!$B$20:$B$45,0),2)","v":5},{"$nulls":7},{"$f":"(IF($C2=5,HLOOKUP(bdd!$F2,Planning!$D$1:$I$1,1,FALSE),))","v":"Lundi"}]
["Michel","Alexandre",{"$f":"INDEX(Menu!$B$20:$F$45,MATCH(bdd!C12,Menu!$B$20:$B$45,0),2)","v":5}]
["Melloucci","Maude",{"$f":"INDEX(Menu!$B$20:$F$45,MATCH(bdd!C13,Menu!$B$20:$B$45,0),2)","v":5}]
["Fanion","Erwan",{"$f":"INDEX(Menu!$B$20:$F$45,MATCH(bdd!C14,Menu!$B$20:$B$45,0),2)","v":5}]
["Gérard","Alice",{"$f":"INDEX(Menu!$B$20:$F$45,MATCH(bdd!C15,Menu!$B$20:$B$45,0),2)","v":5}]
["Giacomuzzi","Séverine",{"$f":"INDEX(Menu!$B$20:$F$45,MATCH(bdd!C16,Menu!$B$20:$B$45,0),2)","v":5}]
["Hocine","Annelle",{"$f":"INDEX(Menu!$B$20:$F$45,MATCH(bdd!C17,Menu!$B$20:$B$45,0),2)","v":5}]
["Conan","Aurélie",{"$f":"INDEX(Menu!$B$20:$F$45,MATCH(bdd!C18,Menu!$B$20:$B$45,0),2)","v":5}]
["Hupé","Alexis",{"$f":"INDEX(Menu!$B$20:$F$45,MATCH(bdd!C19,Menu!$B$20:$B$45,0),2)","v":5}]
["Aubry","Franck",{"$f":"INDEX(Menu!$B$20:$F$45,MATCH(bdd!C20,Menu!$B$20:$B$45,0),2)","v":5}]
["Médard","Sébsstien",{"$f":"INDEX(Menu!$B$20:$F$45,MATCH(bdd!C21,Menu!$B$20:$B$45,0),2)","v":5}]
["Barrat","Leaticia",{"$f":"INDEX(Menu!$B$20:$F$45,MATCH(bdd!C22,Menu!$B$20:$B$45,0),2)","v":5}]
["Merrienne","Chantale",{"$f":"INDEX(Menu!$B$20:$F$45,MATCH(bdd!C23,Menu!$B$20:$B$45,0),2)","v":6}]
["Michel","Tanguy",{"$f":"INDEX(Menu!$B$20:$F$45,MATCH(bdd!C24,Menu!$B$20:$B$45,0),2)","v":5}]
["Michel","Justine ",{"$f":"INDEX(Menu!$B$20:$F$45,MATCH(bdd!C25,Menu!$B$20:$B$45,0),2)","v":5}]
["moragues","maxime",{"$f":"INDEX(Menu!$B$20:$F$45,MATCH(bdd!C26,Menu!$B$20:$B$45,0),2)","v":5}]
["Michel","Justine",{"$f":"INDEX(Menu!$B$20:$F$45,MATCH(bdd!C27,Menu!$B$20:$B$45,0),2)","v":5}]
["Santier","Tanguy",{"$f":"INDEX(Menu!$B$20:$F$45,MATCH(bdd!C28,Menu!$B$20:$B$45,0),2)","v":5}]
["Santier","Tanguy",{"$f":"INDEX(Menu!$B$20:$F$45,MATCH(bdd!C29,Menu!$B$20:$B$45,0),2)","v":5}]
["Santier","Tanguy",{"$f":"INDEX(Menu!$B$20:$F$45,MATCH(bdd!C30,Menu!$B$20:$B$45,0),2)","v":5}]
["bite","byeu",{"$f":"INDEX(Menu!$B$20:$F$45,MATCH(bdd!C31,Menu!$B$20:$B$45,0),2)","v":5}]