{"text_format":"3","workbook":"xlsx","n_sheets":12,"sheets":["Fiche client entrepreneur","Fiche fournisseur","Feuil1","Lists","Data","FR","NL","EN","Pays","Cond.paiement","Groupes d'acheteurs","Demandeurs"],"not_rendered":{"images":4,"macros":1,"defined_names":8,"comments":1},"read":"whole","date_system":"1900"}

{"sheet":"Fiche client entrepreneur","index":0,"n_rows":36,"n_cols":28,"rows_kept":36,"hidden":true,"merged":[[1,27,1,28],[5,3,5,28],[7,3,7,28],[9,3,9,25],[9,27,9,28],[12,3,12,25],[12,27,12,28],[14,3,14,18],[14,20,14,25],[14,27,14,28],[16,3,16,28],[18,3,18,15],[18,17,18,28],[20,3,20,28],[23,3,23,28],[25,3,25,23],[25,25,25,28],[27,3,33,28],[36,3,45,28]]}
[]
[{"$f":"IF(ISBLANK($AB$2),\"- - -\",IF('Fiche client entrepreneur'!$AB$2=\"FR\",INDEX(Data!A:E,MATCH(1,Data!A:A,0),2),IF('Fiche client entrepreneur'!$AB$2=\"NL\",INDEX(Data!A:E,MATCH(1,Data!A:A,0),3),IF('Fiche client entrepreneur'!$AB$2=\"DE\",INDEX(Data!A:E,MATCH(1,Data!A:A,0),4),IF('Fiche client entrepreneur'!$AB$2=\"EN\",INDEX(Data!A:E,MATCH(1,Data!A:A,0),5),\"Langue?\")))))","v":"INFORMATIONS CLIENT"},{"$nulls":26},"FR"]
[{"$f":"IF(ISBLANK($AB$2),\"- - -\",IF('Fiche client entrepreneur'!$AB$2=\"FR\",INDEX(Data!A:E,MATCH(2,Data!A:A,0),2),IF('Fiche client entrepreneur'!$AB$2=\"NL\",INDEX(Data!A:E,MATCH(2,Data!A:A,0),3),IF('Fiche client entrepreneur'!$AB$2=\"DE\",INDEX(Data!A:E,MATCH(2,Data!A:A,0),4),IF('Fiche client entrepreneur'!$AB$2=\"EN\",INDEX(Data!A:E,MATCH(2,Data!A:A,0),5),\"Langue?\")))))","v":"À remplir par le service commercial"}]
[]
[{"$f":"IF(ISBLANK($AB$2),\"- - -\",IF('Fiche client entrepreneur'!$AB$2=\"FR\",INDEX(Data!A:E,MATCH(57,Data!A:A,0),2),IF('Fiche client entrepreneur'!$AB$2=\"NL\",INDEX(Data!A:E,MATCH(57,Data!A:A,0),3),IF('Fiche client entrepreneur'!$AB$2=\"DE\",INDEX(Data!A:E,MATCH(57,Data!A:A,0),4),IF('Fiche client entrepreneur'!$AB$2=\"EN\",INDEX(Data!A:E,MATCH(57,Data!A:A,0),5),\"Langue?\")))))","v":"Société"}]
[{"$f":"IF(ISBLANK($AB$2),\"- - -\",IF('Fiche client entrepreneur'!$AB$2=\"FR\",INDEX(Data!A:E,MATCH(3,Data!A:A,0),2),IF('Fiche client entrepreneur'!$AB$2=\"NL\",INDEX(Data!A:E,MATCH(3,Data!A:A,0),3),IF('Fiche client entrepreneur'!$AB$2=\"DE\",INDEX(Data!A:E,MATCH(3,Data!A:A,0),4),IF('Fiche client entrepreneur'!$AB$2=\"EN\",INDEX(Data!A:E,MATCH(3,Data!A:A,0),5),\"Langue?\")))))","v":"Demandeur :"}]
[]
[{"$f":"IF(ISBLANK($AB$2),\"- - -\",IF('Fiche client entrepreneur'!$AB$2=\"FR\",INDEX(Data!A:E,MATCH(4,Data!A:A,0),2),IF('Fiche client entrepreneur'!$AB$2=\"NL\",INDEX(Data!A:E,MATCH(4,Data!A:A,0),3),IF('Fiche client entrepreneur'!$AB$2=\"DE\",INDEX(Data!A:E,MATCH(4,Data!A:A,0),4),IF('Fiche client entrepreneur'!$AB$2=\"EN\",INDEX(Data!A:E,MATCH(4,Data!A:A,0),5),\"Langue?\")))))","v":"Délégué commercial :"},null,null,"classés \"PRO\". Affectation selon les règles dérivation."]
[]
[{"$f":"IF(ISBLANK($AB$2),\"- - -\",IF('Fiche client entrepreneur'!$AB$2=\"FR\",INDEX(Data!A:E,MATCH(5,Data!A:A,0),2),IF('Fiche client entrepreneur'!$AB$2=\"NL\",INDEX(Data!A:E,MATCH(5,Data!A:A,0),3),IF('Fiche client entrepreneur'!$AB$2=\"DE\",INDEX(Data!A:E,MATCH(5,Data!A:A,0),4),IF('Fiche client entrepreneur'!$AB$2=\"EN\",INDEX(Data!A:E,MATCH(5,Data!A:A,0),5),\"Langue?\")))))","v":"Nom société+raison sociale/langue :"}]
[]
[{"$f":"IF(ISBLANK($AB$2),\"- - -\",IF('Fiche client entrepreneur'!$AB$2=\"FR\",INDEX(Data!A:E,MATCH(6,Data!A:A,0),2),IF('Fiche client entrepreneur'!$AB$2=\"NL\",INDEX(Data!A:E,MATCH(6,Data!A:A,0),3),IF('Fiche client entrepreneur'!$AB$2=\"DE\",INDEX(Data!A:E,MATCH(6,Data!A:A,0),4),IF('Fiche client entrepreneur'!$AB$2=\"EN\",INDEX(Data!A:E,MATCH(6,Data!A:A,0),5),\"Langue?\")))))","v":"Adresse"}]
[{"$f":"IF(ISBLANK($AB$2),\"- - -\",IF('Fiche client entrepreneur'!$AB$2=\"FR\",INDEX(Data!A:E,MATCH(7,Data!A:A,0),2),IF('Fiche client entrepreneur'!$AB$2=\"NL\",INDEX(Data!A:E,MATCH(7,Data!A:A,0),3),IF('Fiche client entrepreneur'!$AB$2=\"DE\",INDEX(Data!A:E,MATCH(7,Data!A:A,0),4),IF('Fiche client entrepreneur'!$AB$2=\"EN\",INDEX(Data!A:E,MATCH(7,Data!A:A,0),5),\"Langue?\")))))","v":"Rue/no :"}]
[]
[{"$f":"IF(ISBLANK($AB$2),\"- - -\",IF('Fiche client entrepreneur'!$AB$2=\"FR\",INDEX(Data!A:E,MATCH(10,Data!A:A,0),2),IF('Fiche client entrepreneur'!$AB$2=\"NL\",INDEX(Data!A:E,MATCH(10,Data!A:A,0),3),IF('Fiche client entrepreneur'!$AB$2=\"DE\",INDEX(Data!A:E,MATCH(10,Data!A:A,0),4),IF('Fiche client entrepreneur'!$AB$2=\"EN\",INDEX(Data!A:E,MATCH(10,Data!A:A,0),5),\"Langue?\")))))","v":"Ville/CP/Pays :"}]
[]
[{"$f":"IF(ISBLANK($AB$2),\"- - -\",IF('Fiche client entrepreneur'!$AB$2=\"FR\",INDEX(Data!A:E,MATCH(11,Data!A:A,0),2),IF('Fiche client entrepreneur'!$AB$2=\"NL\",INDEX(Data!A:E,MATCH(11,Data!A:A,0),3),IF('Fiche client entrepreneur'!$AB$2=\"DE\",INDEX(Data!A:E,MATCH(11,Data!A:A,0),4),IF('Fiche client entrepreneur'!$AB$2=\"EN\",INDEX(Data!A:E,MATCH(11,Data!A:A,0),5),\"Langue?\")))))","v":"No. de TVA (facultatif) :"}]
[]
[{"$f":"IF(ISBLANK($AB$2),\"- - -\",IF('Fiche client entrepreneur'!$AB$2=\"FR\",INDEX(Data!A:E,MATCH(13,Data!A:A,0),2),IF('Fiche client entrepreneur'!$AB$2=\"NL\",INDEX(Data!A:E,MATCH(13,Data!A:A,0),3),IF('Fiche client entrepreneur'!$AB$2=\"DE\",INDEX(Data!A:E,MATCH(13,Data!A:A,0),4),IF('Fiche client entrepreneur'!$AB$2=\"EN\",INDEX(Data!A:E,MATCH(13,Data!A:A,0),5),\"Langue?\")))))","v":"Téléphone/fax :"}]
[]
[{"$f":"IF(ISBLANK($AB$2),\"- - -\",IF('Fiche client entrepreneur'!$AB$2=\"FR\",INDEX(Data!A:E,MATCH(14,Data!A:A,0),2),IF('Fiche client entrepreneur'!$AB$2=\"NL\",INDEX(Data!A:E,MATCH(14,Data!A:A,0),3),IF('Fiche client entrepreneur'!$AB$2=\"DE\",INDEX(Data!A:E,MATCH(14,Data!A:A,0),4),IF('Fiche client entrepreneur'!$AB$2=\"EN\",INDEX(Data!A:E,MATCH(14,Data!A:A,0),5),\"Langue?\")))))","v":"E-mail :"}]
[]
[{"$f":"IF(ISBLANK($AB$2),\"- - -\",IF('Fiche client entrepreneur'!$AB$2=\"FR\",INDEX(Data!A:E,MATCH(58,Data!A:A,0),2),IF('Fiche client entrepreneur'!$AB$2=\"NL\",INDEX(Data!A:E,MATCH(58,Data!A:A,0),3),IF('Fiche client entrepreneur'!$AB$2=\"DE\",INDEX(Data!A:E,MATCH(58,Data!A:A,0),4),IF('Fiche client entrepreneur'!$AB$2=\"EN\",INDEX(Data!A:E,MATCH(58,Data!A:A,0),5),\"Langue?\")))))","v":"Conditions commerciales"}]
[{"$f":"IF(ISBLANK($AB$2),\"- - -\",IF('Fiche client entrepreneur'!$AB$2=\"FR\",INDEX(Data!A:E,MATCH(19,Data!A:A,0),2),IF('Fiche client entrepreneur'!$AB$2=\"NL\",INDEX(Data!A:E,MATCH(19,Data!A:A,0),3),IF('Fiche client entrepreneur'!$AB$2=\"DE\",INDEX(Data!A:E,MATCH(19,Data!A:A,0),4),IF('Fiche client entrepreneur'!$AB$2=\"EN\",INDEX(Data!A:E,MATCH(19,Data!A:A,0),5),\"Langue?\")))))","v":"Liste de prix SAP (PLTYP) :"}]
[]
[{"$f":"IF(ISBLANK($AB$2),\"- - -\",IF('Fiche client entrepreneur'!$AB$2=\"FR\",INDEX(Data!A:E,MATCH(20,Data!A:A,0),2),IF('Fiche client entrepreneur'!$AB$2=\"NL\",INDEX(Data!A:E,MATCH(20,Data!A:A,0),3),IF('Fiche client entrepreneur'!$AB$2=\"DE\",INDEX(Data!A:E,MATCH(20,Data!A:A,0),4),IF('Fiche client entrepreneur'!$AB$2=\"EN\",INDEX(Data!A:E,MATCH(20,Data!A:A,0),5),\"Langue?\")))))","v":"Payeur (Nom & No. SAP) :"}]
[]
[{"$f":"IF(ISBLANK($AB$2),\"- - -\",IF('Fiche client entrepreneur'!$AB$2=\"FR\",INDEX(Data!A:E,MATCH(21,Data!A:A,0),2),IF('Fiche client entrepreneur'!$AB$2=\"NL\",INDEX(Data!A:E,MATCH(21,Data!A:A,0),3),IF('Fiche client entrepreneur'!$AB$2=\"DE\",INDEX(Data!A:E,MATCH(21,Data!A:A,0),4),IF('Fiche client entrepreneur'!$AB$2=\"EN\",INDEX(Data!A:E,MATCH(21,Data!A:A,0),5),\"Langue?\")))))","v":"Conditions commerciales :"}]
{"$rows_empty":7}
[{"$f":"IF(ISBLANK($AB$2),\"- - -\",IF('Fiche client entrepreneur'!$AB$2=\"FR\",INDEX(Data!A:E,MATCH(22,Data!A:A,0),2),IF('Fiche client entrepreneur'!$AB$2=\"NL\",INDEX(Data!A:E,MATCH(22,Data!A:A,0),3),IF('Fiche client entrepreneur'!$AB$2=\"DE\",INDEX(Data!A:E,MATCH(22,Data!A:A,0),4),IF('Fiche client entrepreneur'!$AB$2=\"EN\",INDEX(Data!A:E,MATCH(22,Data!A:A,0),5),\"Langue?\")))))","v":"Remarques :"}]
{"$rows_left_out":1}
{"sheet":"Fiche fournisseur","index":1,"n_rows":50,"n_cols":28,"rows_kept":50,"merged":[[0,19,0,25],[1,19,1,25],[1,27,1,28],[2,19,2,25],[4,3,4,28],[6,3,6,28],[8,3,8,15],[8,17,8,28],[11,3,11,15],[11,17,11,28],[13,3,13,25],[13,27,13,28],[16,3,16,25],[16,27,16,28],[18,3,18,18],[18,20,18,25],[18,27,18,28],[20,3,20,28],[22,3,22,15],[22,17,22,28],[23,4,23,14],[25,3,25,12],[25,14,25,22],[25,24,25,28],[27,3,27,10],[27,12,27,19],[27,21,27,28],[29,3,29,15],[29,17,29,28],[30,3,30,15],[30,17,30,28],[32,3,32,15],[32,17,32,28],[34,3,34,15],[34,17,34,28],[36,3,36,15],[36,17,36,28],[38,3,41,28],[44,3,44,10],[44,12,44,19],[44,21,44,28],[46,3,46,15],[46,17,46,28],[48,13,49,19],[48,22,49,28]]}
[".;/;."]
[{"$f":"IF(ISBLANK($AB$2),\"- - -\",IF('Fiche fournisseur'!$AB$2=\"FR\",INDEX(Data!A:E,MATCH(23,Data!A:A,0),2),IF('Fiche fournisseur'!$AB$2=\"NL\",INDEX(Data!A:E,MATCH(23,Data!A:A,0),3),IF('Fiche fournisseur'!$AB$2=\"DE\",INDEX(Data!A:E,MATCH(23,Data!A:A,0),4),IF('Fiche fournisseur'!$AB$2=\"EN\",INDEX(Data!A:E,MATCH(23,Data!A:A,0),5),\"Langue?\")))))","v":"INFORMATIONS FOURNISSEUR"},{"$nulls":26},"FR"]
[{"$f":"IF(ISBLANK($AB$2),\"- - -\",IF('Fiche fournisseur'!$AB$2=\"FR\",INDEX(Data!A:E,MATCH(24,Data!A:A,0),2),IF('Fiche fournisseur'!$AB$2=\"NL\",INDEX(Data!A:E,MATCH(24,Data!A:A,0),3),IF('Fiche fournisseur'!$AB$2=\"DE\",INDEX(Data!A:E,MATCH(24,Data!A:A,0),4),IF('Fiche fournisseur'!$AB$2=\"EN\",INDEX(Data!A:E,MATCH(24,Data!A:A,0),5),\"Langue?\")))))","v":"À remplir par le service demandeur"}]
[]
[{"$f":"IF(ISBLANK($AB$2),\"- - -\",IF('Fiche fournisseur'!$AB$2=\"FR\",INDEX(Data!A:E,MATCH(3,Data!A:A,0),2),IF('Fiche fournisseur'!$AB$2=\"NL\",INDEX(Data!A:E,MATCH(3,Data!A:A,0),3),IF('Fiche fournisseur'!$AB$2=\"DE\",INDEX(Data!A:E,MATCH(3,Data!A:A,0),4),IF('Fiche fournisseur'!$AB$2=\"EN\",INDEX(Data!A:E,MATCH(3,Data!A:A,0),5),\"Langue?\")))))","v":"Demandeur :"}]
[{"$nulls":3},{"$f":"IF(OR(ISBLANK($D5),$D5=\"\",$D5=\" \"),\"\",INDEX(Demandeurs!A:C,MATCH('Fiche fournisseur'!D5,Demandeurs!B:B,0),3))","v":""},"X"]
[{"$f":"IF(ISBLANK($AB$2),\"- - -\",IF('Fiche fournisseur'!$AB$2=\"FR\",INDEX(Data!A:E,MATCH(66,Data!A:A,0),2),IF('Fiche fournisseur'!$AB$2=\"NL\",INDEX(Data!A:E,MATCH(66,Data!A:A,0),3),IF('Fiche fournisseur'!$AB$2=\"DE\",INDEX(Data!A:E,MATCH(66,Data!A:A,0),4),IF('Fiche fournisseur'!$AB$2=\"EN\",INDEX(Data!A:E,MATCH(66,Data!A:A,0),5),\"Langue?\")))))","v":"Raison de la demande de création :"}]
[]
[{"$f":"IF(ISBLANK($AB$2),\"- - -\",IF('Fiche fournisseur'!$AB$2=\"FR\",INDEX(Data!A:E,MATCH(65,Data!A:A,0),2),IF('Fiche fournisseur'!$AB$2=\"NL\",INDEX(Data!A:E,MATCH(65,Data!A:A,0),3),IF('Fiche fournisseur'!$AB$2=\"DE\",INDEX(Data!A:E,MATCH(65,Data!A:A,0),4),IF('Fiche fournisseur'!$AB$2=\"EN\",INDEX(Data!A:E,MATCH(65,Data!A:A,0),5),\"Langue?\")))))","v":"Société/Organ. achats :"},null,null,"Choose",{"$nulls":13},"Choose"]
[]
[{"$f":"IF(ISBLANK($AB$2),\"- - -\",IF('Fiche fournisseur'!$AB$2=\"FR\",INDEX(Data!A:E,MATCH(57,Data!A:A,0),2),IF('Fiche fournisseur'!$AB$2=\"NL\",INDEX(Data!A:E,MATCH(57,Data!A:A,0),3),IF('Fiche fournisseur'!$AB$2=\"DE\",INDEX(Data!A:E,MATCH(57,Data!A:A,0),4),IF('Fiche fournisseur'!$AB$2=\"EN\",INDEX(Data!A:E,MATCH(57,Data!A:A,0),5),\"Langue?\")))))","v":"Société"}]
[{"$f":"IF(ISBLANK($AB$2),\"- - -\",IF('Fiche fournisseur'!$AB$2=\"FR\",INDEX(Data!A:E,MATCH(51,Data!A:A,0),2),IF('Fiche fournisseur'!$AB$2=\"NL\",INDEX(Data!A:E,MATCH(51,Data!A:A,0),3),IF('Fiche fournisseur'!$AB$2=\"DE\",INDEX(Data!A:E,MATCH(51,Data!A:A,0),4),IF('Fiche fournisseur'!$AB$2=\"EN\",INDEX(Data!A:E,MATCH(51,Data!A:A,0),5),\"Langue?\")))))","v":"Type fournisseur/ rôle partenaire :"}]
[]
[{"$f":"IF(ISBLANK($AB$2),\"- - -\",IF('Fiche fournisseur'!$AB$2=\"FR\",INDEX(Data!A:E,MATCH(5,Data!A:A,0),2),IF('Fiche fournisseur'!$AB$2=\"NL\",INDEX(Data!A:E,MATCH(5,Data!A:A,0),3),IF('Fiche fournisseur'!$AB$2=\"DE\",INDEX(Data!A:E,MATCH(5,Data!A:A,0),4),IF('Fiche fournisseur'!$AB$2=\"EN\",INDEX(Data!A:E,MATCH(5,Data!A:A,0),5),\"Langue?\")))))","v":"Nom société+raison sociale/langue :"}]
[]
[{"$f":"IF(ISBLANK($AB$2),\"- - -\",IF('Fiche fournisseur'!$AB$2=\"FR\",INDEX(Data!A:E,MATCH(29,Data!A:A,0),2),IF('Fiche fournisseur'!$AB$2=\"NL\",INDEX(Data!A:E,MATCH(29,Data!A:A,0),3),IF('Fiche fournisseur'!$AB$2=\"DE\",INDEX(Data!A:E,MATCH(29,Data!A:A,0),4),IF('Fiche fournisseur'!$AB$2=\"EN\",INDEX(Data!A:E,MATCH(29,Data!A:A,0),5),\"Langue?\")))))","v":"Adresse du fournisseur"}]
[{"$f":"IF(ISBLANK($AB$2),\"- - -\",IF('Fiche fournisseur'!$AB$2=\"FR\",INDEX(Data!A:E,MATCH(7,Data!A:A,0),2),IF('Fiche fournisseur'!$AB$2=\"NL\",INDEX(Data!A:E,MATCH(7,Data!A:A,0),3),IF('Fiche fournisseur'!$AB$2=\"DE\",INDEX(Data!A:E,MATCH(7,Data!A:A,0),4),IF('Fiche fournisseur'!$AB$2=\"EN\",INDEX(Data!A:E,MATCH(7,Data!A:A,0),5),\"Langue?\")))))","v":"Rue/no :"}]
[]
[{"$f":"IF(ISBLANK($AB$2),\"- - -\",IF('Fiche fournisseur'!$AB$2=\"FR\",INDEX(Data!A:E,MATCH(10,Data!A:A,0),2),IF('Fiche fournisseur'!$AB$2=\"NL\",INDEX(Data!A:E,MATCH(10,Data!A:A,0),3),IF('Fiche fournisseur'!$AB$2=\"DE\",INDEX(Data!A:E,MATCH(10,Data!A:A,0),4),IF('Fiche fournisseur'!$AB$2=\"EN\",INDEX(Data!A:E,MATCH(10,Data!A:A,0),5),\"Langue?\")))))","v":"Ville/CP/Pays :"}]
[]
[{"$f":"IF(ISBLANK($AB$2),\"- - -\",IF('Fiche fournisseur'!$AB$2=\"FR\",INDEX(Data!A:E,MATCH(14,Data!A:A,0),2),IF('Fiche fournisseur'!$AB$2=\"NL\",INDEX(Data!A:E,MATCH(14,Data!A:A,0),3),IF('Fiche fournisseur'!$AB$2=\"DE\",INDEX(Data!A:E,MATCH(14,Data!A:A,0),4),IF('Fiche fournisseur'!$AB$2=\"EN\",INDEX(Data!A:E,MATCH(14,Data!A:A,0),5),\"Langue?\")))))","v":"E-mail :"}]
[]
[{"$f":"IF(ISBLANK($AB$2),\"- - -\",IF('Fiche fournisseur'!$AB$2=\"FR\",INDEX(Data!A:E,MATCH(13,Data!A:A,0),2),IF('Fiche fournisseur'!$AB$2=\"NL\",INDEX(Data!A:E,MATCH(13,Data!A:A,0),3),IF('Fiche fournisseur'!$AB$2=\"DE\",INDEX(Data!A:E,MATCH(13,Data!A:A,0),4),IF('Fiche fournisseur'!$AB$2=\"EN\",INDEX(Data!A:E,MATCH(13,Data!A:A,0),5),\"Langue?\")))))","v":"Téléphone/fax :"}]
[]
[{"$f":"IF(ISBLANK($AB$2),\"- - -\",IF('Fiche fournisseur'!$AB$2=\"FR\",INDEX(Data!A:E,MATCH(37,Data!A:A,0),2),IF('Fiche fournisseur'!$AB$2=\"NL\",INDEX(Data!A:E,MATCH(37,Data!A:A,0),3),IF('Fiche fournisseur'!$AB$2=\"DE\",INDEX(Data!A:E,MATCH(37,Data!A:A,0),4),IF('Fiche fournisseur'!$AB$2=\"EN\",INDEX(Data!A:E,MATCH(37,Data!A:A,0),5),\"Langue?\")))))","v":"Infos financières"}]
[{"$f":"IF(ISBLANK($AB$2),\"- - -\",IF('Fiche fournisseur'!$AB$2=\"FR\",INDEX(Data!A:E,MATCH(64,Data!A:A,0),2),IF('Fiche fournisseur'!$AB$2=\"NL\",INDEX(Data!A:E,MATCH(64,Data!A:A,0),3),IF('Fiche fournisseur'!$AB$2=\"DE\",INDEX(Data!A:E,MATCH(64,Data!A:A,0),4),IF('Fiche fournisseur'!$AB$2=\"EN\",INDEX(Data!A:E,MATCH(64,Data!A:A,0),5),\"Langue?\")))))","v":"N° compte bancaire + IBAN/BIC :"}]
[]
[{"$f":"IF(ISBLANK($AB$2),\"- - -\",IF('Fiche fournisseur'!$AB$2=\"FR\",INDEX(Data!A:E,MATCH(56,Data!A:A,0),2),IF('Fiche fournisseur'!$AB$2=\"NL\",INDEX(Data!A:E,MATCH(56,Data!A:A,0),3),IF('Fiche fournisseur'!$AB$2=\"DE\",INDEX(Data!A:E,MATCH(56,Data!A:A,0),4),IF('Fiche fournisseur'!$AB$2=\"EN\",INDEX(Data!A:E,MATCH(56,Data!A:A,0),5),\"Langue?\")))))","v":"TVA/SIREN/SIRET :"}]
[]
[{"$f":"IF(ISBLANK($AB$2),\"- - -\",IF('Fiche fournisseur'!$AB$2=\"FR\",INDEX(Data!A:E,MATCH(43,Data!A:A,0),2),IF('Fiche fournisseur'!$AB$2=\"NL\",INDEX(Data!A:E,MATCH(43,Data!A:A,0),3),IF('Fiche fournisseur'!$AB$2=\"DE\",INDEX(Data!A:E,MATCH(43,Data!A:A,0),4),IF('Fiche fournisseur'!$AB$2=\"EN\",INDEX(Data!A:E,MATCH(43,Data!A:A,0),5),\"Langue?\")))))","v":"Personne de contact"},null,null,{"$f":"IF(ISBLANK($AB$2),\"- - -\",IF('Fiche fournisseur'!$AB$2=\"FR\",INDEX(Data!A:E,MATCH(59,Data!A:A,0),2),IF('Fiche fournisseur'!$AB$2=\"NL\",INDEX(Data!A:E,MATCH(59,Data!A:A,0),3),IF('Fiche fournisseur'!$AB$2=\"DE\",INDEX(Data!A:E,MATCH(59,Data!A:A,0),4),IF('Fiche fournisseur'!$AB$2=\"EN\",INDEX(Data!A:E,MATCH(59,Data!A:A,0),5),\"Langue?\")))))","v":"Service commercial"},{"$nulls":13},{"$f":"IF(ISBLANK($AB$2),\"- - -\",IF('Fiche fournisseur'!$AB$2=\"FR\",INDEX(Data!A:E,MATCH(60,Data!A:A,0),2),IF('Fiche fournisseur'!$AB$2=\"NL\",INDEX(Data!A:E,MATCH(60,Data!A:A,0),3),IF('Fiche fournisseur'!$AB$2=\"DE\",INDEX(Data!A:E,MATCH(60,Data!A:A,0),4),IF('Fiche fournisseur'!$AB$2=\"EN\",INDEX(Data!A:E,MATCH(60,Data!A:A,0),5),\"Langue?\")))))","v":"Service comptabilité"}]
{"$rows_left_out":21}
{"sheet":"Feuil1","index":2,"n_rows":0,"n_cols":0,"rows_kept":0,"hidden":true}

{"sheet":"Lists","index":3,"n_rows":7,"n_cols":5,"rows_kept":7}
[null,"Lists",null,"Société","SO"]
[null,"Choose",null,"Choose","Choose"]
[null,217,null,217,217]
[null,83,null,83,83]
[null,84,null,84]
[null,"217 + 83",null,"217 + 83","217 + 83"]
[null,319,null,319]

{"sheet":"Data","index":4,"n_rows":68,"n_cols":5,"rows_kept":68,"hidden":true}
["REF","FR","NL","DE","EN"]
[1,"INFORMATIONS CLIENT","KLANTINFORMATIES","KUNDEINFORMATIONEN","CUSTOMER INFORMATIONS"]
[2,"À remplir par le service commercial","In te vullen door comerciële binnendienst","Durch Handelsabteilung zu kodieren","To be filled by internal sales department"]
[3,"Demandeur :","Aanvrager :","Antragsteller :","Applicant :"]
[4,"Délégué commercial :","Technisch commerciëel afgevaardig :","Außendienstmittarbeiter :","Sales representative :"]
[5,"Nom société+raison sociale/langue :","Firma naam+/Taal :","Firmenname+Bezeichnung/Sprache :","Company Name/Language :"]
[6,"Adresse","Adres","Anschrift","Address"]
[7,"Rue/no :","Straat/huisnr. : ","Straße/Hausnr. :","Street/house nr.:"]
[8,"No. :","Huisnummer :","Anzahl :","Number :"]
[9,"Code postal :","Postcode :","Postleitzahl :","Postal code :"]
[10,"Ville/CP/Pays :","Stad/PC/Land :","Stadt/Postlz./Land :","City/Zip/Country :"]
[11,"No. de TVA (facultatif) :","BTW-Nr. (optioneel) :","MwSt-Nr. (optional) :","VAT number (optional) :"]
[12,"Langue :","Taal :","Sprache :","Language :"]
[13,"Téléphone/fax :","Telefoon/fax :","Telefon/fax :","Phone number/fax:"]
[14,"E-mail :","E-mail :","E-mail :","E-mail :"]
[15,"Type de client :","Klantentyp :","Kundentyp :","Customer type :"]
[16,"PRO","PRO","PRO","PRO"]
[17,"100% BRICO","100% BRICO","100% BRICO","100% BRICO"]
[18,"DIVERS","DIVERSEN","SONSTIGE","MISCELLANEOUS"]
[19,"Liste de prix SAP (PLTYP) :","SAP prijslijst (PLTYP) :","SAP-Preisliste (PLTYP) :","Price list SAP (PLTYP) :"]
[20,"Payeur (Nom & No. SAP) :","Payer (Naam & SAP-Nr.) :","Payer (Nr SAP und Name) :","Payer (SAP No. and name) :"]
[21,"Conditions commerciales :","Algemene voorwaarden :","Allgemeine Geschäftsbedingungen :","Commercial conditions :"]
[22,"Remarques :","Opmerkingen :","Bemerkungen :","Notes :"]
[23,"INFORMATIONS FOURNISSEUR","INFORMATIELEVERANCIER","LIEFERANTINFORMATIONEN","SUPPLIER INFORMATION"]
[24,"À remplir par le service demandeur","In te vullen door de aanvraagdienst","Durch Anforderer Abteilung zu kodieren","To be completed by the requesting department"]
[25,"Date :","Datum :","Datum :","Date :"]
[26,"N° du fournisseur :","Nr leverancier :","Nr. Versorger :","Supplier No. :"]
[27,"Org. Ventes :","Verkauf org. :","Verkoop org. :","Sales org. :"]
[28,"Auteur de la facture :","Auteur van het wetsvoorstel :","Autor des Gesetzentwurfs :","Author of invoice :"]
[29,"Adresse du fournisseur","Leverancieradres","Lieferantadresse ","Supplier address"]
{"$rows_left_out":39}
{"sheet":"FR","index":5,"n_rows":45,"n_cols":22,"rows_kept":45,"hidden":true}
[null,"FICHE CREATION FOURNISSEUR"]
["Demandeur :"]
["Date :"]
["N° du fournisseur"]
["Sales org. :"]
["Auteur de la facture","Nom sté"]
["(adresse de facturation)","Rue / N°"]
[null,"Code Postal"]
[null,"Lieu"]
[null,"Pays"]
[]
[null,"adresse e-mail"]
[]
[null,"Langue du FRN"]
[]
[null,"Tél. général"]
[null,"Fax général"]
[]
[null,"TVA "]
[]
["Info financière","N° compte bancaire"]
[null,"IBAN"]
[null,"SWIFT-BIC"]
[null,"Nom de la banque "]
[null,"Devise de la facture"]
[null,"Conditions de paiement"]
[null,"Conditions de livraison"]
[]
["Personne de contact","Nom"]
["(contact serv. commercial pour","Tél."]
{"$rows_left_out":9}
{"sheet":"NL","index":6,"n_rows":34,"n_cols":2,"rows_kept":34,"hidden":true}
[null,"NIEUWE LEVERANCIER"]
["Aanvrager :"]
["Datum : "]
["Leveranciersnr."]
["Sales org."]
["Fakturatieadres ","Firmanaam"]
[null,"Straat, Nr."]
[null,"Postcode"]
[null,"Plaats"]
[null,"Land"]
[]
[null,"e-mail"]
[null,"Taal leverancier"]
[null,"Algemeen Tel. Nr."]
[null,"Algemeen Fax Nr."]
[]
[null,"BTW Nr."]
[]
["Financiële gegevens ","Bankrekening"]
[null,"IBAN"]
[null,"SWIFT-BIC"]
[null,"Naam bank"]
[null,"Invoicing currency"]
[null,"Betalings Munteenheid "]
[null,"Leveringscondities"]
[]
["Contactpersoon","Naam"]
["(comm. dienst voor doorsturen inkooporders)","Tel. Nr."]
[null,"e-mail"]
[]
{"$rows_left_out":5}
{"sheet":"EN","index":7,"n_rows":33,"n_cols":2,"rows_kept":33,"hidden":true}
[null,"NEW SUPPLIER"]
["From :"]
["Date :"]
["SUPPLIER N°"]
["INVOICING ADDRESS","Company Name"]
[null,"Street, N°"]
[null,"ZIP"]
[null,"City"]
[null,"Country"]
[]
[null,"e-mail"]
[null,"Supplier language"]
[null,"General Tel. N°"]
[null,"General Fax N°"]
[]
[null,"VAT N°"]
[]
["Financial data ","Bank account N°"]
[null,"IBAN"]
[null,"SWIFT-BIC"]
[null,"Bank name"]
[null,"Invoicing currency"]
[null,"Payment conditions"]
[null,"Delivery conditions"]
[]
["Contact Person","Name"]
["(commercial dept. for Purchase Orders)","Tel. N°"]
[null,"E-mail"]
[]
["Ordering address","ONLY IF DIFFERENT"]
{"$rows_left_out":4}
{"sheet":"Pays","index":8,"n_rows":242,"n_cols":5,"rows_kept":242,"hidden":true}
["#","#2","ISO","Code","Pays"]
[6,20,"AD","AND","Andorra"]
[218,784,"AE","ARE","United Arab Emirates"]
[1,4,"AF","AFG","Afghanistan"]
[8,28,"AG","ATG","Antigua and Barbuda"]
[186,660,"AI","AIA","Anguilla"]
[2,8,"AL","ALB","Albania"]
[16,51,"AM","ARM","Armenia"]
[151,530,"AN","ANT","Netherlands Antilles"]
[7,24,"AO","AGO","Angola"]
[3,10,"AQ","ATA","Antarctica"]
[10,32,"AR","ARG","Argentina"]
[5,16,"AS","ASM","American Samoa"]
[12,40,"AT","AUT","Austria"]
[11,36,"AU","AUS","Australia"]
[152,533,"AW","ABW","Aruba"]
[74,248,"AX","ALA","Ã…land Islands"]
[9,31,"AZ","AZE","Azerbaijan"]
[22,70,"BA","BIH","Bosnia and Herzegovina"]
[17,52,"BB","BRB","Barbados"]
[15,50,"BD","BGD","Bangladesh"]
[18,56,"BE","BEL","Belgium"]
[233,854,"BF","BFA","Burkina Faso"]
[31,100,"BG","BGR","Bulgaria"]
[14,48,"BH","BHR","Bahrain"]
[33,108,"BI","BDI","Burundi"]
[59,204,"BJ","BEN","Benin"]
[19,60,"BM","BMU","Bermuda"]
[30,96,"BN","BRN","Brunei Darussalam"]
[21,68,"BO","BOL","Bolivia"]
{"$rows_left_out":213}
{"sheet":"Cond.paiement","index":9,"n_rows":106,"n_cols":4,"rows_kept":106,"hidden":true}
["P12_035","PG1_200","Description","Conca"]
["0010","1020","0% discount for cash payment",{"$f":"$A2&\"<=>\"&B2","v":"0010<=>1020"}]
["0300","1050","paiement immédiat, 3% escompte",{"$f":"$A3&\"<=>\"&B3","v":"0300<=>1050"}]
["A230",1040,"dans les 21 jours, 2% escompte","A230<=>1040"]
["A260",1040,"dans les 21 jours, 2% escompte","A260<=>1040"]
["A360",1080,"dans les 21 jours, 3% escompte","A360<=>1080"]
["DO10","0180","domicilié : 3%, 10 jours","DO10<=>0180"]
["DO12","0385","domicilié : 2%, 15 jours","DO12<=>0385"]
["DO15","0006","domicilié : 3%, 15 jours","DO15<=>0006"]
["DO30","N030","domicilié : 0%, 30 jours","DO30<=>N030"]
["DO31","0500","domicilié : 1%, 30 jours","DO31<=>0500"]
["DO32","0530","domicilié : 2%, 30 jours","DO32<=>0530"]
["DOM1","0038","domicilié : 1%, 5 jours","DOM1<=>0038"]
["DOM2","0040","domicilié : 2%, 5 jours","DOM2<=>0040"]
["DOM3","0050","domicilié : 3%, 5 jours","DOM3<=>0050"]
["DOM4","0061","domicilié : 4%, 5 jours","DOM4<=>0061"]
["DOM5","0020","domicilié : 5%, 5 jours","DOM5<=>0020"]
["F001","0118","dans les 8 jours, 2% escompte","F001<=>0118"]
["F060","0165","dans les 8 jours, 1% escompte","F060<=>0165"]
["F080","0169","dans les 8 jours, 1% escompte","F080<=>0169"]
["F110","0115","dans les 8 jours, 1,5% escompte","F110<=>0115"]
["F120","0177","dans les 8 jours, 1,5% escompte","F120<=>0177"]
["F130",1025,"dans les 8 jours, 1,5% escompte","F130<=>1025"]
["F140","0177","dans les 8 jours, 1,5% escompte","F140<=>0177"]
["F160","0125","dans les 8 jours, 2% escompte","F160<=>0125"]
["F170","0126","dans les 8 jours, 2% escompte","F170<=>0126"]
["F180","0126","dans les 8 jours, 2% escompte","F180<=>0126"]
["F200","0126","dans les 8 jours, 2% escompte","F200<=>0126"]
["F260","0130","dans les 8 jours, 3% escompte","F260<=>0130"]
["F280","0133","dans les 8 jours, 3% escompte","F280<=>0133"]
{"$rows_left_out":77}
{"sheet":"Groupes d'acheteurs","index":10,"n_rows":1540,"n_cols":3,"rows_kept":1540,"hidden":true}
["GAc","Désignation","Conca"]
[1,"k",{"$f":"A2&\" (\"&$B2&\")\"","v":"1 (k)"}]
[2,"k",{"$f":"A3&\" (\"&$B3&\")\"","v":"2 (k)"}]
[3,"k","3 (k)"]
[4,"k","4 (k)"]
[5,"k","5 (k)"]
[6,"k","6 (k)"]
[7,"k","7 (k)"]
[8,"k","8 (k)"]
[9,"k","9 (k)"]
[10,"k","10 (k)"]
[11,"k","11 (k)"]
[12,"k","12 (k)"]
[13,"k","13 (k)"]
[14,"k","14 (k)"]
[15,"k","15 (k)"]
[16,"k","16 (k)"]
[17,"k","17 (k)"]
[18,"k","18 (k)"]
[19,"k","19 (k)"]
[20,"k","20 (k)"]
[21,"k","21 (k)"]
[22,"k","22 (k)"]
[23,"k","23 (k)"]
[24,"k","24 (k)"]
[25,"k","25 (k)"]
[26,"k","26 (k)"]
[27,"k","27 (k)"]
[28,"k","28 (k)"]
[29,"k","29 (k)"]
{"$rows_left_out":1511}
{"sheet":"Demandeurs","index":11,"n_rows":101,"n_cols":4,"rows_kept":101,"hidden":true}
["#"]
[1,"Moi","moi","moi"]
[{"$f":"IF(OR(ISBLANK(B3),B3=\"\",B3=\" \"),\"\",$A2+1)","v":""}]
[""]
[""]
[""]
[""]
[""]
[""]
[""]
[""]
[""]
[""]
[""]
[""]
[""]
[""]
[""]
[""]
[""]
[""]
[""]
[""]
[""]
[""]
[""]
[""]
[""]
[""]
[""]
{"$rows_left_out":71}