{"text_format":"3","workbook":"xlsx","n_sheets":12,"sheets":["Fiche client entrepreneur","Fiche fournisseur","Feuil1","Lists","Data","FR","NL","EN","Pays","Cond.paiement","Groupes d'acheteurs","Demandeurs"],"not_rendered":{"images":4,"macros":1,"defined_names":8,"comments":1},"read":"whole","date_system":"1900"}

{"sheet":"Fiche client entrepreneur","index":0,"n_rows":36,"n_cols":28,"rows_kept":36,"hidden":true,"merged":[[1,27,1,28],[5,3,5,28],[7,3,7,28],[9,3,9,25],[9,27,9,28],[12,3,12,25],[12,27,12,28],[14,3,14,18],[14,20,14,25],[14,27,14,28],[16,3,16,28],[18,3,18,15],[18,17,18,28],[20,3,20,28],[23,3,23,28],[25,3,25,23],[25,25,25,28],[27,3,33,28],[36,3,45,28]]}
[]
[{"$f":"IF(ISBLANK($AB$2),\"- - -\",IF('Fiche client entrepreneur'!$AB$2=\"FR\",INDEX(Data!A:E,MATCH(1,Data!A:A,0),2),IF('Fiche client entrepreneur'!$AB$2=\"NL\",INDEX(Data!A:E,MATCH(1,Data!A:A,0),3),IF('Fiche client entrepreneur'!$AB$2=\"DE\",INDEX(Data!A:E,MATCH(1,Data!A:A,0),4),IF('Fiche client entrepreneur'!$AB$2=\"EN\",INDEX(Data!A:E,MATCH(1,Data!A:A,0),5),\"Langue?\")))))","v":"INFORMATIONS CLIENT"},{"$nulls":26},"FR"]
[{"$f":"IF(ISBLANK($AB$2),\"- - -\",IF('Fiche client entrepreneur'!$AB$2=\"FR\",INDEX(Data!A:E,MATCH(2,Data!A:A,0),2),IF('Fiche client entrepreneur'!$AB$2=\"NL\",INDEX(Data!A:E,MATCH(2,Data!A:A,0),3),IF('Fiche client entrepreneur'!$AB$2=\"DE\",INDEX(Data!A:E,MATCH(2,Data!A:A,0),4),IF('Fiche client entrepreneur'!$AB$2=\"EN\",INDEX(Data!A:E,MATCH(2,Data!A:A,0),5),\"Langue?\")))))","v":"À remplir par le service commercial"}]
[]
[{"$f":"IF(ISBLANK($AB$2),\"- - -\",IF('Fiche client entrepreneur'!$AB$2=\"FR\",INDEX(Data!A:E,MATCH(57,Data!A:A,0),2),IF('Fiche client entrepreneur'!$AB$2=\"NL\",INDEX(Data!A:E,MATCH(57,Data!A:A,0),3),IF('Fiche client entrepreneur'!$AB$2=\"DE\",INDEX(Data!A:E,MATCH(57,Data!A:A,0),4),IF('Fiche client entrepreneur'!$AB$2=\"EN\",INDEX(Data!A:E,MATCH(57,Data!A:A,0),5),\"Langue?\")))))","v":"Société"}]
[{"$f":"IF(ISBLANK($AB$2),\"- - -\",IF('Fiche client entrepreneur'!$AB$2=\"FR\",INDEX(Data!A:E,MATCH(3,Data!A:A,0),2),IF('Fiche client entrepreneur'!$AB$2=\"NL\",INDEX(Data!A:E,MATCH(3,Data!A:A,0),3),IF('Fiche client entrepreneur'!$AB$2=\"DE\",INDEX(Data!A:E,MATCH(3,Data!A:A,0),4),IF('Fiche client entrepreneur'!$AB$2=\"EN\",INDEX(Data!A:E,MATCH(3,Data!A:A,0),5),\"Langue?\")))))","v":"Demandeur :"}]
[]
[{"$f":"IF(ISBLANK($AB$2),\"- - -\",IF('Fiche client entrepreneur'!$AB$2=\"FR\",INDEX(Data!A:E,MATCH(4,Data!A:A,0),2),IF('Fiche client entrepreneur'!$AB$2=\"NL\",INDEX(Data!A:E,MATCH(4,Data!A:A,0),3),IF('Fiche client entrepreneur'!$AB$2=\"DE\",INDEX(Data!A:E,MATCH(4,Data!A:A,0),4),IF('Fiche client entrepreneur'!$AB$2=\"EN\",INDEX(Data!A:E,MATCH(4,Data!A:A,0),5),\"Langue?\")))))","v":"Délégué commercial :"},null,null,"classés \"PRO\". Affectation selon les règles dérivation."]
[]
[{"$f":"IF(ISBLANK($AB$2),\"- - -\",IF('Fiche client entrepreneur'!$AB$2=\"FR\",INDEX(Data!A:E,MATCH(5,Data!A:A,0),2),IF('Fiche client entrepreneur'!$AB$2=\"NL\",INDEX(Data!A:E,MATCH(5,Data!A:A,0),3),IF('Fiche client entrepreneur'!$AB$2=\"DE\",INDEX(Data!A:E,MATCH(5,Data!A:A,0),4),IF('Fiche client entrepreneur'!$AB$2=\"EN\",INDEX(Data!A:E,MATCH(5,Data!A:A,0),5),\"Langue?\")))))","v":"Nom société+raison sociale/langue :"}]
[]
[{"$f":"IF(ISBLANK($AB$2),\"- - -\",IF('Fiche client entrepreneur'!$AB$2=\"FR\",INDEX(Data!A:E,MATCH(6,Data!A:A,0),2),IF('Fiche client entrepreneur'!$AB$2=\"NL\",INDEX(Data!A:E,MATCH(6,Data!A:A,0),3),IF('Fiche client entrepreneur'!$AB$2=\"DE\",INDEX(Data!A:E,MATCH(6,Data!A:A,0),4),IF('Fiche client entrepreneur'!$AB$2=\"EN\",INDEX(Data!A:E,MATCH(6,Data!A:A,0),5),\"Langue?\")))))","v":"Adresse"}]
[{"$f":"IF(ISBLANK($AB$2),\"- - -\",IF('Fiche client entrepreneur'!$AB$2=\"FR\",INDEX(Data!A:E,MATCH(7,Data!A:A,0),2),IF('Fiche client entrepreneur'!$AB$2=\"NL\",INDEX(Data!A:E,MATCH(7,Data!A:A,0),3),IF('Fiche client entrepreneur'!$AB$2=\"DE\",INDEX(Data!A:E,MATCH(7,Data!A:A,0),4),IF('Fiche client entrepreneur'!$AB$2=\"EN\",INDEX(Data!A:E,MATCH(7,Data!A:A,0),5),\"Langue?\")))))","v":"Rue/no :"}]
[]
[{"$f":"IF(ISBLANK($AB$2),\"- - -\",IF('Fiche client entrepreneur'!$AB$2=\"FR\",INDEX(Data!A:E,MATCH(10,Data!A:A,0),2),IF('Fiche client entrepreneur'!$AB$2=\"NL\",INDEX(Data!A:E,MATCH(10,Data!A:A,0),3),IF('Fiche client entrepreneur'!$AB$2=\"DE\",INDEX(Data!A:E,MATCH(10,Data!A:A,0),4),IF('Fiche client entrepreneur'!$AB$2=\"EN\",INDEX(Data!A:E,MATCH(10,Data!A:A,0),5),\"Langue?\")))))","v":"Ville/CP/Pays :"}]
[]
[{"$f":"IF(ISBLANK($AB$2),\"- - -\",IF('Fiche client entrepreneur'!$AB$2=\"FR\",INDEX(Data!A:E,MATCH(11,Data!A:A,0),2),IF('Fiche client entrepreneur'!$AB$2=\"NL\",INDEX(Data!A:E,MATCH(11,Data!A:A,0),3),IF('Fiche client entrepreneur'!$AB$2=\"DE\",INDEX(Data!A:E,MATCH(11,Data!A:A,0),4),IF('Fiche client entrepreneur'!$AB$2=\"EN\",INDEX(Data!A:E,MATCH(11,Data!A:A,0),5),\"Langue?\")))))","v":"No. de TVA (facultatif) :"}]
[]
[{"$f":"IF(ISBLANK($AB$2),\"- - -\",IF('Fiche client entrepreneur'!$AB$2=\"FR\",INDEX(Data!A:E,MATCH(13,Data!A:A,0),2),IF('Fiche client entrepreneur'!$AB$2=\"NL\",INDEX(Data!A:E,MATCH(13,Data!A:A,0),3),IF('Fiche client entrepreneur'!$AB$2=\"DE\",INDEX(Data!A:E,MATCH(13,Data!A:A,0),4),IF('Fiche client entrepreneur'!$AB$2=\"EN\",INDEX(Data!A:E,MATCH(13,Data!A:A,0),5),\"Langue?\")))))","v":"Téléphone/fax :"}]
[]
[{"$f":"IF(ISBLANK($AB$2),\"- - -\",IF('Fiche client entrepreneur'!$AB$2=\"FR\",INDEX(Data!A:E,MATCH(14,Data!A:A,0),2),IF('Fiche client entrepreneur'!$AB$2=\"NL\",INDEX(Data!A:E,MATCH(14,Data!A:A,0),3),IF('Fiche client entrepreneur'!$AB$2=\"DE\",INDEX(Data!A:E,MATCH(14,Data!A:A,0),4),IF('Fiche client entrepreneur'!$AB$2=\"EN\",INDEX(Data!A:E,MATCH(14,Data!A:A,0),5),\"Langue?\")))))","v":"E-mail :"}]
[]
[{"$f":"IF(ISBLANK($AB$2),\"- - -\",IF('Fiche client entrepreneur'!$AB$2=\"FR\",INDEX(Data!A:E,MATCH(58,Data!A:A,0),2),IF('Fiche client entrepreneur'!$AB$2=\"NL\",INDEX(Data!A:E,MATCH(58,Data!A:A,0),3),IF('Fiche client entrepreneur'!$AB$2=\"DE\",INDEX(Data!A:E,MATCH(58,Data!A:A,0),4),IF('Fiche client entrepreneur'!$AB$2=\"EN\",INDEX(Data!A:E,MATCH(58,Data!A:A,0),5),\"Langue?\")))))","v":"Conditions commerciales"}]
[{"$f":"IF(ISBLANK($AB$2),\"- - -\",IF('Fiche client entrepreneur'!$AB$2=\"FR\",INDEX(Data!A:E,MATCH(19,Data!A:A,0),2),IF('Fiche client entrepreneur'!$AB$2=\"NL\",INDEX(Data!A:E,MATCH(19,Data!A:A,0),3),IF('Fiche client entrepreneur'!$AB$2=\"DE\",INDEX(Data!A:E,MATCH(19,Data!A:A,0),4),IF('Fiche client entrepreneur'!$AB$2=\"EN\",INDEX(Data!A:E,MATCH(19,Data!A:A,0),5),\"Langue?\")))))","v":"Liste de prix SAP (PLTYP) :"}]
[]
[{"$f":"IF(ISBLANK($AB$2),\"- - -\",IF('Fiche client entrepreneur'!$AB$2=\"FR\",INDEX(Data!A:E,MATCH(20,Data!A:A,0),2),IF('Fiche client entrepreneur'!$AB$2=\"NL\",INDEX(Data!A:E,MATCH(20,Data!A:A,0),3),IF('Fiche client entrepreneur'!$AB$2=\"DE\",INDEX(Data!A:E,MATCH(20,Data!A:A,0),4),IF('Fiche client entrepreneur'!$AB$2=\"EN\",INDEX(Data!A:E,MATCH(20,Data!A:A,0),5),\"Langue?\")))))","v":"Payeur (Nom & No. SAP) :"}]
[]
[{"$f":"IF(ISBLANK($AB$2),\"- - -\",IF('Fiche client entrepreneur'!$AB$2=\"FR\",INDEX(Data!A:E,MATCH(21,Data!A:A,0),2),IF('Fiche client entrepreneur'!$AB$2=\"NL\",INDEX(Data!A:E,MATCH(21,Data!A:A,0),3),IF('Fiche client entrepreneur'!$AB$2=\"DE\",INDEX(Data!A:E,MATCH(21,Data!A:A,0),4),IF('Fiche client entrepreneur'!$AB$2=\"EN\",INDEX(Data!A:E,MATCH(21,Data!A:A,0),5),\"Langue?\")))))","v":"Conditions commerciales :"}]
{"$rows_empty":7}
[{"$f":"IF(ISBLANK($AB$2),\"- - -\",IF('Fiche client entrepreneur'!$AB$2=\"FR\",INDEX(Data!A:E,MATCH(22,Data!A:A,0),2),IF('Fiche client entrepreneur'!$AB$2=\"NL\",INDEX(Data!A:E,MATCH(22,Data!A:A,0),3),IF('Fiche client entrepreneur'!$AB$2=\"DE\",INDEX(Data!A:E,MATCH(22,Data!A:A,0),4),IF('Fiche client entrepreneur'!$AB$2=\"EN\",INDEX(Data!A:E,MATCH(22,Data!A:A,0),5),\"Langue?\")))))","v":"Remarques :"}]

{"sheet":"Fiche fournisseur","index":1,"n_rows":50,"n_cols":28,"rows_kept":50,"merged":[[0,19,0,25],[1,19,1,25],[1,27,1,28],[2,19,2,25],[4,3,4,28],[6,3,6,28],[8,3,8,15],[8,17,8,28],[11,3,11,15],[11,17,11,28],[13,3,13,25],[13,27,13,28],[16,3,16,25],[16,27,16,28],[18,3,18,18],[18,20,18,25],[18,27,18,28],[20,3,20,28],[22,3,22,15],[22,17,22,28],[23,4,23,14],[25,3,25,12],[25,14,25,22],[25,24,25,28],[27,3,27,10],[27,12,27,19],[27,21,27,28],[29,3,29,15],[29,17,29,28],[30,3,30,15],[30,17,30,28],[32,3,32,15],[32,17,32,28],[34,3,34,15],[34,17,34,28],[36,3,36,15],[36,17,36,28],[38,3,41,28],[44,3,44,10],[44,12,44,19],[44,21,44,28],[46,3,46,15],[46,17,46,28],[48,13,49,19],[48,22,49,28]]}
[".;/;."]
[{"$f":"IF(ISBLANK($AB$2),\"- - -\",IF('Fiche fournisseur'!$AB$2=\"FR\",INDEX(Data!A:E,MATCH(23,Data!A:A,0),2),IF('Fiche fournisseur'!$AB$2=\"NL\",INDEX(Data!A:E,MATCH(23,Data!A:A,0),3),IF('Fiche fournisseur'!$AB$2=\"DE\",INDEX(Data!A:E,MATCH(23,Data!A:A,0),4),IF('Fiche fournisseur'!$AB$2=\"EN\",INDEX(Data!A:E,MATCH(23,Data!A:A,0),5),\"Langue?\")))))","v":"INFORMATIONS FOURNISSEUR"},{"$nulls":26},"FR"]
[{"$f":"IF(ISBLANK($AB$2),\"- - -\",IF('Fiche fournisseur'!$AB$2=\"FR\",INDEX(Data!A:E,MATCH(24,Data!A:A,0),2),IF('Fiche fournisseur'!$AB$2=\"NL\",INDEX(Data!A:E,MATCH(24,Data!A:A,0),3),IF('Fiche fournisseur'!$AB$2=\"DE\",INDEX(Data!A:E,MATCH(24,Data!A:A,0),4),IF('Fiche fournisseur'!$AB$2=\"EN\",INDEX(Data!A:E,MATCH(24,Data!A:A,0),5),\"Langue?\")))))","v":"À remplir par le service demandeur"}]
[]
[{"$f":"IF(ISBLANK($AB$2),\"- - -\",IF('Fiche fournisseur'!$AB$2=\"FR\",INDEX(Data!A:E,MATCH(3,Data!A:A,0),2),IF('Fiche fournisseur'!$AB$2=\"NL\",INDEX(Data!A:E,MATCH(3,Data!A:A,0),3),IF('Fiche fournisseur'!$AB$2=\"DE\",INDEX(Data!A:E,MATCH(3,Data!A:A,0),4),IF('Fiche fournisseur'!$AB$2=\"EN\",INDEX(Data!A:E,MATCH(3,Data!A:A,0),5),\"Langue?\")))))","v":"Demandeur :"}]
[{"$nulls":3},{"$f":"IF(OR(ISBLANK($D5),$D5=\"\",$D5=\" \"),\"\",INDEX(Demandeurs!A:C,MATCH('Fiche fournisseur'!D5,Demandeurs!B:B,0),3))","v":""},"X"]
[{"$f":"IF(ISBLANK($AB$2),\"- - -\",IF('Fiche fournisseur'!$AB$2=\"FR\",INDEX(Data!A:E,MATCH(66,Data!A:A,0),2),IF('Fiche fournisseur'!$AB$2=\"NL\",INDEX(Data!A:E,MATCH(66,Data!A:A,0),3),IF('Fiche fournisseur'!$AB$2=\"DE\",INDEX(Data!A:E,MATCH(66,Data!A:A,0),4),IF('Fiche fournisseur'!$AB$2=\"EN\",INDEX(Data!A:E,MATCH(66,Data!A:A,0),5),\"Langue?\")))))","v":"Raison de la demande de création :"}]
[]
[{"$f":"IF(ISBLANK($AB$2),\"- - -\",IF('Fiche fournisseur'!$AB$2=\"FR\",INDEX(Data!A:E,MATCH(65,Data!A:A,0),2),IF('Fiche fournisseur'!$AB$2=\"NL\",INDEX(Data!A:E,MATCH(65,Data!A:A,0),3),IF('Fiche fournisseur'!$AB$2=\"DE\",INDEX(Data!A:E,MATCH(65,Data!A:A,0),4),IF('Fiche fournisseur'!$AB$2=\"EN\",INDEX(Data!A:E,MATCH(65,Data!A:A,0),5),\"Langue?\")))))","v":"Société/Organ. achats :"},null,null,"Choose",{"$nulls":13},"Choose"]
[]
[{"$f":"IF(ISBLANK($AB$2),\"- - -\",IF('Fiche fournisseur'!$AB$2=\"FR\",INDEX(Data!A:E,MATCH(57,Data!A:A,0),2),IF('Fiche fournisseur'!$AB$2=\"NL\",INDEX(Data!A:E,MATCH(57,Data!A:A,0),3),IF('Fiche fournisseur'!$AB$2=\"DE\",INDEX(Data!A:E,MATCH(57,Data!A:A,0),4),IF('Fiche fournisseur'!$AB$2=\"EN\",INDEX(Data!A:E,MATCH(57,Data!A:A,0),5),\"Langue?\")))))","v":"Société"}]
[{"$f":"IF(ISBLANK($AB$2),\"- - -\",IF('Fiche fournisseur'!$AB$2=\"FR\",INDEX(Data!A:E,MATCH(51,Data!A:A,0),2),IF('Fiche fournisseur'!$AB$2=\"NL\",INDEX(Data!A:E,MATCH(51,Data!A:A,0),3),IF('Fiche fournisseur'!$AB$2=\"DE\",INDEX(Data!A:E,MATCH(51,Data!A:A,0),4),IF('Fiche fournisseur'!$AB$2=\"EN\",INDEX(Data!A:E,MATCH(51,Data!A:A,0),5),\"Langue?\")))))","v":"Type fournisseur/ rôle partenaire :"}]
[]
[{"$f":"IF(ISBLANK($AB$2),\"- - -\",IF('Fiche fournisseur'!$AB$2=\"FR\",INDEX(Data!A:E,MATCH(5,Data!A:A,0),2),IF('Fiche fournisseur'!$AB$2=\"NL\",INDEX(Data!A:E,MATCH(5,Data!A:A,0),3),IF('Fiche fournisseur'!$AB$2=\"DE\",INDEX(Data!A:E,MATCH(5,Data!A:A,0),4),IF('Fiche fournisseur'!$AB$2=\"EN\",INDEX(Data!A:E,MATCH(5,Data!A:A,0),5),\"Langue?\")))))","v":"Nom société+raison sociale/langue :"}]
[]
[{"$f":"IF(ISBLANK($AB$2),\"- - -\",IF('Fiche fournisseur'!$AB$2=\"FR\",INDEX(Data!A:E,MATCH(29,Data!A:A,0),2),IF('Fiche fournisseur'!$AB$2=\"NL\",INDEX(Data!A:E,MATCH(29,Data!A:A,0),3),IF('Fiche fournisseur'!$AB$2=\"DE\",INDEX(Data!A:E,MATCH(29,Data!A:A,0),4),IF('Fiche fournisseur'!$AB$2=\"EN\",INDEX(Data!A:E,MATCH(29,Data!A:A,0),5),\"Langue?\")))))","v":"Adresse du fournisseur"}]
[{"$f":"IF(ISBLANK($AB$2),\"- - -\",IF('Fiche fournisseur'!$AB$2=\"FR\",INDEX(Data!A:E,MATCH(7,Data!A:A,0),2),IF('Fiche fournisseur'!$AB$2=\"NL\",INDEX(Data!A:E,MATCH(7,Data!A:A,0),3),IF('Fiche fournisseur'!$AB$2=\"DE\",INDEX(Data!A:E,MATCH(7,Data!A:A,0),4),IF('Fiche fournisseur'!$AB$2=\"EN\",INDEX(Data!A:E,MATCH(7,Data!A:A,0),5),\"Langue?\")))))","v":"Rue/no :"}]
[]
[{"$f":"IF(ISBLANK($AB$2),\"- - -\",IF('Fiche fournisseur'!$AB$2=\"FR\",INDEX(Data!A:E,MATCH(10,Data!A:A,0),2),IF('Fiche fournisseur'!$AB$2=\"NL\",INDEX(Data!A:E,MATCH(10,Data!A:A,0),3),IF('Fiche fournisseur'!$AB$2=\"DE\",INDEX(Data!A:E,MATCH(10,Data!A:A,0),4),IF('Fiche fournisseur'!$AB$2=\"EN\",INDEX(Data!A:E,MATCH(10,Data!A:A,0),5),\"Langue?\")))))","v":"Ville/CP/Pays :"}]
[]
[{"$f":"IF(ISBLANK($AB$2),\"- - -\",IF('Fiche fournisseur'!$AB$2=\"FR\",INDEX(Data!A:E,MATCH(14,Data!A:A,0),2),IF('Fiche fournisseur'!$AB$2=\"NL\",INDEX(Data!A:E,MATCH(14,Data!A:A,0),3),IF('Fiche fournisseur'!$AB$2=\"DE\",INDEX(Data!A:E,MATCH(14,Data!A:A,0),4),IF('Fiche fournisseur'!$AB$2=\"EN\",INDEX(Data!A:E,MATCH(14,Data!A:A,0),5),\"Langue?\")))))","v":"E-mail :"}]
[]
[{"$f":"IF(ISBLANK($AB$2),\"- - -\",IF('Fiche fournisseur'!$AB$2=\"FR\",INDEX(Data!A:E,MATCH(13,Data!A:A,0),2),IF('Fiche fournisseur'!$AB$2=\"NL\",INDEX(Data!A:E,MATCH(13,Data!A:A,0),3),IF('Fiche fournisseur'!$AB$2=\"DE\",INDEX(Data!A:E,MATCH(13,Data!A:A,0),4),IF('Fiche fournisseur'!$AB$2=\"EN\",INDEX(Data!A:E,MATCH(13,Data!A:A,0),5),\"Langue?\")))))","v":"Téléphone/fax :"}]
[]
[{"$f":"IF(ISBLANK($AB$2),\"- - -\",IF('Fiche fournisseur'!$AB$2=\"FR\",INDEX(Data!A:E,MATCH(37,Data!A:A,0),2),IF('Fiche fournisseur'!$AB$2=\"NL\",INDEX(Data!A:E,MATCH(37,Data!A:A,0),3),IF('Fiche fournisseur'!$AB$2=\"DE\",INDEX(Data!A:E,MATCH(37,Data!A:A,0),4),IF('Fiche fournisseur'!$AB$2=\"EN\",INDEX(Data!A:E,MATCH(37,Data!A:A,0),5),\"Langue?\")))))","v":"Infos financières"}]
[{"$f":"IF(ISBLANK($AB$2),\"- - -\",IF('Fiche fournisseur'!$AB$2=\"FR\",INDEX(Data!A:E,MATCH(64,Data!A:A,0),2),IF('Fiche fournisseur'!$AB$2=\"NL\",INDEX(Data!A:E,MATCH(64,Data!A:A,0),3),IF('Fiche fournisseur'!$AB$2=\"DE\",INDEX(Data!A:E,MATCH(64,Data!A:A,0),4),IF('Fiche fournisseur'!$AB$2=\"EN\",INDEX(Data!A:E,MATCH(64,Data!A:A,0),5),\"Langue?\")))))","v":"N° compte bancaire + IBAN/BIC :"}]
[]
[{"$f":"IF(ISBLANK($AB$2),\"- - -\",IF('Fiche fournisseur'!$AB$2=\"FR\",INDEX(Data!A:E,MATCH(56,Data!A:A,0),2),IF('Fiche fournisseur'!$AB$2=\"NL\",INDEX(Data!A:E,MATCH(56,Data!A:A,0),3),IF('Fiche fournisseur'!$AB$2=\"DE\",INDEX(Data!A:E,MATCH(56,Data!A:A,0),4),IF('Fiche fournisseur'!$AB$2=\"EN\",INDEX(Data!A:E,MATCH(56,Data!A:A,0),5),\"Langue?\")))))","v":"TVA/SIREN/SIRET :"}]
[]
[{"$f":"IF(ISBLANK($AB$2),\"- - -\",IF('Fiche fournisseur'!$AB$2=\"FR\",INDEX(Data!A:E,MATCH(43,Data!A:A,0),2),IF('Fiche fournisseur'!$AB$2=\"NL\",INDEX(Data!A:E,MATCH(43,Data!A:A,0),3),IF('Fiche fournisseur'!$AB$2=\"DE\",INDEX(Data!A:E,MATCH(43,Data!A:A,0),4),IF('Fiche fournisseur'!$AB$2=\"EN\",INDEX(Data!A:E,MATCH(43,Data!A:A,0),5),\"Langue?\")))))","v":"Personne de contact"},null,null,{"$f":"IF(ISBLANK($AB$2),\"- - -\",IF('Fiche fournisseur'!$AB$2=\"FR\",INDEX(Data!A:E,MATCH(59,Data!A:A,0),2),IF('Fiche fournisseur'!$AB$2=\"NL\",INDEX(Data!A:E,MATCH(59,Data!A:A,0),3),IF('Fiche fournisseur'!$AB$2=\"DE\",INDEX(Data!A:E,MATCH(59,Data!A:A,0),4),IF('Fiche fournisseur'!$AB$2=\"EN\",INDEX(Data!A:E,MATCH(59,Data!A:A,0),5),\"Langue?\")))))","v":"Service commercial"},{"$nulls":13},{"$f":"IF(ISBLANK($AB$2),\"- - -\",IF('Fiche fournisseur'!$AB$2=\"FR\",INDEX(Data!A:E,MATCH(60,Data!A:A,0),2),IF('Fiche fournisseur'!$AB$2=\"NL\",INDEX(Data!A:E,MATCH(60,Data!A:A,0),3),IF('Fiche fournisseur'!$AB$2=\"DE\",INDEX(Data!A:E,MATCH(60,Data!A:A,0),4),IF('Fiche fournisseur'!$AB$2=\"EN\",INDEX(Data!A:E,MATCH(60,Data!A:A,0),5),\"Langue?\")))))","v":"Service comptabilité"}]
[{"$f":"IF(ISBLANK($AB$2),\"- - -\",IF('Fiche fournisseur'!$AB$2=\"FR\",INDEX(Data!A:E,MATCH(44,Data!A:A,0),2),IF('Fiche fournisseur'!$AB$2=\"NL\",INDEX(Data!A:E,MATCH(44,Data!A:A,0),3),IF('Fiche fournisseur'!$AB$2=\"DE\",INDEX(Data!A:E,MATCH(44,Data!A:A,0),4),IF('Fiche fournisseur'!$AB$2=\"EN\",INDEX(Data!A:E,MATCH(44,Data!A:A,0),5),\"Langue?\")))))","v":"Nom :"}]
[]
[{"$f":"IF(ISBLANK($AB$2),\"- - -\",IF('Fiche fournisseur'!$AB$2=\"FR\",INDEX(Data!A:E,MATCH(61,Data!A:A,0),2),IF('Fiche fournisseur'!$AB$2=\"NL\",INDEX(Data!A:E,MATCH(61,Data!A:A,0),3),IF('Fiche fournisseur'!$AB$2=\"DE\",INDEX(Data!A:E,MATCH(61,Data!A:A,0),4),IF('Fiche fournisseur'!$AB$2=\"EN\",INDEX(Data!A:E,MATCH(61,Data!A:A,0),5),\"Langue?\")))))","v":"Téléphone :"}]
[]
[{"$f":"IF(ISBLANK($AB$2),\"- - -\",IF('Fiche fournisseur'!$AB$2=\"FR\",INDEX(Data!A:E,MATCH(62,Data!A:A,0),2),IF('Fiche fournisseur'!$AB$2=\"NL\",INDEX(Data!A:E,MATCH(62,Data!A:A,0),3),IF('Fiche fournisseur'!$AB$2=\"DE\",INDEX(Data!A:E,MATCH(62,Data!A:A,0),4),IF('Fiche fournisseur'!$AB$2=\"EN\",INDEX(Data!A:E,MATCH(62,Data!A:A,0),5),\"Langue?\")))))","v":"Fax :"}]
[]
[{"$f":"IF(ISBLANK($AB$2),\"- - -\",IF('Fiche fournisseur'!$AB$2=\"FR\",INDEX(Data!A:E,MATCH(14,Data!A:A,0),2),IF('Fiche fournisseur'!$AB$2=\"NL\",INDEX(Data!A:E,MATCH(14,Data!A:A,0),3),IF('Fiche fournisseur'!$AB$2=\"DE\",INDEX(Data!A:E,MATCH(14,Data!A:A,0),4),IF('Fiche fournisseur'!$AB$2=\"EN\",INDEX(Data!A:E,MATCH(14,Data!A:A,0),5),\"Langue?\")))))","v":"E-mail :"}]
[]
[{"$f":"IF(ISBLANK($AB$2),\"- - -\",IF('Fiche fournisseur'!$AB$2=\"FR\",INDEX(Data!A:E,MATCH(68,Data!A:A,0),2),IF('Fiche fournisseur'!$AB$2=\"NL\",INDEX(Data!A:E,MATCH(68,Data!A:A,0),3),IF('Fiche fournisseur'!$AB$2=\"DE\",INDEX(Data!A:E,MATCH(68,Data!A:A,0),4),IF('Fiche fournisseur'!$AB$2=\"EN\",INDEX(Data!A:E,MATCH(68,Data!A:A,0),5),\"Langue?\")))))","v":"Commentaires :"}]
[]
[]
[]
[]
[{"$f":"IF(ISBLANK($AB$2),\"- - -\",IF('Fiche fournisseur'!$AB$2=\"FR\",INDEX(Data!A:E,MATCH(63,Data!A:A,0),2),IF('Fiche fournisseur'!$AB$2=\"NL\",INDEX(Data!A:E,MATCH(63,Data!A:A,0),3),IF('Fiche fournisseur'!$AB$2=\"DE\",INDEX(Data!A:E,MATCH(63,Data!A:A,0),4),IF('Fiche fournisseur'!$AB$2=\"EN\",INDEX(Data!A:E,MATCH(63,Data!A:A,0),5),\"Langue?\")))))","v":"À remplir par le service achats"}]
[{"$f":"IF(ISBLANK($AB$2),\"- - -\",IF('Fiche fournisseur'!$AB$2=\"FR\",INDEX(Data!A:E,MATCH(41,Data!A:A,0),2),IF('Fiche fournisseur'!$AB$2=\"NL\",INDEX(Data!A:E,MATCH(41,Data!A:A,0),3),IF('Fiche fournisseur'!$AB$2=\"DE\",INDEX(Data!A:E,MATCH(41,Data!A:A,0),4),IF('Fiche fournisseur'!$AB$2=\"EN\",INDEX(Data!A:E,MATCH(41,Data!A:A,0),5),\"Langue?\")))))","v":"Cond. paiement/devise/incoterms :"},null,null,"M810<=>0960 (fin du mois suivant, sans déduction)",{"$nulls":8},"EUR",{"$nulls":8},"DDP"]
[]
[{"$f":"IF(ISBLANK($AB$2),\"- - -\",IF('Fiche fournisseur'!$AB$2=\"FR\",INDEX(Data!A:E,MATCH(50,Data!A:A,0),2),IF('Fiche fournisseur'!$AB$2=\"NL\",INDEX(Data!A:E,MATCH(50,Data!A:A,0),3),IF('Fiche fournisseur'!$AB$2=\"DE\",INDEX(Data!A:E,MATCH(50,Data!A:A,0),4),IF('Fiche fournisseur'!$AB$2=\"EN\",INDEX(Data!A:E,MATCH(50,Data!A:A,0),5),\"Langue?\")))))","v":"Groupe acheteur/cpte collectif :"},{"$nulls":16},{"$f":"IF(OR(ISBLANK($D12),$D12=\"\",$D12=\" \"),\"\",IF($D12=\"Interne\",440000,IF($D12=\"Externe\",440100,IF($D12=\"Taxe\",450100,IF($D12=\"Personnel\",489000,\"!!!\")))))","v":""}]
[]
[{"$f":"IF(ISBLANK($AB$2),\"- - -\",IF('Fiche fournisseur'!$AB$2=\"FR\",INDEX(Data!A:E,MATCH(67,Data!A:A,0),2),IF('Fiche fournisseur'!$AB$2=\"NL\",INDEX(Data!A:E,MATCH(67,Data!A:A,0),3),IF('Fiche fournisseur'!$AB$2=\"DE\",INDEX(Data!A:E,MATCH(67,Data!A:A,0),4),IF('Fiche fournisseur'!$AB$2=\"EN\",INDEX(Data!A:E,MATCH(67,Data!A:A,0),5),\"Langue?\")))))","v":"Adresse de commande/Fournisseur FI à lier :"}]
[{"$f":"IF(ISBLANK($AB$2),\"- - -\",IF('Fiche fournisseur'!$AB$2=\"FR\",INDEX(Data!A:E,MATCH(47,Data!A:A,0),2),IF('Fiche fournisseur'!$AB$2=\"NL\",INDEX(Data!A:E,MATCH(47,Data!A:A,0),3),IF('Fiche fournisseur'!$AB$2=\"DE\",INDEX(Data!A:E,MATCH(47,Data!A:A,0),4),IF('Fiche fournisseur'!$AB$2=\"EN\",INDEX(Data!A:E,MATCH(47,Data!A:A,0),5),\"Langue?\")))))","v":"UNIQUEMENT SI DIFFÉRENT"}]

{"sheet":"Feuil1","index":2,"n_rows":0,"n_cols":0,"rows_kept":0,"hidden":true}

{"sheet":"Lists","index":3,"n_rows":7,"n_cols":5,"rows_kept":7}
[null,"Lists",null,"Société","SO"]
[null,"Choose",null,"Choose","Choose"]
[null,217,null,217,217]
[null,83,null,83,83]
[null,84,null,84]
[null,"217 + 83",null,"217 + 83","217 + 83"]
[null,319,null,319]

{"sheet":"Data","index":4,"n_rows":68,"n_cols":5,"rows_kept":68,"hidden":true}
["REF","FR","NL","DE","EN"]
[1,"INFORMATIONS CLIENT","KLANTINFORMATIES","KUNDEINFORMATIONEN","CUSTOMER INFORMATIONS"]
[2,"À remplir par le service commercial","In te vullen door comerciële binnendienst","Durch Handelsabteilung zu kodieren","To be filled by internal sales department"]
[3,"Demandeur :","Aanvrager :","Antragsteller :","Applicant :"]
[4,"Délégué commercial :","Technisch commerciëel afgevaardig :","Außendienstmittarbeiter :","Sales representative :"]
[5,"Nom société+raison sociale/langue :","Firma naam+/Taal :","Firmenname+Bezeichnung/Sprache :","Company Name/Language :"]
[6,"Adresse","Adres","Anschrift","Address"]
[7,"Rue/no :","Straat/huisnr. : ","Straße/Hausnr. :","Street/house nr.:"]
[8,"No. :","Huisnummer :","Anzahl :","Number :"]
[9,"Code postal :","Postcode :","Postleitzahl :","Postal code :"]
[10,"Ville/CP/Pays :","Stad/PC/Land :","Stadt/Postlz./Land :","City/Zip/Country :"]
[11,"No. de TVA (facultatif) :","BTW-Nr. (optioneel) :","MwSt-Nr. (optional) :","VAT number (optional) :"]
[12,"Langue :","Taal :","Sprache :","Language :"]
[13,"Téléphone/fax :","Telefoon/fax :","Telefon/fax :","Phone number/fax:"]
[14,"E-mail :","E-mail :","E-mail :","E-mail :"]
[15,"Type de client :","Klantentyp :","Kundentyp :","Customer type :"]
[16,"PRO","PRO","PRO","PRO"]
[17,"100% BRICO","100% BRICO","100% BRICO","100% BRICO"]
[18,"DIVERS","DIVERSEN","SONSTIGE","MISCELLANEOUS"]
[19,"Liste de prix SAP (PLTYP) :","SAP prijslijst (PLTYP) :","SAP-Preisliste (PLTYP) :","Price list SAP (PLTYP) :"]
[20,"Payeur (Nom & No. SAP) :","Payer (Naam & SAP-Nr.) :","Payer (Nr SAP und Name) :","Payer (SAP No. and name) :"]
[21,"Conditions commerciales :","Algemene voorwaarden :","Allgemeine Geschäftsbedingungen :","Commercial conditions :"]
[22,"Remarques :","Opmerkingen :","Bemerkungen :","Notes :"]
[23,"INFORMATIONS FOURNISSEUR","INFORMATIELEVERANCIER","LIEFERANTINFORMATIONEN","SUPPLIER INFORMATION"]
[24,"À remplir par le service demandeur","In te vullen door de aanvraagdienst","Durch Anforderer Abteilung zu kodieren","To be completed by the requesting department"]
[25,"Date :","Datum :","Datum :","Date :"]
[26,"N° du fournisseur :","Nr leverancier :","Nr. Versorger :","Supplier No. :"]
[27,"Org. Ventes :","Verkauf org. :","Verkoop org. :","Sales org. :"]
[28,"Auteur de la facture :","Auteur van het wetsvoorstel :","Autor des Gesetzentwurfs :","Author of invoice :"]
[29,"Adresse du fournisseur","Leverancieradres","Lieferantadresse ","Supplier address"]
[31,"Lieu :","Plaats :","Platz :","Place :"]
[32,"Pays :","Land :","Land : ","Country :"]
[33,"Langue du fournisseur :","Taal van leverancier :\n","Sprache Versorger :","Language of the supplier :"]
[34,"Tél. général :","Tel. Algemeen :","Tel. General :","Tel. General :"]
[35,"Fax général :","Fax Algemeen :","Fax General :","Fax general :"]
[36,"TVA :","BTW :","MwSt :","VAT :"]
[37,"Infos financières","Financiële informaties","Finanz Informationen","Financial Informations"]
[38,"N° compte bancaire :","Bankrekeningnummer :","Bankkontonummer :","Bank account number :"]
[39,"Nom de la banque :","Naam van de bank :","Name der Bank :","Name of the bank :"]
[40,"Devise de la facture :","Munt bill :","Währungs Rechnung :","Currency of invoice :"]
[41,"Cond. paiement/devise/incoterms :","Betalingstermijn/Incoterms :","Zahlungsfrist/Incoterms :","Payment condition/Incoterms:"]
[42,"Conditions de livraison :","Verzenden algemene/voorwaarden :","Lieferkonditionen :","Delivery Terms :"]
[43,"Personne de contact","Contactpersoon","Ansprechpartner","Contact person"]
[44,"Nom :","Naam :","Name :","Name :"]
[45,"Adresse de commande (où envoyer les commandes d'achat) :","command-adres (waar inkooporders te sturen) :","Befehlsadresse (Wo Bestellungen zu senden) :","Ordering Address (where to send purchase orders) :"]
[46,"Adresse de livraison :","Afleveradres :","Lieferadresse :","Delivery address :"]
[47,"UNIQUEMENT SI DIFFÉRENT","ALLEEN INDIEN AFWIJCKEND","NUR WENN ABWEICHEND","ONLY IF DIFFERENT"]
[48,"ADRESSE DE COMMANDE","ADRES VAN DE BESTELLEN","ADRES VAN DE BESTELLEN","ORDER ADDRESS"]
[49,"FACTURÉ (PAYEUR)","GEFACTUREERDE (BETALER)","RECHNET (ZAHLEN)","INVOICE (PAYER)"]
[50,"Groupe acheteur/cpte collectif :","Inkoopgroep/Meeboekrekening","Einkaufergrüppe/Abstimmkonto","Purchasing group/Reconc. account"]
[51,"Type fournisseur/ rôle partenaire :","Type leverancier","Typ Lieferant","Supplier type"]
[52,"Interne","Intern","Intern","Internal"]
[53,"Externe","External","Extern","Extern"]
[54,"Taxe","Belasting","Steuer","Tax"]
[55,"Personnel","Personeel","Personal","Staff"]
[56,"TVA/SIREN/SIRET :","BTW/SIREN/SIRET :","MwST/SIREN/SIRET :","VAT/SIREN/SIRET :"]
[57,"Société","Venootschap","Unternehmen","Company"]
[58,"Conditions commerciales","Prijscondities","Preiskonditionen","Price conditions"]
[59,"Service commercial","Comerciële dienst","Verkaufsdienst","Sales dept"]
[60,"Service comptabilité","Boekhouding dienst","Buchhaltungsdienst","Accounting dept"]
[61,"Téléphone :","Tefefoon","Telefon :","Phone :"]
[62,"Fax :","Fax :","Fax :","Fax :"]
[63,"À remplir par le service achats","In te vullen door de aankoopdienst","Durch Einkaufs Abteilung zu kodieren","To be completed by the purchasing department"]
[64,"N° compte bancaire + IBAN/BIC :","Bankrekeningnummer + IBAN/BIC :","Bankkontonummer + IBAN/BIC:","Bank account number + IBAN/BIC:"]
[65,"Société/Organ. achats :","Bedrijfsnummer/Inkooporgan. :","Buchungkreis/Einkaufsorg. :","Company/Purchazing org. :"]
[66,"Raison de la demande de création :","Motief : ","Motiv : ","Reason :"]
[67,"Adresse de commande/Fournisseur FI à lier :","Besteladres/Verbonden FI Leverancier :","Bestelladresse/Verbunden FI-Lieferant :","Ordering Address/FI Supplyer to link with :"]
[68,"Commentaires :","Opmerkingen :","Kommentare :","Comments :"]

{"sheet":"FR","index":5,"n_rows":45,"n_cols":22,"rows_kept":45,"hidden":true}
[null,"FICHE CREATION FOURNISSEUR"]
["Demandeur :"]
["Date :"]
["N° du fournisseur"]
["Sales org. :"]
["Auteur de la facture","Nom sté"]
["(adresse de facturation)","Rue / N°"]
[null,"Code Postal"]
[null,"Lieu"]
[null,"Pays"]
[]
[null,"adresse e-mail"]
[]
[null,"Langue du FRN"]
[]
[null,"Tél. général"]
[null,"Fax général"]
[]
[null,"TVA "]
[]
["Info financière","N° compte bancaire"]
[null,"IBAN"]
[null,"SWIFT-BIC"]
[null,"Nom de la banque "]
[null,"Devise de la facture"]
[null,"Conditions de paiement"]
[null,"Conditions de livraison"]
[]
["Personne de contact","Nom"]
["(contact serv. commercial pour","Tél."]
["les commandes d'achat)","E-mail"]
[]
["Adresse de commande","UNIQUEMENT SI DIFFERENTE DE "]
["(où envoyer les commandes d'achat)","L'ADRESSE DE FACTURATION"]
["Adresse de livraison","UNIQUEMENT SI DIFFERENTE DE "]
[null,"L'ADRESSE DE FACTURATION"]
{"$rows_empty":8}
[{"$nulls":3},"M810<=>0960 (fin du mois suivant, sans déduction)",{"$nulls":8},"EUR",{"$nulls":8},"DDP"]

{"sheet":"NL","index":6,"n_rows":34,"n_cols":2,"rows_kept":34,"hidden":true}
[null,"NIEUWE LEVERANCIER"]
["Aanvrager :"]
["Datum : "]
["Leveranciersnr."]
["Sales org."]
["Fakturatieadres ","Firmanaam"]
[null,"Straat, Nr."]
[null,"Postcode"]
[null,"Plaats"]
[null,"Land"]
[]
[null,"e-mail"]
[null,"Taal leverancier"]
[null,"Algemeen Tel. Nr."]
[null,"Algemeen Fax Nr."]
[]
[null,"BTW Nr."]
[]
["Financiële gegevens ","Bankrekening"]
[null,"IBAN"]
[null,"SWIFT-BIC"]
[null,"Naam bank"]
[null,"Invoicing currency"]
[null,"Betalings Munteenheid "]
[null,"Leveringscondities"]
[]
["Contactpersoon","Naam"]
["(comm. dienst voor doorsturen inkooporders)","Tel. Nr."]
[null,"e-mail"]
[]
["Besteladres","ENKEL ALS DIT VERSCHILT"]
["(adres voor doorsturen inkooporders)","VAN HET FAKTURATIEADRES"]
["Leveringsadres","ENKEL ALS DIT VERSCHILT"]
[null,"VAN HET FAKTURATIEADRES"]

{"sheet":"EN","index":7,"n_rows":33,"n_cols":2,"rows_kept":33,"hidden":true}
[null,"NEW SUPPLIER"]
["From :"]
["Date :"]
["SUPPLIER N°"]
["INVOICING ADDRESS","Company Name"]
[null,"Street, N°"]
[null,"ZIP"]
[null,"City"]
[null,"Country"]
[]
[null,"e-mail"]
[null,"Supplier language"]
[null,"General Tel. N°"]
[null,"General Fax N°"]
[]
[null,"VAT N°"]
[]
["Financial data ","Bank account N°"]
[null,"IBAN"]
[null,"SWIFT-BIC"]
[null,"Bank name"]
[null,"Invoicing currency"]
[null,"Payment conditions"]
[null,"Delivery conditions"]
[]
["Contact Person","Name"]
["(commercial dept. for Purchase Orders)","Tel. N°"]
[null,"E-mail"]
[]
["Ordering address","ONLY IF DIFFERENT"]
["(where we send our Purchase orders to) ","FROM THE INVOICING ADDRESS"]
["Delivery address","ONLY IF DIFFERENT"]
[null,"FROM THE INVOICING ADDRESS"]

{"sheet":"Pays","index":8,"n_rows":242,"n_cols":5,"rows_kept":242,"hidden":true}
["#","#2","ISO","Code","Pays"]
[6,20,"AD","AND","Andorra"]
[218,784,"AE","ARE","United Arab Emirates"]
[1,4,"AF","AFG","Afghanistan"]
[8,28,"AG","ATG","Antigua and Barbuda"]
[186,660,"AI","AIA","Anguilla"]
[2,8,"AL","ALB","Albania"]
[16,51,"AM","ARM","Armenia"]
[151,530,"AN","ANT","Netherlands Antilles"]
[7,24,"AO","AGO","Angola"]
[3,10,"AQ","ATA","Antarctica"]
[10,32,"AR","ARG","Argentina"]
[5,16,"AS","ASM","American Samoa"]
[12,40,"AT","AUT","Austria"]
[11,36,"AU","AUS","Australia"]
[152,533,"AW","ABW","Aruba"]
[74,248,"AX","ALA","Ã…land Islands"]
[9,31,"AZ","AZE","Azerbaijan"]
[22,70,"BA","BIH","Bosnia and Herzegovina"]
[17,52,"BB","BRB","Barbados"]
[15,50,"BD","BGD","Bangladesh"]
[18,56,"BE","BEL","Belgium"]
[233,854,"BF","BFA","Burkina Faso"]
[31,100,"BG","BGR","Bulgaria"]
[14,48,"BH","BHR","Bahrain"]
[33,108,"BI","BDI","Burundi"]
[59,204,"BJ","BEN","Benin"]
[19,60,"BM","BMU","Bermuda"]
[30,96,"BN","BRN","Brunei Darussalam"]
[21,68,"BO","BOL","Bolivia"]
[25,76,"BR","BRA","Brazil"]
[13,44,"BS","BHS","Bahamas"]
[20,64,"BT","BTN","Bhutan"]
[24,74,"BV","BVT","Bouvet Island"]
[23,72,"BW","BWA","Botswana"]
[34,112,"BY","BLR","Belarus"]
[26,84,"BZ","BLZ","Belize"]
[37,124,"CA","CAN","Canada"]
[47,166,"CC","CCK","Cocos (Keeling) Islands"]
[52,180,"CD","COD","The Democratic Republic Of The Congo"]
[40,140,"CF","CAF","Central African"]
[51,178,"CG","COG","Republic of the Congo"]
[210,756,"CH","CHE","Switzerland"]
[110,384,"CI","CIV","Côte d'Ivoire"]
[53,184,"CK","COK","Cook Islands"]
[43,152,"CL","CHL","Chile"]
[36,120,"CM","CMR","Cameroon"]
[44,156,"CN","CHN","China"]
[48,170,"CO","COL","Colombia"]
[54,188,"CR","CRI","Costa Rica"]
[240,891,"CS","SCG","Serbia and Montenegro"]
[56,192,"CU","CUB","Cuba"]
[38,132,"CV","CPV","Cape Verde"]
[46,162,"CX","CXR","Christmas Island"]
[57,196,"CY","CYP","Cyprus"]
[58,203,"CZ","CZE","Czech Republic"]
[84,276,"DE","DEU","Germany"]
[79,262,"DJ","DJI","Djibouti"]
[60,208,"DK","DNK","Denmark"]
[61,212,"DM","DMA","Dominica"]
[62,214,"DO","DOM","Dominican Republic"]
[4,12,"DZ","DZA","Algeria"]
[63,218,"EC","ECU","Ecuador"]
[68,233,"EE","EST","Estonia"]
[227,818,"EG","EGY","Egypt"]
[204,732,"EH","ESH","Western Sahara"]
[67,232,"ER","ERI","Eritrea"]
[203,724,"ES","ESP","Spain"]
[66,231,"ET","ETH","Ethiopia"]
[73,246,"FI","FIN","Finland"]
[72,242,"FJ","FJI","Fiji"]
[70,238,"FK","FLK","Falkland Islands"]
[164,583,"FM","FSM","Federated States of Micronesia"]
[69,234,"FO","FRO","Faroe Islands"]
[75,250,"FR","FRA","France"]
[80,266,"GA","GAB","Gabon"]
[228,826,"GB","GBR","United Kingdom"]
[90,308,"GD","GRD","Grenada"]
[81,268,"GE","GEO","Georgia"]
[76,254,"GF","GUF","French Guiana"]
[85,288,"GH","GHA","Ghana"]
[86,292,"GI","GIB","Gibraltar"]
[89,304,"GL","GRL","Greenland"]
[82,270,"GM","GMB","Gambia"]
[94,324,"GN","GIN","Guinea"]
[91,312,"GP","GLP","Guadeloupe"]
[65,226,"GQ","GNQ","Equatorial Guinea"]
[88,300,"GR","GRC","Greece"]
[71,239,"GS","SGS","South Georgia and the South Sandwich Islands"]
[93,320,"GT","GTM","Guatemala"]
[92,316,"GU","GUM","Guam"]
[176,624,"GW","GNB","Guinea-Bissau"]
[95,328,"GY","GUY","Guyana"]
[100,344,"HK","HKG","Hong Kong"]
[97,334,"HM","HMD","Heard Island and McDonald Islands"]
[99,340,"HN","HND","Honduras"]
[55,191,"HR","HRV","Croatia"]
[96,332,"HT","HTI","Haiti"]
[101,348,"HU","HUN","Hungary"]
[104,360,"ID","IDN","Indonesia"]
[107,372,"IE","IRL","Ireland"]
[108,376,"IL","ISR","Israel"]
[229,833,"IM","IMN","Isle of Man"]
[103,356,"IN","IND","India"]
[27,86,"IO","IOT","British Indian Ocean Territory"]
[106,368,"IQ","IRQ","Iraq"]
[105,364,"IR","IRN","Islamic Republic of Iran"]
[102,352,"IS","ISL","Iceland"]
[109,380,"IT","ITA","Italy"]
[111,388,"JM","JAM","Jamaica"]
[114,400,"JO","JOR","Jordan"]
[112,392,"JP","JPN","Japan"]
[115,404,"KE","KEN","Kenya"]
[119,417,"KG","KGZ","Kyrgyzstan"]
[35,116,"KH","KHM","Cambodia"]
[87,296,"KI","KIR","Kiribati"]
[49,174,"KM","COM","Comoros"]
[185,659,"KN","KNA","Saint Kitts and Nevis"]
[116,408,"KP","PRK","Democratic People's Republic of Korea"]
[117,410,"KR","KOR","Republic of Korea"]
[118,414,"KW","KWT","Kuwait"]
[39,136,"KY","CYM","Cayman Islands"]
[113,398,"KZ","KAZ","Kazakhstan"]
[120,418,"LA","LAO","Lao People's Democratic Republic"]
[121,422,"LB","LBN","Lebanon"]
[187,662,"LC","LCA","Saint Lucia"]
[126,438,"LI","LIE","Liechtenstein"]
[41,144,"LK","LKA","Sri Lanka"]
[124,430,"LR","LBR","Liberia"]
[122,426,"LS","LSO","Lesotho"]
[127,440,"LT","LTU","Lithuania"]
[128,442,"LU","LUX","Luxembourg"]
[123,428,"LV","LVA","Latvia"]
[125,434,"LY","LBY","Libyan Arab Jamahiriya"]
[144,504,"MA","MAR","Morocco"]
[140,492,"MC","MCO","Monaco"]
[142,498,"MD","MDA","Republic of Moldova"]
[130,450,"MG","MDG","Madagascar"]
[165,584,"MH","MHL","Marshall Islands"]
[226,807,"MK","MKD","The Former Yugoslav Republic of Macedonia"]
[134,466,"ML","MLI","Mali"]
[32,104,"MM","MMR","Myanmar"]
[141,496,"MN","MNG","Mongolia"]
[129,446,"MO","MAC","Macao"]
[162,580,"MP","MNP","Northern Mariana Islands"]
[136,474,"MQ","MTQ","Martinique"]
[137,478,"MR","MRT","Mauritania"]
[143,500,"MS","MSR","Montserrat"]
[135,470,"MT","MLT","Malta"]
[138,480,"MU","MUS","Mauritius"]
[133,462,"MV","MDV","Maldives"]
[131,454,"MW","MWI","Malawi"]
[139,484,"MX","MEX","Mexico"]
[132,458,"MY","MYS","Malaysia"]
[145,508,"MZ","MOZ","Mozambique"]
[147,516,"NA","NAM","Namibia"]
[153,540,"NC","NCL","New Caledonia"]
[157,562,"NE","NER","Niger"]
[160,574,"NF","NFK","Norfolk Island"]
[158,566,"NG","NGA","Nigeria"]
[156,558,"NI","NIC","Nicaragua"]
[150,528,"NL","NLD","Netherlands"]
[161,578,"NO","NOR","Norway"]
[149,524,"NP","NPL","Nepal"]
[148,520,"NR","NRU","Nauru"]
[159,570,"NU","NIU","Niue"]
[155,554,"NZ","NZL","New Zealand"]
[146,512,"OM","OMN","Oman"]
[168,591,"PA","PAN","Panama"]
[171,604,"PE","PER","Peru"]
[77,258,"PF","PYF","French Polynesia"]
[169,598,"PG","PNG","Papua New Guinea"]
[172,608,"PH","PHL","Philippines"]
[167,586,"PK","PAK","Pakistan"]
[174,616,"PL","POL","Poland"]
[188,666,"PM","SPM","Saint-Pierre and Miquelon"]
[173,612,"PN","PCN","Pitcairn"]
[178,630,"PR","PRI","Puerto Rico"]
[83,275,"PS","PSE","Occupied Palestinian Territory"]
[175,620,"PT","PRT","Portugal"]
[166,585,"PW","PLW","Palau"]
[170,600,"PY","PRY","Paraguay"]
[179,634,"QA","QAT","Qatar"]
[180,638,"RE","REU","RÃ©union"]
[181,642,"RO","ROU","Romania"]
[182,643,"RU","RUS","Russian Federation"]
[183,646,"RW","RWA","Rwanda"]
[192,682,"SA","SAU","Saudi Arabia"]
[28,90,"SB","SLB","Solomon Islands"]
[194,690,"SC","SYC","Seychelles"]
[205,736,"SD","SDN","Sudan"]
[209,752,"SE","SWE","Sweden"]
[196,702,"SG","SGP","Singapore"]
[184,654,"SH","SHN","Saint Helena"]
[199,705,"SI","SVN","Slovenia"]
[207,744,"SJ","SJM","Svalbard and Jan Mayen"]
[197,703,"SK","SVK","Slovakia"]
[195,694,"SL","SLE","Sierra Leone"]
[190,674,"SM","SMR","San Marino"]
[193,686,"SN","SEN","Senegal"]
[200,706,"SO","SOM","Somalia"]
[206,740,"SR","SUR","Suriname"]
[191,678,"ST","STP","Sao Tome and Principe"]
[64,222,"SV","SLV","El Salvador"]
[211,760,"SY","SYR","Syrian Arab Republic"]
[208,748,"SZ","SWZ","Swaziland"]
[222,796,"TC","TCA","Turks and Caicos Islands"]
[42,148,"TD","TCD","Chad"]
[78,260,"TF","ATF","French Southern Territories"]
[214,768,"TG","TGO","Togo"]
[213,764,"TH","THA","Thailand"]
[212,762,"TJ","TJK","Tajikistan"]
[215,772,"TK","TKL","Tokelau"]
[177,626,"TL","TLS","Timor-Leste"]
[221,795,"TM","TKM","Turkmenistan"]
[219,788,"TN","TUN","Tunisia"]
[216,776,"TO","TON","Tonga"]
[220,792,"TR","TUR","Turkey"]
[217,780,"TT","TTO","Trinidad and Tobago"]
[223,798,"TV","TUV","Tuvalu"]
[45,158,"TW","TWN","Taiwan"]
[230,834,"TZ","TZA","United Republic Of Tanzania"]
[225,804,"UA","UKR","Ukraine"]
[224,800,"UG","UGA","Uganda"]
[163,581,"UM","UMI","United States Minor Outlying Islands"]
[231,840,"US","USA","United States"]
[234,858,"UY","URY","Uruguay"]
[235,860,"UZ","UZB","Uzbekistan"]
[98,336,"VA","VAT","Vatican City State"]
[189,670,"VC","VCT","Saint Vincent and the Grenadines"]
[236,862,"VE","VEN","Venezuela"]
[29,92,"VG","VGB","British Virgin Islands"]
[232,850,"VI","VIR","U.S. Virgin Islands"]
[198,704,"VN","VNM","Vietnam"]
[154,548,"VU","VUT","Vanuatu"]
[237,876,"WF","WLF","Wallis and Futuna"]
[238,882,"WS","WSM","Samoa"]
[239,887,"YE","YEM","Yemen"]
[50,175,"YT","MYT","Mayotte"]
[201,710,"ZA","ZAF","South Africa"]
[241,894,"ZM","ZMB","Zambia"]
[202,716,"ZW","ZWE","Zimbabwe"]

{"sheet":"Cond.paiement","index":9,"n_rows":106,"n_cols":4,"rows_kept":106,"hidden":true}
["P12_035","PG1_200","Description","Conca"]
["0010","1020","0% discount for cash payment",{"$f":"$A2&\"<=>\"&B2","v":"0010<=>1020"}]
["0300","1050","paiement immédiat, 3% escompte",{"$f":"$A3&\"<=>\"&B3","v":"0300<=>1050"}]
["A230",1040,"dans les 21 jours, 2% escompte","A230<=>1040"]
["A260",1040,"dans les 21 jours, 2% escompte","A260<=>1040"]
["A360",1080,"dans les 21 jours, 3% escompte","A360<=>1080"]
["DO10","0180","domicilié : 3%, 10 jours","DO10<=>0180"]
["DO12","0385","domicilié : 2%, 15 jours","DO12<=>0385"]
["DO15","0006","domicilié : 3%, 15 jours","DO15<=>0006"]
["DO30","N030","domicilié : 0%, 30 jours","DO30<=>N030"]
["DO31","0500","domicilié : 1%, 30 jours","DO31<=>0500"]
["DO32","0530","domicilié : 2%, 30 jours","DO32<=>0530"]
["DOM1","0038","domicilié : 1%, 5 jours","DOM1<=>0038"]
["DOM2","0040","domicilié : 2%, 5 jours","DOM2<=>0040"]
["DOM3","0050","domicilié : 3%, 5 jours","DOM3<=>0050"]
["DOM4","0061","domicilié : 4%, 5 jours","DOM4<=>0061"]
["DOM5","0020","domicilié : 5%, 5 jours","DOM5<=>0020"]
["F001","0118","dans les 8 jours, 2% escompte","F001<=>0118"]
["F060","0165","dans les 8 jours, 1% escompte","F060<=>0165"]
["F080","0169","dans les 8 jours, 1% escompte","F080<=>0169"]
["F110","0115","dans les 8 jours, 1,5% escompte","F110<=>0115"]
["F120","0177","dans les 8 jours, 1,5% escompte","F120<=>0177"]
["F130",1025,"dans les 8 jours, 1,5% escompte","F130<=>1025"]
["F140","0177","dans les 8 jours, 1,5% escompte","F140<=>0177"]
["F160","0125","dans les 8 jours, 2% escompte","F160<=>0125"]
["F170","0126","dans les 8 jours, 2% escompte","F170<=>0126"]
["F180","0126","dans les 8 jours, 2% escompte","F180<=>0126"]
["F200","0126","dans les 8 jours, 2% escompte","F200<=>0126"]
["F260","0130","dans les 8 jours, 3% escompte","F260<=>0130"]
["F280","0133","dans les 8 jours, 3% escompte","F280<=>0133"]
["F310","0160","dans les 8 jours, 4% escompte","F310<=>0160"]
["F315","0590","dans les 30 jours, 4% escompte","F315<=>0590"]
["F316","0620","dans les 30 jours, 5% escompte","F316<=>0620"]
["F340","0162","dans les 8 jours, 4% escompte","F340<=>0162"]
["F360","0163","dans les 8 jours, 5% escompte","F360<=>0163"]
["F460","0360","dans les 15 jours, 1% escompte","F460<=>0360"]
["F470","0365","dans les 15 jours, 1% escompte","F470<=>0365"]
["F480","0370","dans les 15 jours, 1% escompte","F480<=>0370"]
["F510","0377","dans les 15 jours, 1,5% escompte","F510<=>0377"]
["F520","0379","dans les 15 jours, 1,5% escompte","F520<=>0379"]
["F530","0380","dans les 15 jours, 1,5% escompte","F530<=>0380"]
["F560","0390","dans les 15 jours, 2% escompte","F560<=>0390"]
["F570","0395","dans les 15 jours, 2% escompte","F570<=>0395"]
["F580","0400","dans les 15 jours, 2% escompte","F580<=>0400"]
["F660","0410","dans les 15 jours, 3% escompte","F660<=>0410"]
["F680","0412","dans les 15 jours, 3% escompte","F680<=>0412"]
["F710","0340","dans les 15 jours, 4% escompte","F710<=>0340"]
["F760","0345","dans les 15 jours, 5% escompte","F760<=>0345"]
["F805","N015","dans les 15 jours, sans déduction","F805<=>N015"]
["F808","N008","dans le 8 jours, sans déduction","F808<=>N008"]
["F810","N030","dans les 30 jours, sans déduction","F810<=>N030"]
["F820","0505","dans les 30 jours, 1% escompte","F820<=>0505"]
["F821","N021","dans les 21 jours, sans déduction","F821<=>N021"]
["F822","B355","dans les 30 jours, 2% escompte","F822<=>B355"]
["F825","N045","dans les 45 jours, sans déduction","F825<=>N045"]
["F830","N060","dans les 60 jours, sans déduction","F830<=>N060"]
["F835","N075","dans les 75 jours, sans déduction","F835<=>N075"]
["F840","N090","dans les 90 jours, sans déduction","F840<=>N090"]
["F850","N120","dans les 120 jours, sans déduction","F850<=>N120"]
["F860","0550","dans les 30 jours, 3% escompte","F860<=>0550"]
["F865","0499","dans les 30 jours, 0,5% escompte","F865<=>0499"]
["F870","0450","dans les 20 jours, 3% escompte","F870<=>0450"]
["F885","0723","dans les 60 jours, 2% escompte","F885<=>0723"]
["F900","0692","dans les 45 jours, 3% escompte","F900<=>0692"]
["F912",1315,"pour facturation jusqu'au 5 du mois","F912<=>1315"]
["F913",1325,"pour facturation jusqu'au 5 du mois","F913<=>1325"]
["I010","1020","payable immédiatement sans déduction",{"$f":"$A67&\"<=>\"&B67","v":"I010<=>1020"}]
["I031","1023","payable immédiatement, 1% escompte","I031<=>1023"]
["I035","1025","payable immédiatement, 1,5% escompte","I035<=>1025"]
["I050","1215","payable immédiatement, 2% escompte","I050<=>1215"]
["I051","1040","payable immédiatement, 2% escompte","I051<=>1040"]
["I070","1230","payable immédiatement, 3% escompte","I070<=>1230"]
["I071","1080","payable immédiatement, 3% escompte","I071<=>1080"]
["I080","1060","payable immédiatement, 4% escompte","I080<=>1060"]
["J010",961,"jusqu'au 10 dans 2 mois, sans déduction","J010<=>961"]
["J011","0735","jusqu'au 10 dans 2 mois, 2% escompte","J011<=>0735"]
["J020","0890","jusqu'au 15 dans 2 mois, sans déduction","J020<=>0890"]
["J030","0890","jusqu'au 20 dans 2 mois, sans déduction","J030<=>0890"]
["J040","0740","jusqu'au 10 dans 3 mois, sans déduction","J040<=>0740"]
["J050","0900","jusqu'au 15 dans 3 mois, sans déduction","J050<=>0900"]
["J060","0900","jusqu'au 20 dans 3 mois, sans déduction","J060<=>0900"]
["J070","0870","jusqu'au 10 dans 4 mois, sans déduction","J070<=>0870"]
["J080","0870","jusqu'au 15 dans 4 mois, sans déduction","J080<=>0870"]
["J100","0875","jusqu'au 10 dans 5 mois, sans déduction","J100<=>0875"]
["M160","0172","dans les 8 jours, 2% escompte","M160<=>0172"]
["M180","0126","dans les 8 jours, 2% escompte","M180<=>0126"]
["M210",1040,"dans les 8 jours, 2,5% escompte","M210<=>1040"]
["M260","0200","dans les 8 jours, 3% escompte","M260<=>0200"]
["M460","0360","dans les 15 jours, 1% escompte","M460<=>0360"]
["M480","0370","dans les 15 jours, 1% escompte","M480<=>0370"]
["M560","0172","dans les 15 jours, 2% escompte","M560<=>0172"]
["M580","0420","dans les 15 jours, 2% escompte","M580<=>0420"]
["M630",1045,"dans les 15 jours, 2,5% escompte","M630<=>1045"]
["M660","0430","dans les 15 jours, 3% escompte","M660<=>0430"]
["M680","0412","dans les 15 jours, 3% escompte","M680<=>0412"]
["M710",1100,"dans les 15 jours, 4% escompte","M710<=>1100"]
["M730",1100,"dans les 15 jours, 4% escompte","M730<=>1100"]
["M780",1120,"dans les 15 jours, 5% escompte","M780<=>1120"]
["M810","0960","fin du mois suivant, sans déduction","M810<=>0960"]
["M820","B395","fin du mois suivant, 2% escompte","M820<=>B395"]
["M830",755,"fin dans 2 mois, sans déduction","M830<=>755"]
["M840","0760","fin dans 3 mois, sans déduction","M840<=>0760"]
["M850","B395","fin dans 4 mois, sans déduction","M850<=>B395"]
["M860",754,"fin du mois, sans déduction","M860<=>754"]
["M870","0885","jusqu'au 15 du mois suivant, sans déduction","M870<=>0885"]
["NL00","1020","payable immédiatement, sans déduction","NL00<=>1020"]

{"sheet":"Groupes d'acheteurs","index":10,"n_rows":1540,"n_cols":3,"rows_kept":1540,"hidden":true}
["GAc","Désignation","Conca"]
[1,"k",{"$f":"A2&\" (\"&$B2&\")\"","v":"1 (k)"}]
[2,"k",{"$f":"A3&\" (\"&$B3&\")\"","v":"2 (k)"}]
[3,"k","3 (k)"]
[4,"k","4 (k)"]
[5,"k","5 (k)"]
[6,"k","6 (k)"]
[7,"k","7 (k)"]
[8,"k","8 (k)"]
[9,"k","9 (k)"]
[10,"k","10 (k)"]
[11,"k","11 (k)"]
[12,"k","12 (k)"]
[13,"k","13 (k)"]
[14,"k","14 (k)"]
[15,"k","15 (k)"]
[16,"k","16 (k)"]
[17,"k","17 (k)"]
[18,"k","18 (k)"]
[19,"k","19 (k)"]
[20,"k","20 (k)"]
[21,"k","21 (k)"]
[22,"k","22 (k)"]
[23,"k","23 (k)"]
[24,"k","24 (k)"]
[25,"k","25 (k)"]
[26,"k","26 (k)"]
[27,"k","27 (k)"]
[28,"k","28 (k)"]
[29,"k","29 (k)"]
[30,"k","30 (k)"]
[31,"k","31 (k)"]
[32,"k","32 (k)"]
[33,"k","33 (k)"]
[34,"k","34 (k)"]
[35,"k","35 (k)"]
[36,"k","36 (k)"]
[50,"k","50 (k)"]
[51,"k","51 (k)"]
[52,"k","52 (k)"]
[53,"k","53 (k)"]
[54,"k","54 (k)"]
[55,"k","55 (k)"]
[56,"k","56 (k)"]
[57,"k","57 (k)"]
[58,"k","58 (k)"]
[59,"k","59 (k)"]
[60,"k","60 (k)"]
[61,"k","61 (k)"]
[62,"k","62 (k)"]
[63,"k","63 (k)"]
[64,"k","64 (k)"]
[66,"k","66 (k)"]
[68,"k","68 (k)"]
[69,"k","69 (k)"]
[70,"k","70 (k)"]
[71,"k","71 (k)"]
[72,"k","72 (k)"]
[73,"k","73 (k)"]
[74,"k","74 (k)"]
[75,"k","75 (k)"]
[76,"k","76 (k)"]
[77,"k","77 (k)"]
[78,"k","78 (k)"]
[79,"k","79 (k)"]
[80,"k","80 (k)"]
[81,"k",{"$f":"A67&\" (\"&$B67&\")\"","v":"81 (k)"}]
[82,"k","82 (k)"]
[83,"k","83 (k)"]
[84,"k","84 (k)"]
[85,"k","85 (k)"]
[86,"k","86 (k)"]
[87,"k","87 (k)"]
[88,"k","88 (k)"]
[89,"k","89 (k)"]
[90,"k","90 (k)"]
[91,"k","91 (k)"]
[92,"k","92 (k)"]
[93,"k","93 (k)"]
[94,"k","94 (k)"]
[95,"k","95 (k)"]
[96,"k","96 (k)"]
[97,"k","97 (k)"]
[98,"k","98 (k)"]
[99,"k","99 (k)"]
[100,"k","100 (k)"]
[101,"k","101 (k)"]
[102,"k","102 (k)"]
[103,"k","103 (k)"]
[104,"k","104 (k)"]
[105,"k","105 (k)"]
[106,"k","106 (k)"]
[107,"k","107 (k)"]
[108,"k","108 (k)"]
[109,"k","109 (k)"]
[110,"k","110 (k)"]
[111,"k","111 (k)"]
[112,"k","112 (k)"]
[113,"k","113 (k)"]
[114,"k","114 (k)"]
[115,"k","115 (k)"]
[116,"k","116 (k)"]
[117,"k","117 (k)"]
[118,"k","118 (k)"]
[119,"k","119 (k)"]
[120,"k","120 (k)"]
[121,"k","121 (k)"]
[122,"k","122 (k)"]
[123,"k","123 (k)"]
[124,"k","124 (k)"]
[125,"k","125 (k)"]
[126,"k","126 (k)"]
[127,"k","127 (k)"]
[128,"k","128 (k)"]
[129,"k","129 (k)"]
[130,"k","130 (k)"]
[131,"k","131 (k)"]
[132,"k","132 (k)"]
[133,"k","133 (k)"]
[134,"k","134 (k)"]
[135,"k","135 (k)"]
[136,"k","136 (k)"]
[137,"k","137 (k)"]
[138,"k","138 (k)"]
[139,"k","139 (k)"]
[140,"k","140 (k)"]
[141,"k","141 (k)"]
[142,"k","142 (k)"]
[143,"k","143 (k)"]
[144,"k","144 (k)"]
[145,"k",{"$f":"A131&\" (\"&$B131&\")\"","v":"145 (k)"}]
[146,"k","146 (k)"]
[147,"k","147 (k)"]
[148,"k","148 (k)"]
[149,"k","149 (k)"]
[150,"k","150 (k)"]
[151,"k","151 (k)"]
[152,"k","152 (k)"]
[153,"k","153 (k)"]
[154,"k","154 (k)"]
[155,"k","155 (k)"]
[156,"k","156 (k)"]
[157,"k","157 (k)"]
[158,"k","158 (k)"]
[159,"k","159 (k)"]
[160,"k","160 (k)"]
[161,"k","161 (k)"]
[162,"k","162 (k)"]
[163,"k","163 (k)"]
[164,"k","164 (k)"]
[165,"k","165 (k)"]
[166,"k","166 (k)"]
[167,"k","167 (k)"]
[168,"k","168 (k)"]
[169,"k","169 (k)"]
[170,"k","170 (k)"]
[171,"k","171 (k)"]
[172,"k","172 (k)"]
[173,"k","173 (k)"]
[174,"k","174 (k)"]
[175,"k","175 (k)"]
[176,"k","176 (k)"]
[177,"k","177 (k)"]
[178,"k","178 (k)"]
[179,"k","179 (k)"]
[180,"k","180 (k)"]
[181,"k","181 (k)"]
[182,"k","182 (k)"]
[183,"k","183 (k)"]
[184,"k","184 (k)"]
[185,"k","185 (k)"]
[186,"k","186 (k)"]
[187,"k","187 (k)"]
[188,"k","188 (k)"]
[189,"k","189 (k)"]
[190,"k","190 (k)"]
[191,"k","191 (k)"]
[192,"k","192 (k)"]
[193,"k","193 (k)"]
[194,"k","194 (k)"]
[195,"k","195 (k)"]
[196,"k","196 (k)"]
[197,"k","197 (k)"]
[198,"k","198 (k)"]
[199,"k","199 (k)"]
[200,"k","200 (k)"]
[201,"k","201 (k)"]
[202,"k","202 (k)"]
[203,"k","203 (k)"]
[204,"k","204 (k)"]
[205,"k","205 (k)"]
[206,"k","206 (k)"]
[207,"k","207 (k)"]
[208,"k","208 (k)"]
[209,"k",{"$f":"A195&\" (\"&$B195&\")\"","v":"209 (k)"}]
[210,"k","210 (k)"]
[211,"k","211 (k)"]
[212,"k","212 (k)"]
[213,"k","213 (k)"]
[214,"k","214 (k)"]
[215,"k","215 (k)"]
[216,"k","216 (k)"]
[217,"k","217 (k)"]
[218,"k","218 (k)"]
[219,"k","219 (k)"]
[220,"k","220 (k)"]
[221,"k","221 (k)"]
[222,"k","222 (k)"]
[223,"k","223 (k)"]
[224,"k","224 (k)"]
[225,"k","225 (k)"]
[226,"k","226 (k)"]
[227,"k","227 (k)"]
[228,"k","228 (k)"]
[229,"k","229 (k)"]
[230,"k","230 (k)"]
[231,"k","231 (k)"]
[232,"k","232 (k)"]
[233,"k","233 (k)"]
[234,"k","234 (k)"]
[235,"k","235 (k)"]
[236,"k","236 (k)"]
[237,"k","237 (k)"]
[238,"k","238 (k)"]
[239,"k","239 (k)"]
[240,"k","240 (k)"]
[241,"k","241 (k)"]
[242,"k","242 (k)"]
[243,"k","243 (k)"]
[244,"k","244 (k)"]
[245,"k","245 (k)"]
[246,"k","246 (k)"]
[247,"k","247 (k)"]
[248,"k","248 (k)"]
[249,"k","249 (k)"]
[250,"k","250 (k)"]
[251,"k","251 (k)"]
[252,"k","252 (k)"]
[253,"k","253 (k)"]
[254,"k","254 (k)"]
[255,"k","255 (k)"]
[256,"k","256 (k)"]
[257,"k","257 (k)"]
[258,"k","258 (k)"]
[259,"k","259 (k)"]
[260,"k","260 (k)"]
[261,"k","261 (k)"]
[262,"k","262 (k)"]
[263,"k","263 (k)"]
[264,"k","264 (k)"]
[265,"k","265 (k)"]
[266,"k","266 (k)"]
[267,"k","267 (k)"]
[268,"k","268 (k)"]
[269,"k","269 (k)"]
[270,"k","270 (k)"]
[271,"k","271 (k)"]
[272,"k","272 (k)"]
[273,"k",{"$f":"A259&\" (\"&$B259&\")\"","v":"273 (k)"}]
[274,"k","274 (k)"]
[275,"k","275 (k)"]
[276,"k","276 (k)"]
[277,"k","277 (k)"]
[278,"k","278 (k)"]
[279,"k","279 (k)"]
[280,"k","280 (k)"]
[281,"k","281 (k)"]
[282,"k","282 (k)"]
[283,"k","283 (k)"]
[284,"k","284 (k)"]
[285,"k","285 (k)"]
[286,"k","286 (k)"]
[287,"k","287 (k)"]
[288,"k","288 (k)"]
[289,"k","289 (k)"]
[290,"k","290 (k)"]
[291,"k","291 (k)"]
[292,"k","292 (k)"]
[293,"k","293 (k)"]
[294,"k","294 (k)"]
[295,"k","295 (k)"]
[296,"k","296 (k)"]
[297,"k","297 (k)"]
[298,"k","298 (k)"]
[299,"k","299 (k)"]
[300,"k","300 (k)"]
[301,"k","301 (k)"]
[302,"k","302 (k)"]
[303,"k","303 (k)"]
[304,"k","304 (k)"]
[305,"k","305 (k)"]
[306,"k","306 (k)"]
[307,"k","307 (k)"]
[308,"k","308 (k)"]
[309,"k","309 (k)"]
[310,"k","310 (k)"]
[311,"k","311 (k)"]
[312,"k","312 (k)"]
[313,"k","313 (k)"]
[314,"k","314 (k)"]
[315,"k","315 (k)"]
[316,"k","316 (k)"]
[317,"k","317 (k)"]
[318,"k","318 (k)"]
[319,"k","319 (k)"]
[320,"k","320 (k)"]
[321,"k","321 (k)"]
[322,"k","322 (k)"]
[323,"k","323 (k)"]
[324,"k","324 (k)"]
[325,"k","325 (k)"]
[326,"k","326 (k)"]
[327,"k","327 (k)"]
[328,"k","328 (k)"]
[329,"k","329 (k)"]
[330,"k","330 (k)"]
[331,"k","331 (k)"]
[332,"k","332 (k)"]
[333,"k","333 (k)"]
[334,"k","334 (k)"]
[335,"k","335 (k)"]
[336,"k","336 (k)"]
[337,"k",{"$f":"A323&\" (\"&$B323&\")\"","v":"337 (k)"}]
[338,"k","338 (k)"]
[339,"k","339 (k)"]
[340,"k","340 (k)"]
[341,"k","341 (k)"]
[342,"k","342 (k)"]
[343,"k","343 (k)"]
[344,"k","344 (k)"]
[345,"k","345 (k)"]
[346,"k","346 (k)"]
[347,"k","347 (k)"]
[348,"k","348 (k)"]
[349,"k","349 (k)"]
[350,"k","350 (k)"]
[351,"k","351 (k)"]
[352,"k","352 (k)"]
[353,"k","353 (k)"]
[354,"k","354 (k)"]
[355,"k","355 (k)"]
[356,"k","356 (k)"]
[357,"k","357 (k)"]
[358,"k","358 (k)"]
[359,"k","359 (k)"]
[360,"k","360 (k)"]
[361,"k","361 (k)"]
[362,"k","362 (k)"]
[363,"k","363 (k)"]
[364,"k","364 (k)"]
[365,"k","365 (k)"]
[366,"k","366 (k)"]
[367,"k","367 (k)"]
[368,"k","368 (k)"]
[369,"k","369 (k)"]
[370,"k","370 (k)"]
[371,"k","371 (k)"]
[372,"k","372 (k)"]
[373,"k","373 (k)"]
[374,"k","374 (k)"]
[375,"k","375 (k)"]
[376,"k","376 (k)"]
[377,"k","377 (k)"]
[378,"k","378 (k)"]
[379,"k","379 (k)"]
[380,"k","380 (k)"]
[381,"k","381 (k)"]
[382,"k","382 (k)"]
[383,"k","383 (k)"]
[384,"k","384 (k)"]
[385,"k","385 (k)"]
[386,"k","386 (k)"]
[387,"k","387 (k)"]
[388,"k","388 (k)"]
[389,"k","389 (k)"]
[390,"k","390 (k)"]
[391,"k","391 (k)"]
[392,"k","392 (k)"]
[393,"k","393 (k)"]
[394,"k","394 (k)"]
[395,"k","395 (k)"]
[396,"k","396 (k)"]
[397,"k","397 (k)"]
[398,"k","398 (k)"]
[399,"k","399 (k)"]
[400,"k","400 (k)"]
[401,"k",{"$f":"A387&\" (\"&$B387&\")\"","v":"401 (k)"}]
[402,"k","402 (k)"]
[403,"k","403 (k)"]
[404,"k","404 (k)"]
[405,"k","405 (k)"]
[406,"k","406 (k)"]
[407,"k","407 (k)"]
[408,"k","408 (k)"]
[409,"k","409 (k)"]
[410,"k","410 (k)"]
[411,"k","411 (k)"]
[412,"k","412 (k)"]
[413,"k","413 (k)"]
[414,"k","414 (k)"]
[415,"k","415 (k)"]
[416,"k","416 (k)"]
[417,"k","417 (k)"]
[418,"k","418 (k)"]
[419,"k","419 (k)"]
[420,"k","420 (k)"]
[421,"k","421 (k)"]
[422,"k","422 (k)"]
[423,"k","423 (k)"]
[424,"k","424 (k)"]
[425,"k","425 (k)"]
[426,"k","426 (k)"]
[427,"k","427 (k)"]
[428,"k","428 (k)"]
[430,"k","430 (k)"]
[431,"k","431 (k)"]
[432,"k","432 (k)"]
[433,"k","433 (k)"]
[434,"k","434 (k)"]
[435,"k","435 (k)"]
[436,"k","436 (k)"]
[437,"k","437 (k)"]
[438,"k","438 (k)"]
[439,"k","439 (k)"]
[440,"k","440 (k)"]
[441,"k","441 (k)"]
[442,"k","442 (k)"]
[443,"k","443 (k)"]
[444,"k","444 (k)"]
[445,"k","445 (k)"]
[446,"k","446 (k)"]
[447,"k","447 (k)"]
[448,"k","448 (k)"]
[449,"k","449 (k)"]
[450,"k","450 (k)"]
[451,"k","451 (k)"]
[452,"k","452 (k)"]
["A01","k","A01 (k)"]
["A02","k","A02 (k)"]
["A03","k","A03 (k)"]
["A04","k","A04 (k)"]
["A05","k","A05 (k)"]
["A06","k","A06 (k)"]
["A07","k","A07 (k)"]
["A08","k","A08 (k)"]
["A09","k","A09 (k)"]
["A10","k","A10 (k)"]
["A11","k","A11 (k)"]
["A12","k","A12 (k)"]
["A13","k","A13 (k)"]
["A14","k",{"$f":"A451&\" (\"&$B451&\")\"","v":"A14 (k)"}]
["A15","k","A15 (k)"]
["A16","k","A16 (k)"]
["A17","k","A17 (k)"]
["A18","k","A18 (k)"]
["A19","k","A19 (k)"]
["A20","k","A20 (k)"]
["A21","k","A21 (k)"]
["A22","k","A22 (k)"]
["A23","k","A23 (k)"]
["A24","k","A24 (k)"]
["A25","k","A25 (k)"]
["A26","k","A26 (k)"]
["A27","k","A27 (k)"]
["A28","k","A28 (k)"]
["A29","k","A29 (k)"]
["A30","k","A30 (k)"]
["A31","k","A31 (k)"]
["A32","k","A32 (k)"]
["A33","k","A33 (k)"]
["A34","k","A34 (k)"]
["A35","k","A35 (k)"]
["A36","k","A36 (k)"]
["A37","k","A37 (k)"]
["A38","k","A38 (k)"]
["A39","k","A39 (k)"]
["A40","k","A40 (k)"]
["A41","k","A41 (k)"]
["A42","k","A42 (k)"]
["A99","k","A99 (k)"]
["B01","k","B01 (k)"]
["B02","k","B02 (k)"]
["B03","k","B03 (k)"]
["B04","k","B04 (k)"]
["B21","k","B21 (k)"]
["B22","k","B22 (k)"]
["B23","k","B23 (k)"]
["B24","k","B24 (k)"]
["B25","k","B25 (k)"]
["B41","k","B41 (k)"]
["B42","k","B42 (k)"]
["B43","k","B43 (k)"]
["B44","k","B44 (k)"]
["B45","k","B45 (k)"]
["B46","k","B46 (k)"]
["B47","k","B47 (k)"]
["B48","k","B48 (k)"]
["B49","k","B49 (k)"]
["C01","k","C01 (k)"]
["C02","k","C02 (k)"]
["C03","k","C03 (k)"]
["C04","k","C04 (k)"]
["C05","k","C05 (k)"]
["C06","k","C06 (k)"]
["C07","k","C07 (k)"]
["C08","k","C08 (k)"]
["C09","k","C09 (k)"]
["C10","k","C10 (k)"]
["C11","k","C11 (k)"]
["C12","k","C12 (k)"]
["C13","k","C13 (k)"]
["C14","k","C14 (k)"]
["C51","k","C51 (k)"]
["C52","k","C52 (k)"]
["C53","k",{"$f":"A515&\" (\"&$B515&\")\"","v":"C53 (k)"}]
["C54","k","C54 (k)"]
["C55","k","C55 (k)"]
["C56","k","C56 (k)"]
["C57","k","C57 (k)"]
["C58","k","C58 (k)"]
["C59","k","C59 (k)"]
["C60","k","C60 (k)"]
["C61","k","C61 (k)"]
["C62","k","C62 (k)"]
["D01","k","D01 (k)"]
["D02","k","D02 (k)"]
["D03","k","D03 (k)"]
["D04","k","D04 (k)"]
["D05","k","D05 (k)"]
["D06","k","D06 (k)"]
["D07","k","D07 (k)"]
["D08","k","D08 (k)"]
["D09","k","D09 (k)"]
["D10","k","D10 (k)"]
["D11","k","D11 (k)"]
["D12","k","D12 (k)"]
["D13","k","D13 (k)"]
["D14","k","D14 (k)"]
["D15","k","D15 (k)"]
["D16","k","D16 (k)"]
["D17","k","D17 (k)"]
["D18","k","D18 (k)"]
["D19","k","D19 (k)"]
["D20","k","D20 (k)"]
["D21","k","D21 (k)"]
["D22","k","D22 (k)"]
["D23","k","D23 (k)"]
["D24","k","D24 (k)"]
["D25","k","D25 (k)"]
["D26","k","D26 (k)"]
["D27","k","D27 (k)"]
["D28","k","D28 (k)"]
["D29","k","D29 (k)"]
["D30","k","D30 (k)"]
["D31","k","D31 (k)"]
["D32","k","D32 (k)"]
["D33","k","D33 (k)"]
["D34","k","D34 (k)"]
["D35","k","D35 (k)"]
["D36","k","D36 (k)"]
["D37","k","D37 (k)"]
["D50","k","D50 (k)"]
["D51","k","D51 (k)"]
["D52","k","D52 (k)"]
["D53","k","D53 (k)"]
["D54","k","D54 (k)"]
["D55","k","D55 (k)"]
["D56","k","D56 (k)"]
["D57","k","D57 (k)"]
["D58","k","D58 (k)"]
["D59","k","D59 (k)"]
["D60","k","D60 (k)"]
["D61","k","D61 (k)"]
["D62","k","D62 (k)"]
["D63","k","D63 (k)"]
["D64","k","D64 (k)"]
["D65","k","D65 (k)"]
["D66","k","D66 (k)"]
["D67","k",{"$f":"A579&\" (\"&$B579&\")\"","v":"D67 (k)"}]
["D68","k","D68 (k)"]
["D69","k","D69 (k)"]
["D70","k","D70 (k)"]
["D71","k","D71 (k)"]
["D72","k","D72 (k)"]
["D73","k","D73 (k)"]
["D74","k","D74 (k)"]
["D75","k","D75 (k)"]
["D76","k","D76 (k)"]
["D77","k","D77 (k)"]
["D78","k","D78 (k)"]
["D79","k","D79 (k)"]
["D80","k","D80 (k)"]
["D81","k","D81 (k)"]
["E01","k","E01 (k)"]
["E02","k","E02 (k)"]
["E03","k","E03 (k)"]
["E22","k","E22 (k)"]
["E23","k","E23 (k)"]
["E24","k","E24 (k)"]
["E25","k","E25 (k)"]
["E26","k","E26 (k)"]
["E27","k","E27 (k)"]
["E28","k","E28 (k)"]
["E29","k","E29 (k)"]
["E30","k","E30 (k)"]
["E31","k","E31 (k)"]
["E32","k","E32 (k)"]
["E33","k","E33 (k)"]
["E34","k","E34 (k)"]
["E35","k","E35 (k)"]
["E36","k","E36 (k)"]
["E37","k","E37 (k)"]
["E38","k","E38 (k)"]
["E39","k","E39 (k)"]
["E40","k","E40 (k)"]
["E41","k","E41 (k)"]
["E42","k","E42 (k)"]
["E43","k","E43 (k)"]
["E44","k","E44 (k)"]
["E45","k","E45 (k)"]
["E46","k","E46 (k)"]
["E47","k","E47 (k)"]
["E48","k","E48 (k)"]
["E49","k","E49 (k)"]
["E50","k","E50 (k)"]
["E51","k","E51 (k)"]
["E52","k","E52 (k)"]
["E53","k","E53 (k)"]
["E54","k","E54 (k)"]
["E55","k","E55 (k)"]
["E56","k","E56 (k)"]
["E57","k","E57 (k)"]
["E58","k","E58 (k)"]
["E59","k","E59 (k)"]
["E60","k","E60 (k)"]
["E61","k","E61 (k)"]
["E62","k","E62 (k)"]
["E63","k","E63 (k)"]
["E64","k","E64 (k)"]
["E65","k","E65 (k)"]
["E66","k","E66 (k)"]
["E67","k","E67 (k)"]
["E68","k",{"$f":"A643&\" (\"&$B643&\")\"","v":"E68 (k)"}]
["E69","k","E69 (k)"]
["E70","k","E70 (k)"]
["E71","k","E71 (k)"]
["E72","k","E72 (k)"]
["E73","k","E73 (k)"]
["E74","k","E74 (k)"]
["E75","k","E75 (k)"]
["E76","k","E76 (k)"]
["E77","k","E77 (k)"]
["E78","k","E78 (k)"]
["E79","k","E79 (k)"]
["E80","k","E80 (k)"]
["E81","k","E81 (k)"]
["E82","k","E82 (k)"]
["E83","k","E83 (k)"]
["E84","k","E84 (k)"]
["E85","k","E85 (k)"]
["E86","k","E86 (k)"]
["E87","k","E87 (k)"]
["E88","k","E88 (k)"]
["E89","k","E89 (k)"]
["E90","k","E90 (k)"]
["E91","k","E91 (k)"]
["E92","k","E92 (k)"]
["E93","k","E93 (k)"]
["E94","k","E94 (k)"]
["E95","k","E95 (k)"]
["E96","k","E96 (k)"]
["E97","k","E97 (k)"]
["E98","k","E98 (k)"]
["E99","k","E99 (k)"]
["F01","k","F01 (k)"]
["F02","k","F02 (k)"]
["F03","k","F03 (k)"]
["F04","k","F04 (k)"]
["F05","k","F05 (k)"]
["F06","k","F06 (k)"]
["F51","k","F51 (k)"]
["F52","k","F52 (k)"]
["F53","k","F53 (k)"]
["F54","k","F54 (k)"]
["F55","k","F55 (k)"]
["F56","k","F56 (k)"]
["F70","k","F70 (k)"]
["F71","k","F71 (k)"]
["G01","k","G01 (k)"]
["G02","k","G02 (k)"]
["G03","k","G03 (k)"]
["G04","k","G04 (k)"]
["G05","k","G05 (k)"]
["G06","k","G06 (k)"]
["G07","k","G07 (k)"]
["G08","k","G08 (k)"]
["G09","k","G09 (k)"]
["G10","k","G10 (k)"]
["G11","k","G11 (k)"]
["G12","k","G12 (k)"]
["G13","k","G13 (k)"]
["G14","k","G14 (k)"]
["G15","k","G15 (k)"]
["G16","k","G16 (k)"]
["G17","k","G17 (k)"]
["G51","k","G51 (k)"]
["G52","k",{"$f":"A707&\" (\"&$B707&\")\"","v":"G52 (k)"}]
["G53","k","G53 (k)"]
["H00","k","H00 (k)"]
["H01","k","H01 (k)"]
["H02","k","H02 (k)"]
["H03","k","H03 (k)"]
["H04","k","H04 (k)"]
["H05","k","H05 (k)"]
["H06","k","H06 (k)"]
["H07","k","H07 (k)"]
["H08","k","H08 (k)"]
["H09","k","H09 (k)"]
["H0A","k","H0A (k)"]
["H0B","k","H0B (k)"]
["H0C","k","H0C (k)"]
["H0D","k","H0D (k)"]
["H10","k","H10 (k)"]
["H11","k","H11 (k)"]
["H12","k","H12 (k)"]
["H13","k","H13 (k)"]
["H14","k","H14 (k)"]
["H15","k","H15 (k)"]
["H16","k","H16 (k)"]
["H17","k","H17 (k)"]
["H18","k","H18 (k)"]
["H19","k","H19 (k)"]
["H20","k","H20 (k)"]
["H21","k","H21 (k)"]
["H22","k","H22 (k)"]
["H23","k","H23 (k)"]
["H24","k","H24 (k)"]
["H25","k","H25 (k)"]
["H26","k","H26 (k)"]
["H27","k","H27 (k)"]
["H28","k","H28 (k)"]
["H29","k","H29 (k)"]
["H30","k","H30 (k)"]
["H31","k","H31 (k)"]
["H32","k","H32 (k)"]
["H33","k","H33 (k)"]
["H34","k","H34 (k)"]
["H35","k","H35 (k)"]
["H36","k","H36 (k)"]
["H37","k","H37 (k)"]
["H38","k","H38 (k)"]
["H39","k","H39 (k)"]
["H40","k","H40 (k)"]
["H41","k","H41 (k)"]
["H42","k","H42 (k)"]
["H43","k","H43 (k)"]
["H44","k","H44 (k)"]
["H45","k","H45 (k)"]
["H46","k","H46 (k)"]
["H47","k","H47 (k)"]
["H48","k","H48 (k)"]
["H49","k","H49 (k)"]
["H50","k","H50 (k)"]
["H51","k","H51 (k)"]
["H52","k","H52 (k)"]
["H53","k","H53 (k)"]
["H54","k","H54 (k)"]
["H55","k","H55 (k)"]
["H56","k","H56 (k)"]
["H57","k","H57 (k)"]
["H58","k",{"$f":"A771&\" (\"&$B771&\")\"","v":"H58 (k)"}]
["H59","k","H59 (k)"]
["H60","k","H60 (k)"]
["H61","k","H61 (k)"]
["H62","k","H62 (k)"]
["H63","k","H63 (k)"]
["H64","k","H64 (k)"]
["H65","k","H65 (k)"]
["H66","k","H66 (k)"]
["H67","k","H67 (k)"]
["H68","k","H68 (k)"]
["H69","k","H69 (k)"]
["H70","k","H70 (k)"]
["H71","k","H71 (k)"]
["H72","k","H72 (k)"]
["H73","k","H73 (k)"]
["H74","k","H74 (k)"]
["H75","k","H75 (k)"]
["H76","k","H76 (k)"]
["H77","k","H77 (k)"]
["H78","k","H78 (k)"]
["H79","k","H79 (k)"]
["H80","k","H80 (k)"]
["H81","k","H81 (k)"]
["H82","k","H82 (k)"]
["H83","k","H83 (k)"]
["H84","k","H84 (k)"]
["H85","k","H85 (k)"]
["H86","k","H86 (k)"]
["H87","k","H87 (k)"]
["H88","k","H88 (k)"]
["H89","k","H89 (k)"]
["H90","k","H90 (k)"]
["H91","k","H91 (k)"]
["H92","k","H92 (k)"]
["H93","k","H93 (k)"]
["H94","k","H94 (k)"]
["H95","k","H95 (k)"]
["H96","k","H96 (k)"]
["H97","k","H97 (k)"]
["H98","k","H98 (k)"]
["H99","k","H99 (k)"]
["I00","k","I00 (k)"]
["I01","k","I01 (k)"]
["I02","k","I02 (k)"]
["I03","k","I03 (k)"]
["I04","k","I04 (k)"]
["I05","k","I05 (k)"]
["I06","k","I06 (k)"]
["I07","k","I07 (k)"]
["I08","k","I08 (k)"]
["I09","k","I09 (k)"]
["I10","k","I10 (k)"]
["I11","k","I11 (k)"]
["I16","k","I16 (k)"]
["I17","k","I17 (k)"]
["I18","k","I18 (k)"]
["I19","k","I19 (k)"]
["I20","k","I20 (k)"]
["I21","k","I21 (k)"]
["I22","k","I22 (k)"]
["I31","k","I31 (k)"]
["I32","k","I32 (k)"]
["I33","k","I33 (k)"]
["I34","k",{"$f":"A835&\" (\"&$B835&\")\"","v":"I34 (k)"}]
["I35","k","I35 (k)"]
["I36","k","I36 (k)"]
["I37","k","I37 (k)"]
["I38","k","I38 (k)"]
["I39","k","I39 (k)"]
["I40","k","I40 (k)"]
["I41","k","I41 (k)"]
["I61","k","I61 (k)"]
["I62","k","I62 (k)"]
["I63","k","I63 (k)"]
["I64","k","I64 (k)"]
["I65","k","I65 (k)"]
["I66","k","I66 (k)"]
["I67","k","I67 (k)"]
["I68","k","I68 (k)"]
["I69","k","I69 (k)"]
["I70","k","I70 (k)"]
["I71","k","I71 (k)"]
["I72","k","I72 (k)"]
["I73","k","I73 (k)"]
["J00","k","J00 (k)"]
["J01","k","J01 (k)"]
["J02","k","J02 (k)"]
["J03","k","J03 (k)"]
["J04","k","J04 (k)"]
["J05","k","J05 (k)"]
["J06","k","J06 (k)"]
["J07","k","J07 (k)"]
["J08","k","J08 (k)"]
["J21","k","J21 (k)"]
["J22","k","J22 (k)"]
["J23","k","J23 (k)"]
["J24","k","J24 (k)"]
["J25","k","J25 (k)"]
["J26","k","J26 (k)"]
["J31","k","J31 (k)"]
["J32","k","J32 (k)"]
["J33","k","J33 (k)"]
["J34","k","J34 (k)"]
["J35","k","J35 (k)"]
["J41","k","J41 (k)"]
["J42","k","J42 (k)"]
["J43","k","J43 (k)"]
["J44","k","J44 (k)"]
["J45","k","J45 (k)"]
["J61","k","J61 (k)"]
["J62","k","J62 (k)"]
["J63","k","J63 (k)"]
["J64","k","J64 (k)"]
["J65","k","J65 (k)"]
["J66","k","J66 (k)"]
["J67","k","J67 (k)"]
["J68","k","J68 (k)"]
["J69","k","J69 (k)"]
["K00","k","K00 (k)"]
["K01","k","K01 (k)"]
["K02","k","K02 (k)"]
["K10","k","K10 (k)"]
["K11","k","K11 (k)"]
["K12","k","K12 (k)"]
["K14","k","K14 (k)"]
["K15","k","K15 (k)"]
["K16","k","K16 (k)"]
["K17","k",{"$f":"A899&\" (\"&$B899&\")\"","v":"K17 (k)"}]
["K18","k","K18 (k)"]
["K19","k","K19 (k)"]
["K20","k","K20 (k)"]
["K21","k","K21 (k)"]
["K22","k","K22 (k)"]
["K23","k","K23 (k)"]
["K24","k","K24 (k)"]
["K25","k","K25 (k)"]
["K35","k","K35 (k)"]
["K36","k","K36 (k)"]
["K37","k","K37 (k)"]
["K38","k","K38 (k)"]
["K39","k","K39 (k)"]
["K40","k","K40 (k)"]
["K41","k","K41 (k)"]
["K42","k","K42 (k)"]
["K43","k","K43 (k)"]
["K44","k","K44 (k)"]
["K45","k","K45 (k)"]
["K46","k","K46 (k)"]
["K47","k","K47 (k)"]
["K48","k","K48 (k)"]
["K49","k","K49 (k)"]
["K50","k","K50 (k)"]
["K51","k","K51 (k)"]
["K52","k","K52 (k)"]
["K53","k","K53 (k)"]
["K54","k","K54 (k)"]
["K55","k","K55 (k)"]
["K56","k","K56 (k)"]
["K57","k","K57 (k)"]
["K58","k","K58 (k)"]
["K59","k","K59 (k)"]
["K60","k","K60 (k)"]
["K61","k","K61 (k)"]
["K62","k","K62 (k)"]
["K63","k","K63 (k)"]
["K64","k","K64 (k)"]
["K65","k","K65 (k)"]
["K66","k","K66 (k)"]
["K67","k","K67 (k)"]
["K68","k","K68 (k)"]
["K69","k","K69 (k)"]
["K70","k","K70 (k)"]
["K71","k","K71 (k)"]
["K72","k","K72 (k)"]
["K73","k","K73 (k)"]
["K74","k","K74 (k)"]
["K75","k","K75 (k)"]
["K76","k","K76 (k)"]
["K77","k","K77 (k)"]
["K78","k","K78 (k)"]
["K79","k","K79 (k)"]
["K80","k","K80 (k)"]
["K81","k","K81 (k)"]
["K82","k","K82 (k)"]
["K83","k","K83 (k)"]
["K84","k","K84 (k)"]
["K85","k","K85 (k)"]
["K86","k","K86 (k)"]
["K87","k","K87 (k)"]
["K88","k","K88 (k)"]
["K89","k","K89 (k)"]
["K90","k",{"$f":"A963&\" (\"&$B963&\")\"","v":"K90 (k)"}]
["K91","k","K91 (k)"]
["K92","k","K92 (k)"]
["K93","k","K93 (k)"]
["K94","k","K94 (k)"]
["K95","k","K95 (k)"]
["K96","k","K96 (k)"]
["K97","k","K97 (k)"]
["K98","k","K98 (k)"]
["K99","k","K99 (k)"]
["L00","k","L00 (k)"]
["L01","k","L01 (k)"]
["L02","k","L02 (k)"]
["L03","k","L03 (k)"]
["L04","k","L04 (k)"]
["L05","k","L05 (k)"]
["L06","k","L06 (k)"]
["L07","k","L07 (k)"]
["L08","k","L08 (k)"]
["L09","k","L09 (k)"]
["L10","k","L10 (k)"]
["L11","k","L11 (k)"]
["L12","k","L12 (k)"]
["L13","k","L13 (k)"]
["L14","k","L14 (k)"]
["L15","k","L15 (k)"]
["L16","k","L16 (k)"]
["L17","k","L17 (k)"]
["L18","k","L18 (k)"]
["L46","k","L46 (k)"]
["L47","k","L47 (k)"]
["L48","k","L48 (k)"]
["L49","k","L49 (k)"]
["L50","k","L50 (k)"]
["L51","k","L51 (k)"]
["L52","k","L52 (k)"]
["L53","k","L53 (k)"]
["L54","k","L54 (k)"]
["L55","k","L55 (k)"]
["L56","k","L56 (k)"]
["L57","k","L57 (k)"]
["L66","k","L66 (k)"]
["L67","k","L67 (k)"]
["L68","k","L68 (k)"]
["L69","k","L69 (k)"]
["L71","k","L71 (k)"]
["L72","k","L72 (k)"]
["L80","k","L80 (k)"]
["L81","k","L81 (k)"]
["L82","k","L82 (k)"]
["L83","k","L83 (k)"]
["L84","k","L84 (k)"]
["L85","k","L85 (k)"]
["L86","k","L86 (k)"]
["M00","k","M00 (k)"]
["M01","k","M01 (k)"]
["M02","k","M02 (k)"]
["M03","k","M03 (k)"]
["M10","k","M10 (k)"]
["M11","k","M11 (k)"]
["M12","k","M12 (k)"]
["M13","k","M13 (k)"]
["M14","k","M14 (k)"]
["M15","k","M15 (k)"]
["M16","k",{"$f":"A1027&\" (\"&$B1027&\")\"","v":"M16 (k)"}]
["M17","k","M17 (k)"]
["M18","k","M18 (k)"]
["M19","k","M19 (k)"]
["M20","k","M20 (k)"]
["M21","k","M21 (k)"]
["M22","k","M22 (k)"]
["M23","k","M23 (k)"]
["M24","k","M24 (k)"]
["M25","k","M25 (k)"]
["M26","k","M26 (k)"]
["M35","k","M35 (k)"]
["M36","k","M36 (k)"]
["M37","k","M37 (k)"]
["M38","k","M38 (k)"]
["M39","k","M39 (k)"]
["M40","k","M40 (k)"]
["M41","k","M41 (k)"]
["M50","k","M50 (k)"]
["M51","k","M51 (k)"]
["M52","k","M52 (k)"]
["M53","k","M53 (k)"]
["M54","k","M54 (k)"]
["M55","k","M55 (k)"]
["M56","k","M56 (k)"]
["M57","k","M57 (k)"]
["M58","k","M58 (k)"]
["M59","k","M59 (k)"]
["M70","k","M70 (k)"]
["M71","k","M71 (k)"]
["M72","k","M72 (k)"]
["M73","k","M73 (k)"]
["M74","k","M74 (k)"]
["M75","k","M75 (k)"]
["M76","k","M76 (k)"]
["M77","k","M77 (k)"]
["M78","k","M78 (k)"]
["M79","k","M79 (k)"]
["M80","k","M80 (k)"]
["M81","k","M81 (k)"]
["M82","k","M82 (k)"]
["M83","k","M83 (k)"]
["M84","k","M84 (k)"]
["M85","k","M85 (k)"]
["M86","k","M86 (k)"]
["M87","k","M87 (k)"]
["M88","k","M88 (k)"]
["M89","k","M89 (k)"]
["M90","k","M90 (k)"]
["M91","k","M91 (k)"]
["M92","k","M92 (k)"]
["M93","k","M93 (k)"]
["M94","k","M94 (k)"]
["MX1","k","MX1 (k)"]
["N00","k","N00 (k)"]
["N01","k","N01 (k)"]
["N02","k","N02 (k)"]
["N03","k","N03 (k)"]
["N04","k","N04 (k)"]
["N05","k","N05 (k)"]
["N06","k","N06 (k)"]
["N07","k","N07 (k)"]
["N08","k","N08 (k)"]
["N09","k","N09 (k)"]
["N10","k",{"$f":"A1091&\" (\"&$B1091&\")\"","v":"N10 (k)"}]
["N11","k","N11 (k)"]
["N12","k","N12 (k)"]
["N13","k","N13 (k)"]
["N14","k","N14 (k)"]
["N15","k","N15 (k)"]
["N16","k","N16 (k)"]
["N17","k","N17 (k)"]
["N18","k","N18 (k)"]
["N19","k","N19 (k)"]
["N20","k","N20 (k)"]
["N21","k","N21 (k)"]
["N22","k","N22 (k)"]
["N23","k","N23 (k)"]
["N24","k","N24 (k)"]
["N25","k","N25 (k)"]
["N26","k","N26 (k)"]
["N27","k","N27 (k)"]
["N28","k","N28 (k)"]
["N29","k","N29 (k)"]
["N30","k","N30 (k)"]
["N31","k","N31 (k)"]
["N32","k","N32 (k)"]
["N33","k","N33 (k)"]
["N34","k","N34 (k)"]
["N35","k","N35 (k)"]
["N36","k","N36 (k)"]
["N37","k","N37 (k)"]
["N38","k","N38 (k)"]
["N39","k","N39 (k)"]
["N40","k","N40 (k)"]
["N41","k","N41 (k)"]
["N42","k","N42 (k)"]
["N43","k","N43 (k)"]
["N44","k","N44 (k)"]
["N45","k","N45 (k)"]
["N46","k","N46 (k)"]
["N47","k","N47 (k)"]
["N48","k","N48 (k)"]
["N49","k","N49 (k)"]
["N50","k","N50 (k)"]
["N51","k","N51 (k)"]
["N52","k","N52 (k)"]
["N53","k","N53 (k)"]
["N54","k","N54 (k)"]
["N55","k","N55 (k)"]
["N56","k","N56 (k)"]
["N57","k","N57 (k)"]
["N58","k","N58 (k)"]
["N59","k","N59 (k)"]
["N60","k","N60 (k)"]
["N61","k","N61 (k)"]
["N62","k","N62 (k)"]
["N63","k","N63 (k)"]
["N64","k","N64 (k)"]
["N65","k","N65 (k)"]
["N66","k","N66 (k)"]
["N67","k","N67 (k)"]
["O00","k","O00 (k)"]
["O01","k","O01 (k)"]
["O02","k","O02 (k)"]
["O03","k","O03 (k)"]
["O04","k","O04 (k)"]
["O05","k","O05 (k)"]
["O06","k",{"$f":"A1155&\" (\"&$B1155&\")\"","v":"O06 (k)"}]
["O07","k","O07 (k)"]
["O08","k","O08 (k)"]
["O09","k","O09 (k)"]
["O10","k","O10 (k)"]
["O11","k","O11 (k)"]
["O12","k","O12 (k)"]
["O13","k","O13 (k)"]
["O14","k","O14 (k)"]
["O15","k","O15 (k)"]
["O16","k","O16 (k)"]
["O17","k","O17 (k)"]
["O18","k","O18 (k)"]
["O19","k","O19 (k)"]
["O20","k","O20 (k)"]
["O21","k","O21 (k)"]
["O22","k","O22 (k)"]
["O23","k","O23 (k)"]
["O24","k","O24 (k)"]
["O25","k","O25 (k)"]
["O26","k","O26 (k)"]
["O27","k","O27 (k)"]
["O28","k","O28 (k)"]
["O29","k","O29 (k)"]
["O30","k","O30 (k)"]
["O31","k","O31 (k)"]
["O32","k","O32 (k)"]
["O33","k","O33 (k)"]
["O34","k","O34 (k)"]
["O35","k","O35 (k)"]
["O36","k","O36 (k)"]
["O37","k","O37 (k)"]
["O50","k","O50 (k)"]
["O51","k","O51 (k)"]
["O52","k","O52 (k)"]
["O53","k","O53 (k)"]
["O54","k","O54 (k)"]
["O55","k","O55 (k)"]
["O56","k","O56 (k)"]
["O57","k","O57 (k)"]
["O58","k","O58 (k)"]
["O59","k","O59 (k)"]
["O60","k","O60 (k)"]
["O61","k","O61 (k)"]
["O62","k","O62 (k)"]
["O63","k","O63 (k)"]
["O64","k","O64 (k)"]
["O65","k","O65 (k)"]
["O70","k","O70 (k)"]
["O71","k","O71 (k)"]
["O72","k","O72 (k)"]
["O73","k","O73 (k)"]
["O85","k","O85 (k)"]
["O90","k","O90 (k)"]
["O91","k","O91 (k)"]
["O95","k","O95 (k)"]
["O96","k","O96 (k)"]
["P00","k","P00 (k)"]
["P01","k","P01 (k)"]
["P02","k","P02 (k)"]
["P03","k","P03 (k)"]
["P04","k","P04 (k)"]
["P05","k","P05 (k)"]
["P06","k","P06 (k)"]
["P07","k",{"$f":"A1219&\" (\"&$B1219&\")\"","v":"P07 (k)"}]
["P08","k","P08 (k)"]
["P09","k","P09 (k)"]
["P10","k","P10 (k)"]
["P11","k","P11 (k)"]
["P12","k","P12 (k)"]
["P13","k","P13 (k)"]
["P14","k","P14 (k)"]
["P15","k","P15 (k)"]
["P16","k","P16 (k)"]
["P17","k","P17 (k)"]
["P18","k","P18 (k)"]
["P19","k","P19 (k)"]
["P20","k","P20 (k)"]
["P21","k","P21 (k)"]
["P22","k","P22 (k)"]
["P23","k","P23 (k)"]
["P24","k","P24 (k)"]
["P25","k","P25 (k)"]
["P26","k","P26 (k)"]
["P27","k","P27 (k)"]
["P28","k","P28 (k)"]
["P29","k","P29 (k)"]
["P30","k","P30 (k)"]
["P31","k","P31 (k)"]
["P32","k","P32 (k)"]
["P33","k","P33 (k)"]
["P34","k","P34 (k)"]
["P35","k","P35 (k)"]
["P36","k","P36 (k)"]
["P37","k","P37 (k)"]
["P38","k","P38 (k)"]
["P39","k","P39 (k)"]
["P40","k","P40 (k)"]
["P41","k","P41 (k)"]
["P50","k","P50 (k)"]
["P51","k","P51 (k)"]
["P52","k","P52 (k)"]
["P53","k","P53 (k)"]
["P54","k","P54 (k)"]
["P55","k","P55 (k)"]
["P56","k","P56 (k)"]
["P57","k","P57 (k)"]
["P58","k","P58 (k)"]
["P59","k","P59 (k)"]
["P60","k","P60 (k)"]
["P61","k","P61 (k)"]
["P62","k","P62 (k)"]
["P63","k","P63 (k)"]
["P64","k","P64 (k)"]
["P65","k","P65 (k)"]
["P66","k","P66 (k)"]
["P67","k","P67 (k)"]
["P68","k","P68 (k)"]
["P69","k","P69 (k)"]
["P70","k","P70 (k)"]
["P71","k","P71 (k)"]
["P72","k","P72 (k)"]
["P73","k","P73 (k)"]
["P74","k","P74 (k)"]
["P75","k","P75 (k)"]
["P76","k","P76 (k)"]
["P77","k","P77 (k)"]
["P78","k","P78 (k)"]
["P79","k",{"$f":"A1283&\" (\"&$B1283&\")\"","v":"P79 (k)"}]
["P80","k","P80 (k)"]
["P81","k","P81 (k)"]
["P82","k","P82 (k)"]
["P83","k","P83 (k)"]
["P84","k","P84 (k)"]
["P85","k","P85 (k)"]
["P86","k","P86 (k)"]
["P87","k","P87 (k)"]
["P88","k","P88 (k)"]
["P89","k","P89 (k)"]
["P90","k","P90 (k)"]
["P91","k","P91 (k)"]
["P92","k","P92 (k)"]
["P93","k","P93 (k)"]
["P94","k","P94 (k)"]
["P95","k","P95 (k)"]
["P96","k","P96 (k)"]
["P97","k","P97 (k)"]
["P98","k","P98 (k)"]
["P99","k","P99 (k)"]
["Q01","k","Q01 (k)"]
["Q02","k","Q02 (k)"]
["Q03","k","Q03 (k)"]
["Q04","k","Q04 (k)"]
["Q05","k","Q05 (k)"]
["Q06","k","Q06 (k)"]
["Q07","k","Q07 (k)"]
["Q08","k","Q08 (k)"]
["Q09","k","Q09 (k)"]
["Q10","k","Q10 (k)"]
["Q11","k","Q11 (k)"]
["Q12","k","Q12 (k)"]
["Q15","k","Q15 (k)"]
["Q16","k","Q16 (k)"]
["Q20","P","Q20 (P)"]
["Q21","r","Q21 (r)"]
["Q22","z","Q22 (z)"]
["Q23","g","Q23 (g)"]
["Q24","h","Q24 (h)"]
["Q25","k","Q25 (k)"]
["Q26","o","Q26 (o)"]
["Q27","p","Q27 (p)"]
["Q28","m","Q28 (m)"]
["Q29","v","Q29 (v)"]
["Q30","c","Q30 (c)"]
["Q31","x","Q31 (x)"]
["Q32","s","Q32 (s)"]
["Q33","z","Q33 (z)"]
["Q34","a","Q34 (a)"]
["Q35","q","Q35 (q)"]
["Q36","w","Q36 (w)"]
["Q40","x","Q40 (x)"]
["Q41","t","Q41 (t)"]
["Q42","t","Q42 (t)"]
["Q43","t","Q43 (t)"]
["Q44","h","Q44 (h)"]
["Q45","h","Q45 (h)"]
["Q46","h","Q46 (h)"]
["Q47","h","Q47 (h)"]
["Q48","h","Q48 (h)"]
["Q49","h","Q49 (h)"]
["Q50","h","Q50 (h)"]
["Q51","h","Q51 (h)"]
["Q52","h",{"$f":"A1347&\" (\"&$B1347&\")\"","v":"Q52 (h)"}]
["Q53","h","Q53 (h)"]
["Q54","h","Q54 (h)"]
["Q55","h","Q55 (h)"]
["Q56","h","Q56 (h)"]
["Q65","Borgia, Francesca","Q65 (Borgia, Francesca)"]
["Q66","Donati, Sonia","Q66 (Donati, Sonia)"]
["Q67","Raffalli, Walter","Q67 (Raffalli, Walter)"]
["Q68","Matarese, S.","Q68 (Matarese, S.)"]
["Q69","Cappelli, Ilaria","Q69 (Cappelli, Ilaria)"]
["Q70","Borgianni, Olimpia","Q70 (Borgianni, Olimpia)"]
["Q71","Maccari, Carlo","Q71 (Maccari, Carlo)"]
["Q72","Steinhausen, Iris","Q72 (Steinhausen, Iris)"]
["Q73","Addesso, Francesco","Q73 (Addesso, Francesco)"]
["Q74","Bimbi, Federica","Q74 (Bimbi, Federica)"]
["Q75","Farinella, C.","Q75 (Farinella, C.)"]
["Q76","Ballista, Claudia","Q76 (Ballista, Claudia)"]
["Q77","Ciampi, Martina","Q77 (Ciampi, Martina)"]
["Q78","Guarguaglini, S.","Q78 (Guarguaglini, S.)"]
["Q79","Giannetti, Matteo","Q79 (Giannetti, Matteo)"]
["Q80","Bernacchini, Marco","Q80 (Bernacchini, Marco)"]
["Q81","Toncelli, Stefano","Q81 (Toncelli, Stefano)"]
["Q82","Lazzeri, Clara","Q82 (Lazzeri, Clara)"]
["Q83","Caponi, Paolo","Q83 (Caponi, Paolo)"]
["Q84","Ippolito, Andrea","Q84 (Ippolito, Andrea)"]
["Q85","Casule, Giovanni","Q85 (Casule, Giovanni)"]
["R00","Jimenez, Karla","R00 (Jimenez, Karla)"]
["R01","Pineda, Mitzi","R01 (Pineda, Mitzi)"]
["R02","Vera, Ernesto","R02 (Vera, Ernesto)"]
["R03","Hernández, Isabel","R03 (Hernández, Isabel)"]
["R04","Franco, Alma","R04 (Franco, Alma)"]
["R05","Trujillo, Isabela","R05 (Trujillo, Isabela)"]
["R06","Gonzalez, Erick","R06 (Gonzalez, Erick)"]
["R07","Gonzalez, Diego","R07 (Gonzalez, Diego)"]
["R21","Суворова, Наталья","R21 (Суворова, Наталья)"]
["R22","Воронцова В.","R22 (Воронцова В.)"]
["R23","Карпун, Дина","R23 (Карпун, Дина)"]
["R24","Борисова, Ольга","R24 (Борисова, Ольга)"]
["R25","Носов, Сергей","R25 (Носов, Сергей)"]
["R26","Ярмак, Артем","R26 (Ярмак, Артем)"]
["R27","Кочкина, Светлана","R27 (Кочкина, Светлана)"]
["R28","Балабышко, Евгений","R28 (Балабышко, Евгений)"]
["R29","Мальцева, Татьяна","R29 (Мальцева, Татьяна)"]
["R30","Балаева Н.С.","R30 (Балаева Н.С.)"]
["R31","Зайцев Д.С.","R31 (Зайцев Д.С.)"]
["R33","Кавецкая Е.","R33 (Кавецкая Е.)"]
["R34","Малышева Ю.А.","R34 (Малышева Ю.А.)"]
["R35","Сатямина О.В.","R35 (Сатямина О.В.)"]
["R36","Шишкина Е.","R36 (Шишкина Е.)"]
["R37","Савицкая Светлана","R37 (Савицкая Светлана)"]
["R38","Горовых Антон","R38 (Горовых Антон)"]
["R40","Вересова, Елена","R40 (Вересова, Елена)"]
["R41","Петухова, Ольга","R41 (Петухова, Ольга)"]
["R42","Жукова, Екатерина","R42 (Жукова, Екатерина)"]
["R43","Шипицына, Кристина","R43 (Шипицына, Кристина)"]
["R44","Летягина, Ирина","R44 (Летягина, Ирина)"]
["R45","Коломыц, Вера","R45 (Коломыц, Вера)"]
["R46","Фигуровская, Олеся","R46 (Фигуровская, Олеся)"]
["R47","Горная, Альбина","R47 (Горная, Альбина)"]
["R48","Иванов, Алексей","R48 (Иванов, Алексей)"]
["R49","Кодзоева, Елена","R49 (Кодзоева, Елена)"]
["R50","Лузин, Сергей","R50 (Лузин, Сергей)"]
["R51","Саваткина,Олеся","R51 (Саваткина,Олеся)"]
["R52","Бондарчук,Андрей","R52 (Бондарчук,Андрей)"]
["R53","Тыхешкина,Оксана",{"$f":"A1411&\" (\"&$B1411&\")\"","v":"R53 (Тыхешкина,Оксана)"}]
["R54","Иванова,Ольга","R54 (Иванова,Ольга)"]
["R55","Саваткина, Ольга","R55 (Саваткина, Ольга)"]
["R56","Шарагулов,Александ","R56 (Шарагулов,Александ)"]
["R57","Воронкова,Евгения","R57 (Воронкова,Евгения)"]
["R58","Антипова,Галина","R58 (Антипова,Галина)"]
["R59","Мутина,Анастасия","R59 (Мутина,Анастасия)"]
["R60","Оширова,Надежда","R60 (Оширова,Надежда)"]
["R61","Зайцева,Ксения","R61 (Зайцева,Ксения)"]
["R62","Шейкин, Александр","R62 (Шейкин, Александр)"]
["S01","Adam Brown","S01 (Adam Brown)"]
["S02","Alfons Montebello","S02 (Alfons Montebello)"]
["S03","Andrew Balding","S03 (Andrew Balding)"]
["S04","Caroline Hussen","S04 (Caroline Hussen)"]
["S05","Craig Wilkinson","S05 (Craig Wilkinson)"]
["S06","Derek Dorward","S06 (Derek Dorward)"]
["S07","Katrina Bale","S07 (Katrina Bale)"]
["S08","Les Triffett","S08 (Les Triffett)"]
["S09","Lyndall Field","S09 (Lyndall Field)"]
["S10","Malcolm Burkby","S10 (Malcolm Burkby)"]
["S11","Martine Jackson","S11 (Martine Jackson)"]
["S12","Mo Chahal","S12 (Mo Chahal)"]
["S13","Sharon Brailey","S13 (Sharon Brailey)"]
["S14","Sonia Young","S14 (Sonia Young)"]
["S15","Steve James","S15 (Steve James)"]
["S16","Stewart Keen","S16 (Stewart Keen)"]
["S17","Hamish McQuarrie","S17 (Hamish McQuarrie)"]
["S18","Avin Verma","S18 (Avin Verma)"]
["S19","Stella Zhang","S19 (Stella Zhang)"]
["S20","Sarah Wu","S20 (Sarah Wu)"]
["S21","Nhi Pham","S21 (Nhi Pham)"]
["S22","Tim Rantin","S22 (Tim Rantin)"]
["S23","John Elder","S23 (John Elder)"]
["S24","Brett Locke","S24 (Brett Locke)"]
["S25","Ben Fuller","S25 (Ben Fuller)"]
["S26","Damian Hoyle","S26 (Damian Hoyle)"]
["S27","Gina Dhat","S27 (Gina Dhat)"]
["S28","Max Whiting","S28 (Max Whiting)"]
["S29","Jessica Joy","S29 (Jessica Joy)"]
["S30","Brian Bolger","S30 (Brian Bolger)"]
["S31","Jayke Anderson","S31 (Jayke Anderson)"]
["S32","Neil Carlish","S32 (Neil Carlish)"]
["S33","Michael Jaye","S33 (Michael Jaye)"]
["T00","Oliveira, Camile","T00 (Oliveira, Camile)"]
["T01","Cruz, Rafael","T01 (Cruz, Rafael)"]
["T02","Ferreira, Douglas","T02 (Ferreira, Douglas)"]
["T03","Lisboa, Ericson","T03 (Lisboa, Ericson)"]
["T04","Maximo, Pedro","T04 (Maximo, Pedro)"]
["T05","Olivetti, Daniele","T05 (Olivetti, Daniele)"]
["T06","Ribeiro, Bruno","T06 (Ribeiro, Bruno)"]
["T07","Almeida, Leandro","T07 (Almeida, Leandro)"]
["T08","Saraiva, Thamires","T08 (Saraiva, Thamires)"]
["T09","Silva, Gabriela","T09 (Silva, Gabriela)"]
["T10","Silva, Tamara","T10 (Silva, Tamara)"]
["T11","Silva, Thomas","T11 (Silva, Thomas)"]
["T12","Sodre, Camila","T12 (Sodre, Camila)"]
["T13","Souza, Daniele","T13 (Souza, Daniele)"]
["T14","Garcia, Daniel","T14 (Garcia, Daniel)"]
["T15","Hartmann, Albert","T15 (Hartmann, Albert)"]
["T26","Vargas, Carolina","T26 (Vargas, Carolina)"]
["T27","Jimenez, Jazmin","T27 (Jimenez, Jazmin)"]
["T28","Herrera, Viviana","T28 (Herrera, Viviana)"]
["T29","Navarro, Ana","T29 (Navarro, Ana)"]
["Z00","SAP-LE : Freight","Z00 (SAP-LE : Freight)"]
["Z01","SAP-LE : INBFreigt",{"$f":"A1475&\" (\"&$B1475&\")\"","v":"Z01 (SAP-LE : INBFreigt)"}]
["ZA1","K001XPO","ZA1 (K001XPO)"]
["ZA2","LOC GREIL 4002","ZA2 (LOC GREIL 4002)"]
["ZA3","LOC GREIL 4003","ZA3 (LOC GREIL 4003)"]
["ZA4","K002C42","ZA4 (K002C42)"]
["ZA5","K002C45","ZA5 (K002C45)"]
["ZA6","K002C47","ZA6 (K002C47)"]
["ZA7","K002C48","ZA7 (K002C48)"]
["ZB1","K003BRE01","ZB1 (K003BRE01)"]
["ZB2","K003BRE02","ZB2 (K003BRE02)"]
["ZB3","K003BRE03","ZB3 (K003BRE03)"]
["ZB4","K003BRE04","ZB4 (K003BRE04)"]
["ZB5","K003BRE05","ZB5 (K003BRE05)"]
["ZB6","K003BRE08","ZB6 (K003BRE08)"]
["ZB7","K003TND06","ZB7 (K003TND06)"]
["ZB8","K003TND07","ZB8 (K003TND07)"]
["ZC1","K00710","ZC1 (K00710)"]
["ZC2","K00711","ZC2 (K00711)"]
["ZC3","K00712","ZC3 (K00712)"]
["ZC4","K00717","ZC4 (K00717)"]
["ZC5","K00720","ZC5 (K00720)"]
["ZC6","K00721","ZC6 (K00721)"]
["ZD1","K13254","ZD1 (K13254)"]
["ZD2","K13256","ZD2 (K13256)"]
["ZD3","K13259","ZD3 (K13259)"]
["ZD4","K13281","ZD4 (K13281)"]
["ZD5","K13205","ZD5 (K13205)"]
["ZE1","LDZ471EM","ZE1 (LDZ471EM)"]
["ZE2","LDZ881MA","ZE2 (LDZ881MA)"]
["ZE3","LEB138BM","ZE3 (LEB138BM)"]
["ZE4","LDZ277HW","ZE4 (LDZ277HW)"]
["ZE5","LEB695CK","ZE5 (LEB695CK)"]
["ZE6","LEB879CK","ZE6 (LEB879CK)"]
["ZE7","L1877XS7","ZE7 (L1877XS7)"]
["ZE8","LEB009CL","ZE8 (LEB009CL)"]
["ZE9","LEB770CK","ZE9 (LEB770CK)"]
["ZF1","L5247WWA","ZF1 (L5247WWA)"]
["ZF2","Truck ISRAEL MIR","ZF2 (Truck ISRAEL MIR)"]
["ZF3","K00701","ZF3 (K00701)"]
["ZF4","K00702","ZF4 (K00702)"]
["ZF5","K00703","ZF5 (K00703)"]
["ZF6","K00704","ZF6 (K00704)"]
["ZF7","K00705","ZF7 (K00705)"]
["ZF8","K00201","ZF8 (K00201)"]
["ZF9","K00202","ZF9 (K00202)"]
["ZG1","K00203","ZG1 (K00203)"]
["ZG2","K00204","ZG2 (K00204)"]
["ZG3","K00205","ZG3 (K00205)"]
["ZG4","K00206","ZG4 (K00206)"]
["ZG5","K00207","ZG5 (K00207)"]
["ZG6","K13201","ZG6 (K13201)"]
["ZG7","K13202","ZG7 (K13202)"]
["ZG8","K13203","ZG8 (K13203)"]
["ZG9","K13204","ZG9 (K13204)"]
["ZGX","Préfact. Guixers","ZGX (Préfact. Guixers)"]
["ZH1","K00301","ZH1 (K00301)"]
["ZH2","K00302","ZH2 (K00302)"]
["ZH3","K00303","ZH3 (K00303)"]
["ZH4","K00304","ZH4 (K00304)"]
["ZH5","K00305","ZH5 (K00305)"]
["ZH6","K00306","ZH6 (K00306)"]
["ZH7","K00307","ZH7 (K00307)"]
["ZH8","K00308","ZH8 (K00308)"]
["ZH9","KISB01","ZH9 (KISB01)"]
["ZI1","K00309",{"$f":"A1539&\" (\"&$B1539&\")\"","v":"ZI1 (K00309)"}]
["ZZZ","SAP-LE : Freight","ZZZ (SAP-LE : Freight)"]

{"sheet":"Demandeurs","index":11,"n_rows":101,"n_cols":4,"rows_kept":101,"hidden":true}
["#"]
[1,"Moi","moi","moi"]
[{"$f":"IF(OR(ISBLANK(B3),B3=\"\",B3=\" \"),\"\",$A2+1)","v":""}]
[""]
[""]
[""]
[""]
[""]
[""]
[""]
[""]
[""]
[""]
[""]
[""]
[""]
[""]
[""]
[""]
[""]
[""]
[""]
[""]
[""]
[""]
[""]
[""]
[""]
[""]
[""]
[""]
[""]
[""]
[""]
[""]
[""]
[35]
[{"$f":"IF(OR(ISBLANK(B38),B38=\"\",B38=\" \"),\"\",$A37+1)","v":""}]
[{"$f":"IF(OR(ISBLANK(B39),B39=\"\",B39=\" \"),\"\",$A38+1)","v":""}]
[38]
[{"$f":"IF(OR(ISBLANK(B41),B41=\"\",B41=\" \"),\"\",$A40+1)","v":""}]
[{"$f":"IF(OR(ISBLANK(B42),B42=\"\",B42=\" \"),\"\",$A41+1)","v":""}]
[{"$f":"IF(OR(ISBLANK(B43),B43=\"\",B43=\" \"),\"\",$A42+1)","v":""}]
[{"$f":"IF(OR(ISBLANK(B44),B44=\"\",B44=\" \"),\"\",$A43+1)","v":""}]
[57]
[{"$f":"IF(OR(ISBLANK(B46),B46=\"\",B46=\" \"),\"\",$A45+1)","v":""}]
[""]
[{"$f":"IF(OR(ISBLANK(B48),B48=\"\",B48=\" \"),\"\",$A47+1)","v":""}]
[""]
[""]
[""]
[""]
[""]
[""]
[""]
[""]
[""]
[{"$f":"IF(OR(ISBLANK(B58),B58=\"\",B58=\" \"),\"\",$A57+1)","v":""}]
[""]
[56]
[72]
[{"$f":"IF(OR(ISBLANK(B62),B62=\"\",B62=\" \"),\"\",$A61+1)","v":""}]
[""]
[""]
[""]
[""]
[""]
[""]
[""]
[""]
[""]
[""]
[""]
[""]
[""]
[""]
[""]
[""]
[""]
[""]
[""]
[""]
[""]
[""]
[""]
[""]
[""]
[""]
[""]
[""]
[""]
[""]
[""]
[""]
[""]
[""]
[""]
[""]
[""]
[""]
[""]