{"text_format":"3","workbook":"xlsx","n_sheets":3,"sheets":["Devis","BD","BDD1"],"not_rendered":{"macros":1,"defined_names":5},"read":"whole","date_system":"1900"}

{"sheet":"Devis","index":0,"n_rows":12,"n_cols":17,"rows_kept":12}
["Commande Vêtements Personnalisés Associations"]
[{"$nulls":3}," "]
["Nom","Prénom","Désignation Vêtement","Homme/Femme","Taille","Couleur","Marquage/Broderie","Prix","Option logo dos (9€)",null,"Option pavillons (4€)",null,"Prénom/Surnom (5€)",null,"Total options","Prix total","Commentaires"]
[{"$nulls":7},{"$f":"IF(G4=\"Broderie\",VLOOKUP(D4,'BDD1'!A35:C48,3,0),IF(G4=\"Marquage\",VLOOKUP(D4,'BDD1'!A35:C48,2,0)))","v":false},null,{"$f":"IF(I4=\"Oui\",VLOOKUP($D$4,'BDD1'!$A$35:$F$48,4,0),0)","v":{"v":0,"d":"0.00"}},null,{"$f":"IF(K4=\"Oui\",VLOOKUP($D$4,'BDD1'!$A$35:$F$48,5,0),0)","v":{"v":0,"d":"0.00"}},null,{"$f":"IF(M4=\"Oui\",VLOOKUP($D$4,'BDD1'!$A$35:$F$48,6,0),0)","v":{"v":0,"d":"0.00"}},{"$f":"N4+L4+J4","v":{"v":0,"d":"0.00"}},{"$f":"O4+H4","v":{"v":0,"d":"0.00"}}]
[]
[{"$nulls":4},"SOMME A REGLER",null,{"$f":"SUM(H3:H4)","v":{"v":0,"d":"0.00"}},null,{"$f":"SUM(J3:J4)","v":{"v":0,"d":"0.00"}},null,{"$f":"SUM(L3:L4)","v":{"v":0,"d":"0.00"}},null,{"$f":"SUM(N3:N4)","v":{"v":0,"d":"0.00"}},null,{"$f":"SUM(O3:O4)","v":{"v":0,"d":"0.00"}},{"$f":"SUM(P3:P4)","v":{"v":0,"d":"0.00"}}]
[]
["Quelques conseils pour remplir le tableau :"]
["- Coupes homme/femme : lorsque le vêtement est mixte, ne rien préciser. Pour un vêtement mixte, une femme peut choisir une taille en-dessous de sa taille habituelle pour avoir un vêtement plus près du corps."]
["- Marquage ou broderie : le choix est parfois donné, ce qui est indiqué sur chaque fiche article. Le prix varie uniquement pour les t-shirts."]
["- Options : faire le total…"]
["- Prix total : calculé automatiquement à partir du prix du vêtement et du total des options"]

{"sheet":"BD","index":1,"n_rows":1173,"n_cols":6,"rows_kept":1173}
["Désignation Vêtement","Homme/Femme","Taille","Couleur","Marquage/Broderie","Prix"]
["TShirt","Homme","S","Gris Foncé","Marquage",14]
["TShirt","Homme","S","Bleu Ciel","Marquage",14]
["TShirt","Homme","S","Kelly Green","Marquage",14]
["TShirt","Homme","S","Fuchsia","Marquage",14]
["TShirt","Homme","S","Bleu Tropical","Marquage",14]
["TShirt","Homme","S","Orange","Marquage",14]
["TShirt","Homme","S","Violet","Marquage",14]
["TShirt","Homme","S","Vert Lime","Marquage",14]
["TShirt","Homme","S","Bleu Roi","Marquage",14]
["TShirt","Homme","S","Kaki","Marquage",14]
["TShirt","Homme","M","Gris Foncé","Marquage",14]
["TShirt","Homme","M","Bleu Ciel","Marquage",14]
["TShirt","Homme","M","Kelly Green","Marquage",14]
["TShirt","Homme","M","Fuchsia","Marquage",14]
["TShirt","Homme","M","Bleu Tropical","Marquage",14]
["TShirt","Homme","M","Orange","Marquage",14]
["TShirt","Homme","M","Violet","Marquage",14]
["TShirt","Homme","M","Vert Lime","Marquage",14]
["TShirt","Homme","M","Bleu Roi","Marquage",14]
["TShirt","Homme","M","Kaki","Marquage",14]
["TShirt","Homme","L","Gris Foncé","Marquage",14]
["TShirt","Homme","L","Bleu Ciel","Marquage",14]
["TShirt","Homme","L","Kelly Green","Marquage",14]
["TShirt","Homme","L","Fuchsia","Marquage",14]
["TShirt","Homme","L","Bleu Tropical","Marquage",14]
["TShirt","Homme","L","Orange","Marquage",14]
["TShirt","Homme","L","Violet","Marquage",14]
["TShirt","Homme","L","Vert Lime","Marquage",14]
["TShirt","Homme","L","Bleu Roi","Marquage",14]
["TShirt","Homme","L","Kaki","Marquage",14]
["TShirt","Homme","XL","Gris Foncé","Marquage",14]
["TShirt","Homme","XL","Bleu Ciel","Marquage",14]
["TShirt","Homme","XL","Kelly Green","Marquage",14]
["TShirt","Homme","XL","Fuchsia","Marquage",14]
["TShirt","Homme","XL","Bleu Tropical","Marquage",14]
["TShirt","Homme","XL","Orange","Marquage",14]
["TShirt","Homme","XL","Violet","Marquage",14]
["TShirt","Homme","XL","Vert Lime","Marquage",14]
["TShirt","Homme","XL","Bleu Roi","Marquage",14]
["TShirt","Homme","XL","Kaki","Marquage",14]
["TShirt","Homme","XXL","Gris Foncé","Marquage",14]
["TShirt","Homme","XXL","Bleu Ciel","Marquage",14]
["TShirt","Homme","XXL","Kelly Green","Marquage",14]
["TShirt","Homme","XXL","Fuchsia","Marquage",14]
["TShirt","Homme","XXL","Bleu Tropical","Marquage",14]
["TShirt","Homme","XXL","Orange","Marquage",14]
["TShirt","Homme","XXL","Violet","Marquage",14]
["TShirt","Homme","XXL","Vert Lime","Marquage",14]
["TShirt","Homme","XXL","Bleu Roi","Marquage",14]
["TShirt","Homme","XXL","Kaki","Marquage",14]
["TShirt","Homme","XXXL","Gris Foncé","Marquage",14]
["TShirt","Homme","XXXL","Bleu Ciel","Marquage",14]
["TShirt","Homme","XXXL","Kelly Green","Marquage",14]
["TShirt","Homme","XXXL","Fuchsia","Marquage",14]
["TShirt","Homme","XXXL","Bleu Tropical","Marquage",14]
["TShirt","Homme","XXXL","Orange","Marquage",14]
["TShirt","Homme","XXXL","Violet","Marquage",14]
["TShirt","Homme","XXXL","Vert Lime","Marquage",14]
["TShirt","Homme","XXXL","Bleu Roi","Marquage",14]
["TShirt","Homme","XXXL","Kaki","Marquage",14]
["TShirt","Homme","XXXXL","Gris Foncé","Marquage",14]
["TShirt","Homme","XXXXL","Bleu Ciel","Marquage",14]
["TShirt","Homme","XXXXL","Kelly Green","Marquage",14]
["TShirt","Homme","XXXXL","Fuchsia","Marquage",14]
["TShirt","Homme","XXXXL","Bleu Tropical","Marquage",14]
["TShirt","Homme","XXXXL","Orange","Marquage",14]
["TShirt","Homme","XXXXL","Violet","Marquage",14]
["TShirt","Homme","XXXXL","Vert Lime","Marquage",14]
["TShirt","Homme","XXXXL","Bleu Roi","Marquage",14]
["TShirt","Homme","XXXXL","Kaki","Marquage",14]
["TShirt","Femme","S","Gris Foncé","Marquage",14]
["TShirt","Femme","S","Bleu Ciel","Marquage",14]
["TShirt","Femme","S","Kelly Green","Marquage",14]
["TShirt","Femme","S","Fuchsia","Marquage",14]
["TShirt","Femme","S","Bleu Tropical","Marquage",14]
["TShirt","Femme","S","Orange","Marquage",14]
["TShirt","Femme","S","Violet","Marquage",14]
["TShirt","Femme","S","Vert Lime","Marquage",14]
["TShirt","Femme","S","Bleu Roi","Marquage",14]
["TShirt","Femme","S","Kaki","Marquage",14]
["TShirt","Femme","M","Gris Foncé","Marquage",14]
["TShirt","Femme","M","Bleu Ciel","Marquage",14]
["TShirt","Femme","M","Kelly Green","Marquage",14]
["TShirt","Femme","M","Fuchsia","Marquage",14]
["TShirt","Femme","M","Bleu Tropical","Marquage",14]
["TShirt","Femme","M","Orange","Marquage",14]
["TShirt","Femme","M","Violet","Marquage",14]
["TShirt","Femme","M","Vert Lime","Marquage",14]
["TShirt","Femme","M","Bleu Roi","Marquage",14]
["TShirt","Femme","M","Kaki","Marquage",14]
["TShirt","Femme","L","Gris Foncé","Marquage",14]
["TShirt","Femme","L","Bleu Ciel","Marquage",14]
["TShirt","Femme","L","Kelly Green","Marquage",14]
["TShirt","Femme","L","Fuchsia","Marquage",14]
["TShirt","Femme","L","Bleu Tropical","Marquage",14]
["TShirt","Femme","L","Orange","Marquage",14]
["TShirt","Femme","L","Violet","Marquage",14]
["TShirt","Femme","L","Vert Lime","Marquage",14]
["TShirt","Femme","L","Bleu Roi","Marquage",14]
["TShirt","Femme","L","Kaki","Marquage",14]
["TShirt","Femme","XL","Gris Foncé","Marquage",14]
["TShirt","Femme","XL","Bleu Ciel","Marquage",14]
["TShirt","Femme","XL","Kelly Green","Marquage",14]
["TShirt","Femme","XL","Fuchsia","Marquage",14]
["TShirt","Femme","XL","Bleu Tropical","Marquage",14]
["TShirt","Femme","XL","Orange","Marquage",14]
["TShirt","Femme","XL","Violet","Marquage",14]
["TShirt","Femme","XL","Vert Lime","Marquage",14]
["TShirt","Femme","XL","Bleu Roi","Marquage",14]
["TShirt","Femme","XL","Kaki","Marquage",14]
["TShirt","Femme","XXL","Gris Foncé","Marquage",14]
["TShirt","Femme","XXL","Bleu Ciel","Marquage",14]
["TShirt","Femme","XXL","Kelly Green","Marquage",14]
["TShirt","Femme","XXL","Fuchsia","Marquage",14]
["TShirt","Femme","XXL","Bleu Tropical","Marquage",14]
["TShirt","Femme","XXL","Orange","Marquage",14]
["TShirt","Femme","XXL","Violet","Marquage",14]
["TShirt","Femme","XXL","Vert Lime","Marquage",14]
["TShirt","Femme","XXL","Bleu Roi","Marquage",14]
["TShirt","Femme","XXL","Kaki","Marquage",14]
["TShirt","Femme","XXXL","Gris Foncé","Marquage",14]
["TShirt","Femme","XXXL","Bleu Ciel","Marquage",14]
["TShirt","Femme","XXXL","Kelly Green","Marquage",14]
["TShirt","Femme","XXXL","Fuchsia","Marquage",14]
["TShirt","Femme","XXXL","Bleu Tropical","Marquage",14]
["TShirt","Femme","XXXL","Orange","Marquage",14]
["TShirt","Femme","XXXL","Violet","Marquage",14]
["TShirt","Femme","XXXL","Vert Lime","Marquage",14]
["TShirt","Femme","XXXL","Bleu Roi","Marquage",14]
["TShirt","Femme","XXXL","Kaki","Marquage",14]
["TShirt","Enfant","4/6 Ans","Gris Foncé","Marquage",13]
["TShirt","Enfant","4/6 Ans","Bleu Ciel","Marquage",13]
["TShirt","Enfant","4/6 Ans","Kelly Green","Marquage",13]
["TShirt","Enfant","4/6 Ans","Fuchsia","Marquage",13]
["TShirt","Enfant","4/6 Ans","Bleu Tropical","Marquage",13]
["TShirt","Enfant","4/6 Ans","Orange","Marquage",13]
["TShirt","Enfant","4/6 Ans","Violet","Marquage",13]
["TShirt","Enfant","4/6 Ans","Vert Lime","Marquage",13]
["TShirt","Enfant","4/6 Ans","Bleu Roi","Marquage",13]
["TShirt","Enfant","4/6 Ans","Kaki","Marquage",13]
["TShirt","Enfant","6/8 Ans","Gris Foncé","Marquage",13]
["TShirt","Enfant","6/8 Ans","Bleu Ciel","Marquage",13]
["TShirt","Enfant","6/8 Ans","Kelly Green","Marquage",13]
["TShirt","Enfant","6/8 Ans","Fuchsia","Marquage",13]
["TShirt","Enfant","6/8 Ans","Bleu Tropical","Marquage",13]
["TShirt","Enfant","6/8 Ans","Orange","Marquage",13]
["TShirt","Enfant","6/8 Ans","Violet","Marquage",13]
["TShirt","Enfant","6/8 Ans","Vert Lime","Marquage",13]
["TShirt","Enfant","6/8 Ans","Bleu Roi","Marquage",13]
["TShirt","Enfant","6/8 Ans","Kaki","Marquage",13]
["TShirt","Enfant","8/10 Ans","Gris Foncé","Marquage",13]
["TShirt","Enfant","8/10 Ans","Bleu Ciel","Marquage",13]
["TShirt","Enfant","8/10 Ans","Kelly Green","Marquage",13]
["TShirt","Enfant","8/10 Ans","Fuchsia","Marquage",13]
["TShirt","Enfant","8/10 Ans","Bleu Tropical","Marquage",13]
["TShirt","Enfant","8/10 Ans","Orange","Marquage",13]
["TShirt","Enfant","8/10 Ans","Violet","Marquage",13]
["TShirt","Enfant","8/10 Ans","Vert Lime","Marquage",13]
["TShirt","Enfant","8/10 Ans","Bleu Roi","Marquage",13]
["TShirt","Enfant","8/10 Ans","Kaki","Marquage",13]
["TShirt","Enfant","10/12 Ans","Gris Foncé","Marquage",13]
["TShirt","Enfant","10/12 Ans","Bleu Ciel","Marquage",13]
["TShirt","Enfant","10/12 Ans","Kelly Green","Marquage",13]
["TShirt","Enfant","10/12 Ans","Fuchsia","Marquage",13]
["TShirt","Enfant","10/12 Ans","Bleu Tropical","Marquage",13]
["TShirt","Enfant","10/12 Ans","Orange","Marquage",13]
["TShirt","Enfant","10/12 Ans","Violet","Marquage",13]
["TShirt","Enfant","10/12 Ans","Vert Lime","Marquage",13]
["TShirt","Enfant","10/12 Ans","Bleu Roi","Marquage",13]
["TShirt","Enfant","10/12 Ans","Kaki","Marquage",13]
["TShirt","Enfant","12/14 Ans","Gris Foncé","Marquage",13]
["TShirt","Enfant","12/14 Ans","Bleu Ciel","Marquage",13]
["TShirt","Enfant","12/14 Ans","Kelly Green","Marquage",13]
["TShirt","Enfant","12/14 Ans","Fuchsia","Marquage",13]
["TShirt","Enfant","12/14 Ans","Bleu Tropical","Marquage",13]
["TShirt","Enfant","12/14 Ans","Orange","Marquage",13]
["TShirt","Enfant","12/14 Ans","Violet","Marquage",13]
["TShirt","Enfant","12/14 Ans","Vert Lime","Marquage",13]
["TShirt","Enfant","12/14 Ans","Bleu Roi","Marquage",13]
["TShirt","Enfant","12/14 Ans","Kaki","Marquage",13]
["TShirt","Bébé","3 Mois","Gris Foncé","Marquage",13]
["TShirt","Bébé","3 Mois","Bleu Ciel","Marquage",13]
["TShirt","Bébé","3 Mois","Kelly Green","Marquage",13]
["TShirt","Bébé","3 Mois","Fuchsia","Marquage",13]
["TShirt","Bébé","3 Mois","Bleu Tropical","Marquage",13]
["TShirt","Bébé","3 Mois","Orange","Marquage",13]
["TShirt","Bébé","3 Mois","Violet","Marquage",13]
["TShirt","Bébé","3 Mois","Vert Lime","Marquage",13]
["TShirt","Bébé","3 Mois","Bleu Roi","Marquage",13]
["TShirt","Bébé","3 Mois","Kaki","Marquage",13]
["TShirt","Bébé","6 Mois","Gris Foncé","Marquage",13]
["TShirt","Bébé","6 Mois","Bleu Ciel","Marquage",13]
["TShirt","Bébé","6 Mois","Kelly Green","Marquage",13]
["TShirt","Bébé","6 Mois","Fuchsia","Marquage",13]
["TShirt","Bébé","6 Mois","Bleu Tropical","Marquage",13]
["TShirt","Bébé","6 Mois","Orange","Marquage",13]
["TShirt","Bébé","6 Mois","Violet","Marquage",13]
["TShirt","Bébé","6 Mois","Vert Lime","Marquage",13]
["TShirt","Bébé","6 Mois","Bleu Roi","Marquage",13]
["TShirt","Bébé","6 Mois","Kaki","Marquage",13]
["TShirt","Bébé","9 Mois","Gris Foncé","Marquage",13]
["TShirt","Bébé","9 Mois","Bleu Ciel","Marquage",13]
["TShirt","Bébé","9 Mois","Kelly Green","Marquage",13]
["TShirt","Bébé","9 Mois","Fuchsia","Marquage",13]
["TShirt","Bébé","9 Mois","Bleu Tropical","Marquage",13]
["TShirt","Bébé","9 Mois","Orange","Marquage",13]
["TShirt","Bébé","9 Mois","Violet","Marquage",13]
["TShirt","Bébé","9 Mois","Vert Lime","Marquage",13]
["TShirt","Bébé","9 Mois","Bleu Roi","Marquage",13]
["TShirt","Bébé","9 Mois","Kaki","Marquage",13]
["TShirt","Bébé","12 Mois","Gris Foncé","Marquage",13]
["TShirt","Bébé","12 Mois","Bleu Ciel","Marquage",13]
["TShirt","Bébé","12 Mois","Kelly Green","Marquage",13]
["TShirt","Bébé","12 Mois","Fuchsia","Marquage",13]
["TShirt","Bébé","12 Mois","Bleu Tropical","Marquage",13]
["TShirt","Bébé","12 Mois","Orange","Marquage",13]
["TShirt","Bébé","12 Mois","Violet","Marquage",13]
["TShirt","Bébé","12 Mois","Vert Lime","Marquage",13]
["TShirt","Bébé","12 Mois","Bleu Roi","Marquage",13]
["TShirt","Bébé","12 Mois","Kaki","Marquage",13]
["TShirt","Bébé","18 Mois","Gris Foncé","Marquage",13]
["TShirt","Bébé","18 Mois","Bleu Ciel","Marquage",13]
["TShirt","Bébé","18 Mois","Kelly Green","Marquage",13]
["TShirt","Bébé","18 Mois","Fuchsia","Marquage",13]
["TShirt","Bébé","18 Mois","Bleu Tropical","Marquage",13]
["TShirt","Bébé","18 Mois","Orange","Marquage",13]
["TShirt","Bébé","18 Mois","Violet","Marquage",13]
["TShirt","Bébé","18 Mois","Vert Lime","Marquage",13]
["TShirt","Bébé","18 Mois","Bleu Roi","Marquage",13]
["TShirt","Bébé","18 Mois","Kaki","Marquage",13]
["TShirt","Bébé","24 Mois","Gris Foncé","Marquage",13]
["TShirt","Bébé","24 Mois","Bleu Ciel","Marquage",13]
["TShirt","Bébé","24 Mois","Kelly Green","Marquage",13]
["TShirt","Bébé","24 Mois","Fuchsia","Marquage",13]
["TShirt","Bébé","24 Mois","Bleu Tropical","Marquage",13]
["TShirt","Bébé","24 Mois","Orange","Marquage",13]
["TShirt","Bébé","24 Mois","Violet","Marquage",13]
["TShirt","Bébé","24 Mois","Vert Lime","Marquage",13]
["TShirt","Bébé","24 Mois","Bleu Roi","Marquage",13]
["TShirt","Bébé","24 Mois","Kaki","Marquage",13]
["TShirt","Bébé","36 Mois","Gris Foncé","Marquage",13]
["TShirt","Bébé","36 Mois","Bleu Ciel","Marquage",13]
["TShirt","Bébé","36 Mois","Kelly Green","Marquage",13]
["TShirt","Bébé","36 Mois","Fuchsia","Marquage",13]
["TShirt","Bébé","36 Mois","Bleu Tropical","Marquage",13]
["TShirt","Bébé","36 Mois","Orange","Marquage",13]
["TShirt","Bébé","36 Mois","Violet","Marquage",13]
["TShirt","Bébé","36 Mois","Vert Lime","Marquage",13]
["TShirt","Bébé","36 Mois","Bleu Roi","Marquage",13]
["TShirt","Bébé","36 Mois","Kaki","Marquage",13]
["TShirt","Homme","S","Gris Foncé","Broderie",17]
["TShirt","Homme","S","Bleu Ciel","Broderie",17]
["TShirt","Homme","S","Kelly Green","Broderie",17]
["TShirt","Homme","S","Fuchsia","Broderie",17]
["TShirt","Homme","S","Bleu Tropical","Broderie",17]
["TShirt","Homme","S","Orange","Broderie",17]
["TShirt","Homme","S","Violet","Broderie",17]
["TShirt","Homme","S","Vert Lime","Broderie",17]
["TShirt","Homme","S","Bleu Roi","Broderie",17]
["TShirt","Homme","S","Kaki","Broderie",17]
["TShirt","Homme","M","Gris Foncé","Broderie",17]
["TShirt","Homme","M","Bleu Ciel","Broderie",17]
["TShirt","Homme","M","Kelly Green","Broderie",17]
["TShirt","Homme","M","Fuchsia","Broderie",17]
["TShirt","Homme","M","Bleu Tropical","Broderie",17]
["TShirt","Homme","M","Orange","Broderie",17]
["TShirt","Homme","M","Violet","Broderie",17]
["TShirt","Homme","M","Vert Lime","Broderie",17]
["TShirt","Homme","M","Bleu Roi","Broderie",17]
["TShirt","Homme","M","Kaki","Broderie",17]
["TShirt","Homme","L","Gris Foncé","Broderie",17]
["TShirt","Homme","L","Bleu Ciel","Broderie",17]
["TShirt","Homme","L","Kelly Green","Broderie",17]
["TShirt","Homme","L","Fuchsia","Broderie",17]
["TShirt","Homme","L","Bleu Tropical","Broderie",17]
["TShirt","Homme","L","Orange","Broderie",17]
["TShirt","Homme","L","Violet","Broderie",17]
["TShirt","Homme","L","Vert Lime","Broderie",17]
["TShirt","Homme","L","Bleu Roi","Broderie",17]
["TShirt","Homme","L","Kaki","Broderie",17]
["TShirt","Homme","XL","Gris Foncé","Broderie",17]
["TShirt","Homme","XL","Bleu Ciel","Broderie",17]
["TShirt","Homme","XL","Kelly Green","Broderie",17]
["TShirt","Homme","XL","Fuchsia","Broderie",17]
["TShirt","Homme","XL","Bleu Tropical","Broderie",17]
["TShirt","Homme","XL","Orange","Broderie",17]
["TShirt","Homme","XL","Violet","Broderie",17]
["TShirt","Homme","XL","Vert Lime","Broderie",17]
["TShirt","Homme","XL","Bleu Roi","Broderie",17]
["TShirt","Homme","XL","Kaki","Broderie",17]
["TShirt","Homme","XXL","Gris Foncé","Broderie",17]
["TShirt","Homme","XXL","Bleu Ciel","Broderie",17]
["TShirt","Homme","XXL","Kelly Green","Broderie",17]
["TShirt","Homme","XXL","Fuchsia","Broderie",17]
["TShirt","Homme","XXL","Bleu Tropical","Broderie",17]
["TShirt","Homme","XXL","Orange","Broderie",17]
["TShirt","Homme","XXL","Violet","Broderie",17]
["TShirt","Homme","XXL","Vert Lime","Broderie",17]
["TShirt","Homme","XXL","Bleu Roi","Broderie",17]
["TShirt","Homme","XXL","Kaki","Broderie",17]
["TShirt","Homme","XXXL","Gris Foncé","Broderie",17]
["TShirt","Homme","XXXL","Bleu Ciel","Broderie",17]
["TShirt","Homme","XXXL","Kelly Green","Broderie",17]
["TShirt","Homme","XXXL","Fuchsia","Broderie",17]
["TShirt","Homme","XXXL","Bleu Tropical","Broderie",17]
["TShirt","Homme","XXXL","Orange","Broderie",17]
["TShirt","Homme","XXXL","Violet","Broderie",17]
["TShirt","Homme","XXXL","Vert Lime","Broderie",17]
["TShirt","Homme","XXXL","Bleu Roi","Broderie",17]
["TShirt","Homme","XXXL","Kaki","Broderie",17]
["TShirt","Homme","XXXXL","Gris Foncé","Broderie",17]
["TShirt","Homme","XXXXL","Bleu Ciel","Broderie",17]
["TShirt","Homme","XXXXL","Kelly Green","Broderie",17]
["TShirt","Homme","XXXXL","Fuchsia","Broderie",17]
["TShirt","Homme","XXXXL","Bleu Tropical","Broderie",17]
["TShirt","Homme","XXXXL","Orange","Broderie",17]
["TShirt","Homme","XXXXL","Violet","Broderie",17]
["TShirt","Homme","XXXXL","Vert Lime","Broderie",17]
["TShirt","Homme","XXXXL","Bleu Roi","Broderie",17]
["TShirt","Homme","XXXXL","Kaki","Broderie",17]
["TShirt","Femme","S","Gris Foncé","Broderie",17]
["TShirt","Femme","S","Bleu Ciel","Broderie",17]
["TShirt","Femme","S","Kelly Green","Broderie",17]
["TShirt","Femme","S","Fuchsia","Broderie",17]
["TShirt","Femme","S","Bleu Tropical","Broderie",17]
["TShirt","Femme","S","Orange","Broderie",17]
["TShirt","Femme","S","Violet","Broderie",17]
["TShirt","Femme","S","Vert Lime","Broderie",17]
["TShirt","Femme","S","Bleu Roi","Broderie",17]
["TShirt","Femme","S","Kaki","Broderie",17]
["TShirt","Femme","M","Gris Foncé","Broderie",17]
["TShirt","Femme","M","Bleu Ciel","Broderie",17]
["TShirt","Femme","M","Kelly Green","Broderie",17]
["TShirt","Femme","M","Fuchsia","Broderie",17]
["TShirt","Femme","M","Bleu Tropical","Broderie",17]
["TShirt","Femme","M","Orange","Broderie",17]
["TShirt","Femme","M","Violet","Broderie",17]
["TShirt","Femme","M","Vert Lime","Broderie",17]
["TShirt","Femme","M","Bleu Roi","Broderie",17]
["TShirt","Femme","M","Kaki","Broderie",17]
["TShirt","Femme","L","Gris Foncé","Broderie",17]
["TShirt","Femme","L","Bleu Ciel","Broderie",17]
["TShirt","Femme","L","Kelly Green","Broderie",17]
["TShirt","Femme","L","Fuchsia","Broderie",17]
["TShirt","Femme","L","Bleu Tropical","Broderie",17]
["TShirt","Femme","L","Orange","Broderie",17]
["TShirt","Femme","L","Violet","Broderie",17]
["TShirt","Femme","L","Vert Lime","Broderie",17]
["TShirt","Femme","L","Bleu Roi","Broderie",17]
["TShirt","Femme","L","Kaki","Broderie",17]
["TShirt","Femme","XL","Gris Foncé","Broderie",17]
["TShirt","Femme","XL","Bleu Ciel","Broderie",17]
["TShirt","Femme","XL","Kelly Green","Broderie",17]
["TShirt","Femme","XL","Fuchsia","Broderie",17]
["TShirt","Femme","XL","Bleu Tropical","Broderie",17]
["TShirt","Femme","XL","Orange","Broderie",17]
["TShirt","Femme","XL","Violet","Broderie",17]
["TShirt","Femme","XL","Vert Lime","Broderie",17]
["TShirt","Femme","XL","Bleu Roi","Broderie",17]
["TShirt","Femme","XL","Kaki","Broderie",17]
["TShirt","Femme","XXL","Gris Foncé","Broderie",17]
["TShirt","Femme","XXL","Bleu Ciel","Broderie",17]
["TShirt","Femme","XXL","Kelly Green","Broderie",17]
["TShirt","Femme","XXL","Fuchsia","Broderie",17]
["TShirt","Femme","XXL","Bleu Tropical","Broderie",17]
["TShirt","Femme","XXL","Orange","Broderie",17]
["TShirt","Femme","XXL","Violet","Broderie",17]
["TShirt","Femme","XXL","Vert Lime","Broderie",17]
["TShirt","Femme","XXL","Bleu Roi","Broderie",17]
["TShirt","Femme","XXL","Kaki","Broderie",17]
["TShirt","Femme","XXXL","Gris Foncé","Broderie",17]
["TShirt","Femme","XXXL","Bleu Ciel","Broderie",17]
["TShirt","Femme","XXXL","Kelly Green","Broderie",17]
["TShirt","Femme","XXXL","Fuchsia","Broderie",17]
["TShirt","Femme","XXXL","Bleu Tropical","Broderie",17]
["TShirt","Femme","XXXL","Orange","Broderie",17]
["TShirt","Femme","XXXL","Violet","Broderie",17]
["TShirt","Femme","XXXL","Vert Lime","Broderie",17]
["TShirt","Femme","XXXL","Bleu Roi","Broderie",17]
["TShirt","Femme","XXXL","Kaki","Broderie",17]
["TShirt","Enfant","4/6 Ans","Gris Foncé","Broderie",16]
["TShirt","Enfant","4/6 Ans","Bleu Ciel","Broderie",16]
["TShirt","Enfant","4/6 Ans","Kelly Green","Broderie",16]
["TShirt","Enfant","4/6 Ans","Fuchsia","Broderie",16]
["TShirt","Enfant","4/6 Ans","Bleu Tropical","Broderie",16]
["TShirt","Enfant","4/6 Ans","Orange","Broderie",16]
["TShirt","Enfant","4/6 Ans","Violet","Broderie",16]
["TShirt","Enfant","4/6 Ans","Vert Lime","Broderie",16]
["TShirt","Enfant","4/6 Ans","Bleu Roi","Broderie",16]
["TShirt","Enfant","4/6 Ans","Kaki","Broderie",16]
["TShirt","Enfant","6/8 Ans","Gris Foncé","Broderie",16]
["TShirt","Enfant","6/8 Ans","Bleu Ciel","Broderie",16]
["TShirt","Enfant","6/8 Ans","Kelly Green","Broderie",16]
["TShirt","Enfant","6/8 Ans","Fuchsia","Broderie",16]
["TShirt","Enfant","6/8 Ans","Bleu Tropical","Broderie",16]
["TShirt","Enfant","6/8 Ans","Orange","Broderie",16]
["TShirt","Enfant","6/8 Ans","Violet","Broderie",16]
["TShirt","Enfant","6/8 Ans","Vert Lime","Broderie",16]
["TShirt","Enfant","6/8 Ans","Bleu Roi","Broderie",16]
{"$rows_left_out":774}
{"sheet":"BDD1","index":2,"n_rows":73,"n_cols":20,"rows_kept":73,"hidden":true}
["TShirt","Polo_Manches_Courtes","Polo_Manches_Longues","Polaire_Manche","Polaire_sans_manche","Sweat","Sweat_Zippé","Bodywarmer","Veste_Softshell","Veste softshell","Coupe-vent","Parkas","Parkas_3_en_1","Bonnet","Tour_de_Cou","Serviette_Chamois","Drap_de_bain","Peignoir","Sac_à_Dos","Sac_de_sport"]
[]
[]
[{"$nulls":6},"Homme/Femme","Taille","Couleur","Marquage/Broderie","Prix","Option logo dos (9€)","Option pavillons (4€)","Prénom/Surnom (5€)",null,"Total options","Prix total","Commentaires"]
{"$rows_empty":14}
[{"$nulls":4},"Personnalisation",null,null,"Homme","Femme","Enfant","Bébé"]
[{"$nulls":4},"Logo dos",{"v":9,"d":"9.00 €"}]
[{"$nulls":4},"Pavillons de plongée",{"v":4,"d":"4.00 €"}]
[{"$nulls":4},"Prénom",{"v":5,"d":"5.00 €"}]
[{"$nulls":4},"Frais de maquette",{"v":72,"d":"72.00 €"}]
[]
[]
[]
[]
[]
["Marquage"]
["Broderie"]
[]
[]
[]
[null,"Tarif Marquage","Tarif Broderie","Option logo dos (9€)","Option pavillons (4€)","Prénom/Surnom (5€)"]
["TS_Homme",{"v":14,"d":"14.00 €"},{"v":17,"d":"17.00 €"},{"v":9,"d":"9.00 €"},{"v":4,"d":"4.00 €"},{"v":5,"d":"5.00 €"}]
["TS_Femme",{"v":14,"d":"14.00 €"},{"v":17,"d":"17.00 €"},{"v":9,"d":"9.00 €"},{"v":4,"d":"4.00 €"},{"v":5,"d":"5.00 €"}]
["TS_Enfant",{"v":13,"d":"13.00 €"},{"v":16,"d":"16.00 €"},{"v":9,"d":"9.00 €"},{"v":4,"d":"4.00 €"},{"v":5,"d":"5.00 €"}]
["TS_Bébé",{"v":13,"d":"13.00 €"},{"v":16,"d":"16.00 €"},{"v":9,"d":"9.00 €"},{"v":4,"d":"4.00 €"},{"v":5,"d":"5.00 €"}]
["PoloMC_Homme","-",{"v":21,"d":"21.00 €"},{"v":9,"d":"9.00 €"},{"v":4,"d":"4.00 €"},{"v":5,"d":"5.00 €"}]
["PoloMC_Femme","-",{"v":21,"d":"21.00 €"},{"v":9,"d":"9.00 €"},{"v":4,"d":"4.00 €"},{"v":5,"d":"5.00 €"}]
["PoloMC_Enfant",{"v":19,"d":"19.00 €"},{"v":21,"d":"21.00 €"},{"v":9,"d":"9.00 €"},{"v":4,"d":"4.00 €"},{"v":5,"d":"5.00 €"}]
["PoloMC_Bébé",{"v":19,"d":"19.00 €"},{"v":22,"d":"22.00 €"},{"v":9,"d":"9.00 €"},{"v":4,"d":"4.00 €"},{"v":5,"d":"5.00 €"}]
["PoloML_Homme","-",{"v":24,"d":"24.00 €"},{"v":9,"d":"9.00 €"},{"v":4,"d":"4.00 €"},{"v":5,"d":"5.00 €"}]
["PoloML_Femme","-",{"v":24,"d":"24.00 €"},{"v":9,"d":"9.00 €"},{"v":4,"d":"4.00 €"},{"v":5,"d":"5.00 €"}]
["PsM_Enfant",null,null,{"v":9,"d":"9.00 €"},{"v":4,"d":"4.00 €"},{"v":5,"d":"5.00 €"}]
["Sweat_Homme",null,null,{"v":9,"d":"9.00 €"},{"v":4,"d":"4.00 €"},{"v":5,"d":"5.00 €"}]
["Sweat_Femme",null,null,{"v":9,"d":"9.00 €"},{"v":4,"d":"4.00 €"},{"v":5,"d":"5.00 €"}]
["Sweat_Enfant",null,null,{"v":9,"d":"9.00 €"},{"v":4,"d":"4.00 €"},{"v":5,"d":"5.00 €"}]
["SweatZ_Homme"]
["SweatZ_Femme"]
["SweatZ_Enfant"]
["BW_Homme"]
["BW_Femme"]
["BW_Enfant"]
["SS_Homme"]
["SS_Femme"]
["SS_Enfant"]
["SSc_Homme"]
["SSc_Femme"]
["SSc_Enfant"]
["CV_Homme"]
["CV_Femme"]
["CV_Enfant"]
["P_Mixte"]
["PARKA"]
["P31_Mixte"]
["51 cm"]
["28 x 26 cm"]
["140 x 70 cm"]
["100 x 160 cm"]
["L"]
["35 x 46 x 24 cm"]
["68 x 34 x 31 cm"]