{"text_format":"3","workbook":"xlsx","n_sheets":4,"sheets":["Données","Effectif","imprimer","Stat"],"not_rendered":{"images":1,"macros":1,"defined_names":13},"read":"whole","date_system":"1900"}

{"sheet":"Données","index":0,"n_rows":11,"n_cols":19,"rows_kept":11}
["N° de la fiche","Référence","Index utilisateur","Titre","Nature","Date d'édition","Version","RA","Date version","Date d'application","Objet","Sites","TES H et K (CDM)","TES I (S6)","TES J (AF)","TES L (RAT)","TSAE 5 \"gestion bloc\"","TSAE 3 \"mouvement\"","CRLO"]
[1,"VO00572","S7A","TER 2N Z24500, Z26500, Z2200 CFL et Z23500: Dispositions applicables par les agents des gares et les agents d'accompagnements","Document opérationnel","20/12/2017",1,null,"2017-12-20","02/01/2018","La révision de ce document est motivée par la réalisation des opérations de mi vie des matériels TER 2N PG. Ce document initialement consacré à la série TER 2N NG intègre désormais les fonctionnalités de la série TER 2N PG (Z23500)","Quai A","x",null,"x",null,null,"x"]
[2,"OP521",null,"Constitution et anomalies de la signalisation d'arrière portée par les trains","Document d'exploitation","08/12/2017",2,null,"2017-12-08","10/06/2018","Le présent document précise les conditions d'équipement des trains en signalisation d'arrière et les conditions de circulation d'un train en cas d'absence ou de dysfonctionnement de sa signalisation d'arrière, d'extinction totale ou partielle ou de présence intempestive dans le corps d'un train.","Quai A et Point M"]
[3,"ESV TGV PACA VO00209","PS 09","CLO Marseille St Charles - Fascicule 09 - Protection du personnel","Document opérationnel","26/01/2018",1,null,"2018-01-26","12/02/2018","La nouvelle édition est rendue nécessaire par la création de l’ESV TGV PACA. Et suite à la volonté d’élargir les mesures de protection du personnel des entretpreise extérieures pour tout type d’intervention (autre que nettoyage notamment). \nLes articles et chapitres ont été réorganisés. L’annexe 3.2 a été modifiée. Des précisions quant à la tenue du TOV sont apportées. Le stationnement des trains forums est restreint aux voies 33 et 43.\n","Quai A et Point M","x","x","x","x","x","x"]
[4,"VO00392","S 00","Communications de sécurité","Principe","22/01/2018",1,null,"2018-01-22","05/02/2018","Le présent document définit les principes concernant les prises de connaissance des textes de sécurité, les remises de service et les communications de sécurité à mettre en oeuvre lors des procédures de sécurité par les opérateurs des Activités Voyageurs de SNCF Mobilités.\nIl viens en remplacement des textes OP542  et OP596.","Quai A et Point M","x","x","x","x","x","x","x"]
[5,"VO01662","S 07 A","ELEMENTS AUTOMOTEURS ELECTRIQUES Z 23500 (TER2N PG)","Document d'application","24/01/2018",1,null,"2018-01-24","24/01/2018","Le présent document a pour objet de décrire les caractéristiques essentielles pour l’exploitation des éléments automoteurs électriques Z23500.\n\nLes modifications apportées à la version 01 sont les suivantes:\n la rédaction du document avec le modèle documentaire de Digidoc ;\n la suppression des éléments Z2200 CFL qui sont repris dans la VO00398;\n modification dans l’article 2.3 du code vitesse, conformément à l’OP00803 « Règles générales relatives à la composition, à la remorque, au freinage, à la vitesse limite et à la masse des trains » ;\n intégration dans l’annexe 1 des courriers d’itinéraires.","Quai A et Point M","x",null,"x",null,null,"x"]
[6,"VO02835","S 07 A","Éléments Automoteurs Electriques Z24500 Z26500 (TER2N NG)","Règle","24/01/2018",1,null,"2018-01-24","24/01/2018","Le présent document a pour objet de décrire les caractéristiques essentielles\npour l'exploitation des éléments automoteurs électriques Z24500 et Z26500.\n\nLes modifications apportées à la version 01 sont les suivantes:\n• la rédaction du document avec le modèle documentaire de Digidoc ;\n• la suppression des éléments Z2200 CFL qui sont repris dans la VO00398;\n• modification dans l’article 2.3 du code vitesse, conformément à l’OP00803\n« Règles générales relatives à la composition, à la remorque, au freinage, à la\nvitesse limite et à la masse des trains » ;\n• intégration dans l’annexe 1 des courriers d’itinéraires.","Quai A et Point M","x",null,"x",null,null,"x"]
[7,{"$nulls":11},"x",{"$nulls":5},"x"]
[]
[8,{"$nulls":11},"x"]
[9,{"$nulls":12},"x","x"]

{"sheet":"Effectif","index":1,"n_rows":90,"n_cols":11,"rows_kept":90}
[null,"Texte","titre","Sites","TES H et K (CDM)","TES I (S6)","TES J (AF)","TES L (RAT)","TSAE 5 \"gestion bloc\"","TSAE 3 \"mouvement\"","CRLO"]
[null,{"$f":"INDEX(Données!B:B,MATCH(imprimer!D1,Données!A:A,0))","v":"VO02835"},{"$f":"INDEX(Données!D:D,MATCH(imprimer!D1,Données!A:A,0))","v":"Éléments Automoteurs Electriques Z24500 Z26500 (TER2N NG)"},"Quai A",{"$f":"IF(INDEX(Données!M:M,MATCH(imprimer!D1,Données!A:A,0))=0,\"\",INDEX(Données!M:M,MATCH(imprimer!D1,Données!A:A,0)))","v":"x"},{"$f":"IF(INDEX(Données!N:N,MATCH(imprimer!D1,Données!A:A,0))=0,\"\",INDEX(Données!N:N,MATCH(imprimer!D1,Données!A:A,0)))","v":""},{"$f":"IF(INDEX(Données!O:O,MATCH(imprimer!D1,Données!A:A,0))=0,\"\",INDEX(Données!O:O,MATCH(imprimer!D1,Données!A:A,0)))","v":"x"},{"$f":"IF(INDEX(Données!P:P,MATCH(imprimer!D1,Données!A:A,0))=0,\"\",INDEX(Données!P:P,MATCH(imprimer!D1,Données!A:A,0)))","v":""},{"$f":"IF(INDEX(Données!Q:Q,MATCH(imprimer!D1,Données!A:A,0))=0,\"\",INDEX(Données!Q:Q,MATCH(imprimer!D1,Données!A:A,0)))","v":""},{"$f":"IF(INDEX(Données!R:R,MATCH(imprimer!D1,Données!A:A,0))=0,\"\",INDEX(Données!R:R,MATCH(imprimer!D1,Données!A:A,0)))","v":"x"},{"$f":"IF(INDEX(Données!S:S,MATCH(imprimer!D1,Données!A:A,0))=0,\"\",INDEX(Données!S:S,MATCH(imprimer!D1,Données!A:A,0)))","v":""}]
[]
[]
[]
[null,"Noms","Equipes","Sites","TES H et K (CDM)","TES I (S6)","TES J (AF)","TES L (RAT)","TSAE 5 \"gestion bloc\"","TSAE 3 \"mouvement\"","CRLO"]
[null,"BERTELLI Alain","MVT Quai A","Quai A",null,"X","X",null,null,"X"]
[null,"ARMAND Michel","MVT Quai A","Quai A et point M","x","X","X","x","X","X","x"]
[null,"BERTRAND Jérôme","MVT Quai A","Quai A",null,"X","X",null,null,"X"]
[null,"COUDERC M-Noëlle","MVT Quai A","Quai A",null,"X","X",null,null,"X"]
[null,"ESCRIBANO Adrien","MVT Quai A","Quai A et point M","x","X","X","x","X","X","x"]
[null,"FONTAINE Philippe","MVT Quai A","Quai A",null,"X",{"$nulls":3},"X"]
[null,"FRECHE Anne-Laure","MVT Quai A","Quai A",null,"X","X",null,null,"X"]
[null,"GRAMMATICO Cyrille","MVT Quai A","Quai A",null,"X","X",null,null,"X"]
[null,"GUERIN Soizic","MVT Quai A","Quai A et point M","x","X","X","x","X","X","x"]
[null,"KEROUANTON Guewen","MVT Quai A","Quai A",null,"X","X",null,null,"X"]
[null,"LAGORCE Myriam","MVT Quai A","Quai A et point M","x","X","X","x","X","X","x"]
[null,"LY Say","MVT Quai A","Quai A et point M","x","x","x","x","x","x","x"]
[null,"MARTIN Geoffrey","MVT Quai A","Quai A et point M","x","X","X","x","X","X","x"]
[null,"MASSARD Sylvie","MVT Quai A","Quai A et point M","x","X","X","x","X","X","x"]
[null,"MINE Sébastien","MVT Quai A","Quai A",null,"X","X",null,null,"X"]
[null,"MORINET Emmanuel","MVT Quai A","Quai A et point M","x","X","X","x","X","X","x"]
[null,"MOUACI Hocine","MVT Quai A","Quai A",null,"X","X",null,null,"X"]
[null,"MULOT Pascal ","MVT Quai A","Quai A",null,"X","X",null,null,"X"]
[null,"RIDET Didier","MVT Quai A","Quai A",null,"X",{"$nulls":3},"X"]
[null,"SAHRAOUI Hamid","MVT Quai A","Quai A",null,"X","X",null,null,"X"]
[null,"SARTI Jean-François","MVT Quai A","Quai A et point M","x","X","X","x","X","X","x"]
[null,"SPIGA Hichem","MVT Quai A","Quai A",null,"X","X",null,null,"X"]
[null,"ZELKO Thierry","MVT Quai A","Quai A",null,"X","X",null,null,"X"]
[null,"BEGUE Fabrice","PT Point M","Point M","X",null,null,"X"]
[null,"CASEVECCHIE J-Francois","PT Point M","Point M","X",null,null,"X"]
[null,"CRAND Cyril","PT Point M","Point M","X",null,null,"X",null,null,"X"]
[null,"DEGISORS Olivier","PT Point M","Point M",null,"X","X",null,"X","X"]
[null,"DIETZINGER Yves","PT Point M","Point M"]
[null,"GRIVOT Laurent","PT Point M","Quai A et point M","X",null,null,"X",null,null,"X"]
[null,"KRIEGEL Tom","PT Point M","Point M",null,"X","X",null,"X","X"]
[null,"LAMBERT Jacky","PT Point M","Point M","X",{"$nulls":5},"X"]
[null,"LAMIRI Slim","PT Point M","Point M",null,"X","X",null,"X","X"]
[null,"LECORDIER Dominique","PT Point M","Point M","X",null,null,"X"]
[null,"MADI Hamed","PT Point M","Point M","X",null,null,"X"]
[null,"MEGE Stéphane","PT Point M","Point M",null,"X","X",null,"X","X"]
[null,"NEDJMA Tewfik","PT Point M","Point M","X",null,null,"X"]
[null,"NAILI Idriss","PT Point M","Quai A et point M","X",null,null,"X",null,"X"]
[null,"NOURY Francois","PT Point M","Quai A et point M","X",null,null,"X",null,null,"X"]
[null,"PASQUIER Philippe","PT Point M","Point M","X",{"$nulls":5},"X"]
[null,"PLACE Eric","PT Point M","Point M","X",null,null,"X"]
[null,"RAVELLA David","PT Point M","Point M","X",null,null,"X"]
[null,"SANCHEZ Jeremy","PT Point M","Point M",null,"X","X",null,"X","X"]
[null,"ABADIE Pascal","PT Point M","Point M","X",{"$nulls":5},"X"]
[null,"BAUD Jonathan","PT Quai A","Quai A","X"]
[null,"BOSI Frédéric","PT Quai A","Quai A","X"]
[null,"BOUCHER Nathanael","PT Quai A","Quai A et point M","X",null,null,"X",null,"X"]
[null,"BRUNEL Raymond","PT Quai A","Quai A","x"]
[null,"CAVALLIER Emmanuel","PT Quai A","Quai A","X"]
[null,"CISSE Ibrahima","PT Quai A","Quai A","X"]
[null,"CLANET Cyril","PT Quai A","Quai A","X"]
[null,"CUELLO Frédéric","PT Quai A","Quai A","X",{"$nulls":4},"X"]
[null,"DE BONI gérald","PT Quai A","Quai A et point M","X",null,null,"X",null,"X"]
[null,"DULUD Thomas","PT Quai A","Quai A",{"$nulls":5},"X"]
[null,"FIXON Christophe","PT Quai A","Quai A",{"$nulls":5},"X"]
[null,"GIOVANNETTI Frederic","PT Quai A","Quai A","X"]
[null,"HARB Geoffrey","PT Quai A","Quai A","x"]
[null,"NAILI Elies","PT Quai A","Quai A","x"]
[null,"NEISEN Guillaume","PT Quai A","Quai A","X"]
[null,"PHILY André","PT Quai A","Quai A",{"$nulls":5},"X"]
[null,"PIGNARD Ludovic","PT Quai A","Quai A","X"]
[null,"VANNUCCI Francis","PT Quai A","Quai A",{"$nulls":5},"X"]
[null,"CAPPELLO Chloé","PT Réserve","Quai A et point M",null,"X","X",null,"X","X"]
[null,"CARLOTTI Domonique","PT Réserve","Quai A et point M","X",null,null,"X",null,"X"]
[null,"CASSARO Serge","PT Réserve","Quai A",null,"X","X",null,null,"X"]
[null,"CORREARD Stéphane","PT Réserve","Quai A et point M"]
[null,"DUPUIS Jérôme","PT Réserve","Quai A et point M",null,"X","X",null,"X","X"]
[null,"FONTAINE Willy","PT Réserve","Quai A et point M","X",null,null,"X",null,"X"]
[null,"GONZALEZ Franck","PT Réserve","Quai A et point M","X",null,null,"X"]
[null,"GRECO Zohra","PT Réserve","Quai A et point M",null,"X","X",null,"X","X"]
[null,"HOUDANT Baptiste","PT Réserve","Quai A et point M",null,"X","X",null,"X","X"]
[null,"ASSANTE Thierry","PT Réserve","Quai A",null,"X","X",null,null,"X"]
[null,"LABORET Lawry","PT Réserve","Quai A et point M","X",null,null,"X"]
[null,"MARTINEZ Dorian","PT Réserve","Quai A",null,"X","X",null,null,"X"]
[null,"MICHEL Sylvain","PT Réserve","Quai A et point M",null,"X","X",null,"X","X"]
[null,"RANALDI Cyril","PT Réserve","Quai A et point M","X",null,null,"X",null,"X"]
[null,"RIDET David","PT Réserve","Quai A","X",{"$nulls":4},"X"]
[null,"SARPI Cyril","PT Réserve","Quai A et point M","X",null,null,"X"]
[null,"SIMON Anthony","PT Réserve","Quai A et point M","X","X","X","X",null,"X","X"]
[null,"MEYER Isabelle","PT Réserve","Quai A",null,"X","X",null,null,"X"]
[null,"YAGOUBI ALIBERT Stephan","PT Réserve","Quai A",null,"X","X",null,null,"X"]
[null,"ZIAD MOUSSAOUI Nasser","PT Réserve","Quai A et point M",null,"X","X",null,"X","X"]
[null,"ZIDANI Samir","PT Réserve","Quai A et point M","X"]
[null,"Répertoire de collection Point M","xx","Point M","X","X","X","X","X","X","X"]
[null,"Répertoire de collection Quai A","xx","Quai A","X","X","X","X","X","X","X"]

{"sheet":"imprimer","index":2,"n_rows":27,"n_cols":5,"rows_kept":27,"merged":[[6,1,7,5],[11,0,14,5],[26,0,30,5]]}
["           Fiche d’émargement n°",null,null,6,-2018]
[]
["Référence du texte :",null,{"$f":"INDEX(Données!B:B,MATCH(D1,Données!A:A,0))","v":"VO02835"}]
["Edition du",{"$f":"INDEX(Données!F:F,MATCH(D1,Données!A:A,0))","v":"24/01/2018"},null,"Version n°",{"$f":"INDEX(Données!G:G,MATCH(D1,Données!A:A,0))","v":1}]
["Date d’application : ",null,{"$f":"INDEX(Données!J:J,MATCH(D1,Données!A:A,0))","v":"24/01/2018"}]
[]
["Titre : ",{"$f":"INDEX(Données!D:D,MATCH(D1,Données!A:A,0))","v":"Éléments Automoteurs Electriques Z24500 Z26500 (TER2N NG)"}]
[]
["Mise en place dans la collection du",null,null,{"$f":"INDEX(Données!L:L,MATCH(D1,Données!A:A,0))","v":"Quai A et Point M"}]
[]
["Objet de la nouvelle version / Nouveau texte dans la collection : "]
[{"$f":"INDEX(Données!K:K,MATCH(D1,Données!A:A,0))","v":"Le présent document a pour objet de décrire les caractéristiques essentielles\npour l'exploitation des éléments automoteurs électriques Z24500 et Z26500.\n\nLes modifications apportées à la version 01 sont les suivantes:\n• la rédaction du document avec le modèle documentaire de Digidoc ;\n• la suppression des éléments Z2200 CFL qui sont repris dans la VO00398;\n• modification dans l’article 2.3 du code vitesse, conformément à l’OP00803\n« Règles générales relatives à la composition, à la remorque, au freinage, à la\nvitesse limite et à la masse des trains » ;\n• intégration dans l’annexe 1 des courriers d’itinéraires."}]
[]
[]
[]
[]
["M/Mme (NOM Prénom) :",null,null,"ZIDANI Samir"]
[]
["J’atteste avoir pris connaissance de la mise en place de cette consigne."]
[]
["Le ……………….………………….. à Marseille"]
[]
["Signature de l’agent : "]
[]
[]
[]
["Vous devez prendre connaissance de son contenu (article 109 de l’OP 454) :\nLe dirigeant des agents doit prendre les mesures utiles pour que les textes relatifs à la sécurité soient bien portés à la connaissance des agents intéressés (y compris les agents de remplacement).\nLes agents assurant une fonction de sécurité doivent de leur coté, avoir pris connaissance des textes et documents nécessaires à l’exécution de leur service, dans les conditions précisées par consigne.\n"]

{"sheet":"Stat","index":3,"n_rows":93,"n_cols":86,"rows_kept":93}
[null,null,"N° fiche",{"$nulls":4},{"$f":"Données!#REF!","v":{"$error":"#REF!"}},{"$f":"Données!#REF!","v":{"$error":"#REF!"}},{"$f":"Données!#REF!","v":{"$error":"#REF!"}},{"$f":"Données!#REF!","v":{"$error":"#REF!"}},{"$f":"Données!#REF!","v":{"$error":"#REF!"}},{"$f":"Données!#REF!","v":{"$error":"#REF!"}},{"$f":"Données!#REF!","v":{"$error":"#REF!"}},{"$f":"Données!#REF!","v":{"$error":"#REF!"}},{"$f":"Données!#REF!","v":{"$error":"#REF!"}},{"$f":"Données!#REF!","v":{"$error":"#REF!"}},{"$f":"Données!#REF!","v":{"$error":"#REF!"}},{"$f":"Données!#REF!","v":{"$error":"#REF!"}},{"$f":"Données!#REF!","v":{"$error":"#REF!"}},{"$f":"Données!#REF!","v":{"$error":"#REF!"}},{"$f":"Données!#REF!","v":{"$error":"#REF!"}},{"$f":"Données!#REF!","v":{"$error":"#REF!"}},{"$f":"Données!#REF!","v":{"$error":"#REF!"}},{"$f":"Données!#REF!","v":{"$error":"#REF!"}},{"$f":"Données!#REF!","v":{"$error":"#REF!"}},{"$f":"Données!#REF!","v":{"$error":"#REF!"}},{"$f":"Données!#REF!","v":{"$error":"#REF!"}},{"$f":"Données!#REF!","v":{"$error":"#REF!"}},{"$f":"Données!#REF!","v":{"$error":"#REF!"}},{"$f":"Données!#REF!","v":{"$error":"#REF!"}},{"$f":"Données!#REF!","v":{"$error":"#REF!"}},{"$f":"Données!#REF!","v":{"$error":"#REF!"}},{"$f":"Données!#REF!","v":{"$error":"#REF!"}},{"$f":"Données!#REF!","v":{"$error":"#REF!"}},{"$f":"Données!#REF!","v":{"$error":"#REF!"}},{"$f":"Données!#REF!","v":{"$error":"#REF!"}},{"$f":"Données!#REF!","v":{"$error":"#REF!"}},{"$f":"Données!$A26","v":0},{"$f":"Données!$A27","v":0},{"$f":"Données!$A28","v":0},{"$f":"Données!$A29","v":0},{"$f":"Données!$A30","v":0},{"$f":"Données!$A31","v":0},{"$f":"Données!$A32","v":0},{"$f":"Données!#REF!","v":{"$error":"#REF!"}},{"$f":"Données!$A33","v":0},{"$f":"Données!#REF!","v":{"$error":"#REF!"}},{"$f":"Données!$A34","v":0},{"$f":"Données!$A35","v":0},{"$f":"Données!#REF!","v":{"$error":"#REF!"}},{"$f":"Données!#REF!","v":{"$error":"#REF!"}},{"$f":"Données!#REF!","v":{"$error":"#REF!"}},{"$f":"Données!#REF!","v":{"$error":"#REF!"}},{"$f":"Données!$A36","v":0},{"$f":"Données!$A37","v":0},{"$f":"Données!$A38","v":0},{"$f":"Données!$A39","v":0},{"$f":"Données!$A40","v":0},{"$f":"Données!$A41","v":0},{"$f":"Données!$A42","v":0},{"$f":"Données!$A43","v":0},{"$f":"Données!$A44","v":0},{"$f":"Données!$A45","v":0},{"$f":"Données!$A46","v":0},{"$f":"Données!$A47","v":0},{"$f":"Données!$A48","v":0},{"$f":"Données!$A49","v":0},{"$f":"Données!$A50","v":0},{"$f":"Données!$A51","v":0},{"$f":"Données!$A52","v":0},{"$f":"Données!$A53","v":0},{"$f":"Données!$A54","v":0},{"$f":"Données!$A55","v":0},{"$f":"Données!$A56","v":0},{"$f":"Données!$A57","v":0},{"$f":"Données!$A58","v":0},{"$f":"Données!$A59","v":0},{"$f":"Données!$A60","v":0},{"$f":"Données!#REF!","v":{"$error":"#REF!"}},{"$f":"Données!#REF!","v":{"$error":"#REF!"}},{"$f":"Données!#REF!","v":{"$error":"#REF!"}},{"$f":"Données!$A61","v":0},{"$f":"Données!$A62","v":0},{"$f":"Données!$A63","v":0},{"$f":"Données!$A64","v":0}]
[null,null,"Texte",null,null,"Registre d'émargement","Registre SST",{"$f":"Données!#REF!","v":{"$error":"#REF!"}},{"$f":"Données!#REF!","v":{"$error":"#REF!"}},{"$f":"Données!#REF!","v":{"$error":"#REF!"}},{"$f":"Données!#REF!","v":{"$error":"#REF!"}},{"$f":"Données!#REF!","v":{"$error":"#REF!"}},{"$f":"Données!#REF!","v":{"$error":"#REF!"}},{"$f":"Données!#REF!","v":{"$error":"#REF!"}},{"$f":"Données!#REF!","v":{"$error":"#REF!"}},{"$f":"Données!#REF!","v":{"$error":"#REF!"}},{"$f":"Données!#REF!","v":{"$error":"#REF!"}},{"$f":"Données!#REF!","v":{"$error":"#REF!"}},{"$f":"Données!#REF!","v":{"$error":"#REF!"}},{"$f":"Données!#REF!","v":{"$error":"#REF!"}},{"$f":"Données!#REF!","v":{"$error":"#REF!"}},{"$f":"Données!#REF!","v":{"$error":"#REF!"}},{"$f":"Données!#REF!","v":{"$error":"#REF!"}},{"$f":"Données!#REF!","v":{"$error":"#REF!"}},{"$f":"Données!#REF!","v":{"$error":"#REF!"}},{"$f":"Données!#REF!","v":{"$error":"#REF!"}},{"$f":"Données!#REF!","v":{"$error":"#REF!"}},{"$f":"Données!#REF!","v":{"$error":"#REF!"}},{"$f":"Données!#REF!","v":{"$error":"#REF!"}},{"$f":"Données!#REF!","v":{"$error":"#REF!"}},{"$f":"Données!#REF!","v":{"$error":"#REF!"}},{"$f":"Données!#REF!","v":{"$error":"#REF!"}},{"$f":"Données!#REF!","v":{"$error":"#REF!"}},{"$f":"Données!#REF!","v":{"$error":"#REF!"}},{"$f":"Données!#REF!","v":{"$error":"#REF!"}},{"$f":"Données!#REF!","v":{"$error":"#REF!"}},{"$f":"Données!#REF!","v":{"$error":"#REF!"}},{"$f":"Données!#REF!","v":{"$error":"#REF!"}},{"$f":"Données!$B20","v":0},{"$f":"Données!$B21","v":0},{"$f":"Données!#REF!","v":{"$error":"#REF!"}},{"$f":"Données!#REF!","v":{"$error":"#REF!"}},{"$f":"Données!$B22","v":0},{"$f":"Données!#REF!","v":{"$error":"#REF!"}},{"$f":"Données!#REF!","v":{"$error":"#REF!"}},{"$f":"Données!$B23","v":0},{"$f":"Données!$B24","v":0},{"$f":"Données!$B25","v":0},{"$f":"Données!$B26","v":0},{"$f":"Données!$B27","v":0},{"$f":"Données!#REF!","v":{"$error":"#REF!"}},{"$f":"Données!#REF!","v":{"$error":"#REF!"}},{"$f":"Données!#REF!","v":{"$error":"#REF!"}},{"$f":"Données!#REF!","v":{"$error":"#REF!"}},{"$f":"Données!#REF!","v":{"$error":"#REF!"}},{"$f":"Données!$B28","v":0},{"$f":"Données!$B29","v":0},{"$f":"Données!$B30","v":0},{"$f":"Données!$B31","v":0},{"$f":"Données!$B32","v":0},{"$f":"Données!#REF!","v":{"$error":"#REF!"}},{"$f":"Données!$B33","v":0},{"$f":"Données!#REF!","v":{"$error":"#REF!"}},{"$f":"Données!$B34","v":0},{"$f":"Données!$B35","v":0},{"$f":"Données!#REF!","v":{"$error":"#REF!"}},{"$f":"Données!#REF!","v":{"$error":"#REF!"}},{"$f":"Données!#REF!","v":{"$error":"#REF!"}},{"$f":"Données!#REF!","v":{"$error":"#REF!"}},{"$f":"Données!$B36","v":0},{"$f":"Données!$B37","v":0},{"$f":"Données!$B38","v":0},{"$f":"Données!$B39","v":0},{"$f":"Données!$B40","v":0},{"$f":"Données!$B41","v":0},{"$f":"Données!$B42","v":0},{"$f":"Données!$B43","v":0},{"$f":"Données!$B44","v":0},{"$f":"Données!$B45","v":0},{"$f":"Données!$B46","v":0},{"$f":"Données!$B47","v":0},{"$f":"Données!$B48","v":0},{"$f":"Données!$B49","v":0},{"$f":"Données!$B50","v":0},{"$f":"Données!$B51","v":0},{"$f":"Données!$B52","v":0}]
[null,null,"Equipes"]
[null,null,"MVT Quai A",{"$nulls":4},{"$f":"SUMIF($C$10:$C$93,$C$4,H10:H93)/(COUNTIFS($C$10:$C$93,$C$4)-COUNTIFS($C$10:$C$93,$C$4,H10:H93,\"NC\"))","v":{"$error":"#DIV/0!"}},{"$f":"SUMIF($C$10:$C$93,$C$4,I10:I93)/(COUNTIFS($C$10:$C$93,$C$4)-COUNTIFS($C$10:$C$93,$C$4,I10:I93,\"NC\"))","v":{"$error":"#DIV/0!"}},{"$error":"#DIV/0!"},{"$error":"#DIV/0!"},{"$error":"#DIV/0!"},{"$error":"#DIV/0!"},{"$error":"#DIV/0!"},{"$error":"#DIV/0!"},{"$error":"#DIV/0!"},{"$error":"#DIV/0!"},{"$error":"#DIV/0!"},{"$error":"#DIV/0!"},{"$error":"#DIV/0!"},{"$error":"#DIV/0!"},{"$error":"#DIV/0!"},{"$error":"#DIV/0!"},{"$error":"#DIV/0!"},{"$error":"#DIV/0!"},{"$error":"#DIV/0!"},{"$error":"#DIV/0!"},{"$error":"#DIV/0!"},{"$error":"#DIV/0!"},{"$error":"#DIV/0!"},{"$error":"#DIV/0!"},{"$error":"#DIV/0!"},{"$error":"#DIV/0!"},{"$error":"#DIV/0!"},{"$error":"#DIV/0!"},{"$error":"#DIV/0!"},{"$error":"#DIV/0!"},{"$error":"#DIV/0!"},{"$error":"#DIV/0!"},{"$error":"#DIV/0!"},{"$error":"#DIV/0!"},{"$error":"#DIV/0!"},{"$error":"#DIV/0!"},{"$error":"#DIV/0!"},{"$error":"#DIV/0!"},{"$error":"#DIV/0!"},{"$error":"#DIV/0!"},{"$error":"#DIV/0!"},{"$error":"#DIV/0!"},{"$error":"#DIV/0!"},{"$error":"#DIV/0!"},{"$error":"#DIV/0!"},{"$error":"#DIV/0!"},{"$error":"#DIV/0!"},{"$error":"#DIV/0!"},{"$error":"#DIV/0!"},{"$error":"#DIV/0!"},{"$error":"#DIV/0!"},{"$error":"#DIV/0!"},{"$error":"#DIV/0!"},{"$error":"#DIV/0!"},{"$error":"#DIV/0!"},{"$error":"#DIV/0!"},{"$error":"#DIV/0!"},{"$error":"#DIV/0!"},{"$error":"#DIV/0!"},{"$error":"#DIV/0!"},{"$error":"#DIV/0!"},{"$error":"#DIV/0!"},{"$error":"#DIV/0!"},{"$error":"#DIV/0!"},{"$error":"#DIV/0!"},{"$f":"SUMIF($C$10:$C$93,$C$4,BU10:BU93)/(COUNTIFS($C$10:$C$93,$C$4)-COUNTIFS($C$10:$C$93,$C$4,BU10:BU93,\"NC\"))","v":{"$error":"#DIV/0!"}},{"$error":"#DIV/0!"},{"$error":"#DIV/0!"},{"$error":"#DIV/0!"},{"$error":"#DIV/0!"},{"$error":"#DIV/0!"},{"$error":"#DIV/0!"},{"$error":"#DIV/0!"},{"$error":"#DIV/0!"},{"$error":"#DIV/0!"},{"$error":"#DIV/0!"},{"$error":"#DIV/0!"},{"$error":"#DIV/0!"},{"$error":"#DIV/0!"}]
[null,null,"PT Quai A",{"$nulls":4},{"$f":"SUMIF($C$10:$C$93,$C$5,H10:H93)/(COUNTIFS($C$10:$C$93,$C$5)-COUNTIFS($C$10:$C$93,$C$5,H10:H93,\"NC\"))","v":{"$error":"#DIV/0!"}},{"$f":"SUMIF($C$10:$C$93,$C$5,I10:I93)/(COUNTIFS($C$10:$C$93,$C$5)-COUNTIFS($C$10:$C$93,$C$5,I10:I93,\"NC\"))","v":{"$error":"#DIV/0!"}},{"$error":"#DIV/0!"},{"$error":"#DIV/0!"},{"$error":"#DIV/0!"},{"$error":"#DIV/0!"},{"$error":"#DIV/0!"},{"$error":"#DIV/0!"},{"$error":"#DIV/0!"},{"$error":"#DIV/0!"},{"$error":"#DIV/0!"},{"$error":"#DIV/0!"},{"$error":"#DIV/0!"},{"$error":"#DIV/0!"},{"$error":"#DIV/0!"},{"$error":"#DIV/0!"},{"$error":"#DIV/0!"},{"$error":"#DIV/0!"},{"$error":"#DIV/0!"},{"$error":"#DIV/0!"},{"$error":"#DIV/0!"},{"$error":"#DIV/0!"},{"$error":"#DIV/0!"},{"$error":"#DIV/0!"},{"$error":"#DIV/0!"},{"$error":"#DIV/0!"},{"$error":"#DIV/0!"},{"$error":"#DIV/0!"},{"$error":"#DIV/0!"},{"$error":"#DIV/0!"},{"$error":"#DIV/0!"},{"$error":"#DIV/0!"},{"$error":"#DIV/0!"},{"$error":"#DIV/0!"},{"$error":"#DIV/0!"},{"$error":"#DIV/0!"},{"$error":"#DIV/0!"},{"$error":"#DIV/0!"},{"$error":"#DIV/0!"},{"$error":"#DIV/0!"},{"$error":"#DIV/0!"},{"$error":"#DIV/0!"},{"$error":"#DIV/0!"},{"$error":"#DIV/0!"},{"$error":"#DIV/0!"},{"$error":"#DIV/0!"},{"$error":"#DIV/0!"},{"$error":"#DIV/0!"},{"$error":"#DIV/0!"},{"$error":"#DIV/0!"},{"$error":"#DIV/0!"},{"$error":"#DIV/0!"},{"$error":"#DIV/0!"},{"$error":"#DIV/0!"},{"$error":"#DIV/0!"},{"$error":"#DIV/0!"},{"$error":"#DIV/0!"},{"$error":"#DIV/0!"},{"$error":"#DIV/0!"},{"$error":"#DIV/0!"},{"$error":"#DIV/0!"},{"$error":"#DIV/0!"},{"$error":"#DIV/0!"},{"$error":"#DIV/0!"},{"$error":"#DIV/0!"},{"$f":"SUMIF($C$10:$C$93,$C$5,BU10:BU93)/(COUNTIFS($C$10:$C$93,$C$5)-COUNTIFS($C$10:$C$93,$C$5,BU10:BU93,\"NC\"))","v":{"$error":"#DIV/0!"}},{"$error":"#DIV/0!"},{"$error":"#DIV/0!"},{"$error":"#DIV/0!"},{"$error":"#DIV/0!"},{"$error":"#DIV/0!"},{"$error":"#DIV/0!"},{"$error":"#DIV/0!"},{"$error":"#DIV/0!"},{"$error":"#DIV/0!"},{"$error":"#DIV/0!"},{"$error":"#DIV/0!"},{"$error":"#DIV/0!"},{"$error":"#DIV/0!"}]
[null,null,"PT Point M",{"$nulls":4},{"$f":"SUMIF($C$10:$C$93,$C$6,H10:H93)/(COUNTIFS($C$10:$C$93,$C$6)-COUNTIFS($C$10:$C$93,$C$6,H10:H93,\"NC\"))","v":{"$error":"#DIV/0!"}},{"$f":"SUMIF($C$10:$C$93,$C$6,I10:I93)/(COUNTIFS($C$10:$C$93,$C$6)-COUNTIFS($C$10:$C$93,$C$6,I10:I93,\"NC\"))","v":{"$error":"#DIV/0!"}},{"$error":"#DIV/0!"},{"$error":"#DIV/0!"},{"$error":"#DIV/0!"},{"$error":"#DIV/0!"},{"$error":"#DIV/0!"},{"$error":"#DIV/0!"},{"$error":"#DIV/0!"},{"$error":"#DIV/0!"},{"$error":"#DIV/0!"},{"$error":"#DIV/0!"},{"$error":"#DIV/0!"},{"$error":"#DIV/0!"},{"$error":"#DIV/0!"},{"$error":"#DIV/0!"},{"$error":"#DIV/0!"},{"$error":"#DIV/0!"},{"$error":"#DIV/0!"},{"$error":"#DIV/0!"},{"$error":"#DIV/0!"},{"$error":"#DIV/0!"},{"$error":"#DIV/0!"},{"$error":"#DIV/0!"},{"$error":"#DIV/0!"},{"$error":"#DIV/0!"},{"$error":"#DIV/0!"},{"$error":"#DIV/0!"},{"$error":"#DIV/0!"},{"$error":"#DIV/0!"},{"$error":"#DIV/0!"},{"$error":"#DIV/0!"},{"$error":"#DIV/0!"},{"$error":"#DIV/0!"},{"$error":"#DIV/0!"},{"$error":"#DIV/0!"},{"$error":"#DIV/0!"},{"$error":"#DIV/0!"},{"$error":"#DIV/0!"},{"$error":"#DIV/0!"},{"$error":"#DIV/0!"},{"$error":"#DIV/0!"},{"$error":"#DIV/0!"},{"$error":"#DIV/0!"},{"$error":"#DIV/0!"},{"$error":"#DIV/0!"},{"$error":"#DIV/0!"},{"$error":"#DIV/0!"},{"$error":"#DIV/0!"},{"$error":"#DIV/0!"},{"$error":"#DIV/0!"},{"$error":"#DIV/0!"},{"$error":"#DIV/0!"},{"$error":"#DIV/0!"},{"$error":"#DIV/0!"},{"$error":"#DIV/0!"},{"$error":"#DIV/0!"},{"$error":"#DIV/0!"},{"$error":"#DIV/0!"},{"$error":"#DIV/0!"},{"$error":"#DIV/0!"},{"$error":"#DIV/0!"},{"$error":"#DIV/0!"},{"$error":"#DIV/0!"},{"$error":"#DIV/0!"},{"$f":"SUMIF($C$10:$C$93,$C$6,BU10:BU93)/(COUNTIFS($C$10:$C$93,$C$6)-COUNTIFS($C$10:$C$93,$C$6,BU10:BU93,\"NC\"))","v":{"$error":"#DIV/0!"}},{"$error":"#DIV/0!"},{"$error":"#DIV/0!"},{"$error":"#DIV/0!"},{"$error":"#DIV/0!"},{"$error":"#DIV/0!"},{"$error":"#DIV/0!"},{"$error":"#DIV/0!"},{"$error":"#DIV/0!"},{"$error":"#DIV/0!"},{"$error":"#DIV/0!"},{"$error":"#DIV/0!"},{"$error":"#DIV/0!"},{"$error":"#DIV/0!"}]
[null,null,"PT Réserve",{"$nulls":4},{"$f":"SUMIF($C$10:$C$93,$C$7,H10:H93)/(COUNTIFS($C$10:$C$93,$C$7)-COUNTIFS($C$10:$C$93,$C$7,H10:H93,\"NC\"))","v":{"v":1,"d":"100%"}},{"$f":"SUMIF($C$10:$C$93,$C$7,I10:I93)/(COUNTIFS($C$10:$C$93,$C$7)-COUNTIFS($C$10:$C$93,$C$7,I10:I93,\"NC\"))","v":{"v":1,"d":"100%"}},{"v":1,"d":"100%"},{"v":1,"d":"100%"},{"v":1,"d":"100%"},{"v":1,"d":"100%"},{"v":1,"d":"100%"},{"v":1,"d":"100%"},{"$error":"#DIV/0!"},{"$error":"#DIV/0!"},{"v":1,"d":"100%"},{"v":1,"d":"100%"},{"$error":"#DIV/0!"},{"$error":"#DIV/0!"},{"v":0,"d":"0%"},{"v":0,"d":"0%"},{"v":0,"d":"0%"},{"v":0,"d":"0%"},{"$error":"#DIV/0!"},{"$error":"#DIV/0!"},{"$error":"#DIV/0!"},{"$error":"#DIV/0!"},{"$error":"#DIV/0!"},{"$error":"#DIV/0!"},{"$error":"#DIV/0!"},{"$error":"#DIV/0!"},{"$error":"#DIV/0!"},{"$error":"#DIV/0!"},{"$error":"#DIV/0!"},{"$error":"#DIV/0!"},{"$error":"#DIV/0!"},{"$error":"#DIV/0!"},{"$error":"#DIV/0!"},{"$error":"#DIV/0!"},{"$error":"#DIV/0!"},{"$error":"#DIV/0!"},{"$error":"#DIV/0!"},{"$error":"#DIV/0!"},{"$error":"#DIV/0!"},{"$error":"#DIV/0!"},{"$error":"#DIV/0!"},{"$error":"#DIV/0!"},{"$error":"#DIV/0!"},{"$error":"#DIV/0!"},{"$error":"#DIV/0!"},{"$error":"#DIV/0!"},{"$error":"#DIV/0!"},{"$error":"#DIV/0!"},{"$error":"#DIV/0!"},{"$error":"#DIV/0!"},{"$error":"#DIV/0!"},{"$error":"#DIV/0!"},{"$error":"#DIV/0!"},{"$error":"#DIV/0!"},{"$error":"#DIV/0!"},{"$error":"#DIV/0!"},{"$error":"#DIV/0!"},{"$error":"#DIV/0!"},{"$error":"#DIV/0!"},{"$error":"#DIV/0!"},{"$error":"#DIV/0!"},{"$error":"#DIV/0!"},{"$error":"#DIV/0!"},{"$error":"#DIV/0!"},{"$error":"#DIV/0!"},{"$f":"SUMIF($C$10:$C$93,$C$7,BU10:BU93)/(COUNTIFS($C$10:$C$93,$C$7)-COUNTIFS($C$10:$C$93,$C$7,BU10:BU93,\"NC\"))","v":{"$error":"#DIV/0!"}},{"$error":"#DIV/0!"},{"$error":"#DIV/0!"},{"$error":"#DIV/0!"},{"$error":"#DIV/0!"},{"$error":"#DIV/0!"},{"$error":"#DIV/0!"},{"$error":"#DIV/0!"},{"$error":"#DIV/0!"},{"$error":"#DIV/0!"},{"$error":"#DIV/0!"},{"$error":"#DIV/0!"},{"$error":"#DIV/0!"},{"$error":"#DIV/0!"}]
[null,null,"Cumul UO",{"$nulls":4},{"$f":"SUM(H10:H93)/(COUNTIFS($C$10:$C$93,\"<>\")-COUNTIFS(H10:H93,\"NC\"))","v":{"v":1,"d":"100%"}},{"$f":"SUM(I10:I93)/(COUNTIFS($C$10:$C$93,\"<>\")-COUNTIFS(I10:I93,\"NC\"))","v":{"v":1,"d":"100%"}},{"v":1,"d":"100%"},{"v":1,"d":"100%"},{"v":1,"d":"100%"},{"v":1,"d":"100%"},{"v":1,"d":"100%"},{"v":1,"d":"100%"},{"$error":"#DIV/0!"},{"$error":"#DIV/0!"},{"v":1,"d":"100%"},{"v":1,"d":"100%"},{"$error":"#DIV/0!"},{"$error":"#DIV/0!"},{"v":0,"d":"0%"},{"v":0,"d":"0%"},{"v":0,"d":"0%"},{"v":0,"d":"0%"},{"$error":"#DIV/0!"},{"$error":"#DIV/0!"},{"$error":"#DIV/0!"},{"$error":"#DIV/0!"},{"$error":"#DIV/0!"},{"$error":"#DIV/0!"},{"$error":"#DIV/0!"},{"$error":"#DIV/0!"},{"$error":"#DIV/0!"},{"$error":"#DIV/0!"},{"$error":"#DIV/0!"},{"$error":"#DIV/0!"},{"$error":"#DIV/0!"},{"$error":"#DIV/0!"},{"$error":"#DIV/0!"},{"$error":"#DIV/0!"},{"$error":"#DIV/0!"},{"$error":"#DIV/0!"},{"$error":"#DIV/0!"},{"$error":"#DIV/0!"},{"$error":"#DIV/0!"},{"$error":"#DIV/0!"},{"$error":"#DIV/0!"},{"$error":"#DIV/0!"},{"$error":"#DIV/0!"},{"$error":"#DIV/0!"},{"$error":"#DIV/0!"},{"$error":"#DIV/0!"},{"$error":"#DIV/0!"},{"$error":"#DIV/0!"},{"$error":"#DIV/0!"},{"$error":"#DIV/0!"},{"$error":"#DIV/0!"},{"$error":"#DIV/0!"},{"$error":"#DIV/0!"},{"$error":"#DIV/0!"},{"$error":"#DIV/0!"},{"$error":"#DIV/0!"},{"$error":"#DIV/0!"},{"$error":"#DIV/0!"},{"$error":"#DIV/0!"},{"$error":"#DIV/0!"},{"$error":"#DIV/0!"},{"$error":"#DIV/0!"},{"$error":"#DIV/0!"},{"$error":"#DIV/0!"},{"$error":"#DIV/0!"},{"$f":"SUM(BU10:BU93)/(COUNTIFS($C$10:$C$93,\"<>\")-COUNTIFS(BU10:BU93,\"NC\"))","v":{"$error":"#DIV/0!"}},{"$error":"#DIV/0!"},{"$error":"#DIV/0!"},{"$error":"#DIV/0!"},{"$error":"#DIV/0!"},{"$error":"#DIV/0!"},{"$error":"#DIV/0!"},{"$error":"#DIV/0!"},{"$error":"#DIV/0!"},{"$error":"#DIV/0!"},{"$error":"#DIV/0!"},{"$error":"#DIV/0!"},{"$error":"#DIV/0!"},{"$error":"#DIV/0!"}]
[null,"Noms","Equipes","Sites"]
[null,"LAGORCE Myriam","MVT Quai A","Quai A et point M",{"$f":"SUM(H10:CH10)/(COUNTIFS(H10:CH10,1)+COUNTIFS(H10:CH10,0))","v":{"$error":"#DIV/0!"}},null,null,"NC","NC","NC","NC","NC","NC","NC","NC","NC","NC","NC","NC","NC","NC","NC","NC","NC","NC","NC","NC","NC","NC","NC","NC","NC","NC","NC","NC","NC","NC","NC","NC","NC","NC","NC","NC","NC","NC","NC","NC","NC","NC","NC","NC","NC","NC","NC","NC","NC","NC","NC","NC","NC","NC","NC","NC","NC","NC","NC","NC","NC","NC","NC","NC","NC","NC","NC","NC","NC","NC","NC","NC","NC","NC","NC","NC","NC","NC","NC"]
[null,"MARTIN Geoffrey","MVT Quai A","Quai A et point M",{"$error":"#DIV/0!"},null,null,"NC","NC","NC","NC","NC","NC","NC","NC","NC","NC","NC","NC","NC","NC","NC","NC","NC","NC","NC","NC","NC","NC","NC","NC","NC","NC","NC","NC","NC","NC","NC","NC","NC","NC","NC","NC","NC","NC","NC","NC","NC","NC","NC","NC","NC","NC","NC","NC","NC","NC","NC","NC","NC","NC","NC","NC","NC","NC","NC","NC","NC","NC","NC","NC","NC","NC","NC","NC","NC","NC","NC","NC","NC","NC","NC","NC","NC","NC","NC"]
[null,"ARMAND Michel","MVT Quai A","Quai A et point M",{"$error":"#DIV/0!"},null,null,"NC","NC","NC","NC","NC","NC","NC","NC","NC","NC","NC","NC","NC","NC","NC","NC","NC","NC","NC","NC","NC","NC","NC","NC","NC","NC","NC","NC","NC","NC","NC","NC","NC","NC","NC","NC","NC","NC","NC","NC","NC","NC","NC","NC","NC","NC","NC","NC","NC","NC","NC","NC","NC","NC","NC","NC","NC","NC","NC","NC","NC","NC","NC","NC","NC","NC","NC","NC","NC","NC","NC","NC","NC","NC","NC","NC","NC","NC","NC"]
[null,"MASSARD Sylvie","MVT Quai A","Quai A et point M",{"$error":"#DIV/0!"},null,null,"NC","NC","NC","NC","NC","NC","NC","NC","NC","NC","NC","NC","NC","NC","NC","NC","NC","NC","NC","NC","NC","NC","NC","NC","NC","NC","NC","NC","NC","NC","NC","NC","NC","NC","NC","NC","NC","NC","NC","NC","NC","NC","NC","NC","NC","NC","NC","NC","NC","NC","NC","NC","NC","NC","NC","NC","NC","NC","NC","NC","NC","NC","NC","NC","NC","NC","NC","NC","NC","NC","NC","NC","NC","NC","NC","NC","NC","NC","NC"]
[null,"AKEL Mohamed","MVT Quai A","Quai A et point M",{"$error":"#DIV/0!"},null,null,"NC","NC","NC","NC","NC","NC","NC","NC","NC","NC","NC","NC","NC","NC","NC","NC","NC","NC","NC","NC","NC","NC","NC","NC","NC","NC","NC","NC","NC","NC","NC","NC","NC","NC","NC","NC","NC","NC","NC","NC","NC","NC","NC","NC","NC","NC","NC","NC","NC","NC","NC","NC","NC","NC","NC","NC","NC","NC","NC","NC","NC","NC","NC","NC","NC","NC","NC","NC","NC","NC","NC","NC","NC","NC","NC","NC","NC","NC","NC"]
[null,"BOUTILIER Christian","MVT Quai A","Quai A et point M",{"$error":"#DIV/0!"},null,null,"NC","NC","NC","NC","NC","NC","NC","NC","NC","NC","NC","NC","NC","NC","NC","NC","NC","NC","NC","NC","NC","NC","NC","NC","NC","NC","NC","NC","NC","NC","NC","NC","NC","NC","NC","NC","NC","NC","NC","NC","NC","NC","NC","NC","NC","NC","NC","NC","NC","NC","NC","NC","NC","NC","NC","NC","NC","NC","NC","NC","NC","NC","NC","NC","NC","NC","NC","NC","NC","NC","NC","NC","NC","NC","NC","NC","NC","NC","NC"]
[null,"COUDERC M-Noëlle","MVT Quai A","Quai A",{"$error":"#DIV/0!"},null,null,"NC","NC","NC","NC","NC","NC","NC","NC","NC","NC","NC","NC","NC","NC","NC","NC","NC","NC","NC","NC","NC","NC","NC","NC","NC","NC","NC","NC","NC","NC","NC","NC","NC","NC","NC","NC","NC","NC","NC","NC","NC","NC","NC","NC","NC","NC","NC","NC","NC","NC","NC","NC","NC","NC","NC","NC","NC","NC","NC","NC","NC","NC","NC","NC","NC","NC","NC","NC","NC","NC","NC","NC","NC","NC","NC","NC","NC","NC","NC"]
[null,"GUERIN Soizic","MVT Quai A","Quai A et point M",{"$error":"#DIV/0!"},null,null,"NC","NC","NC","NC","NC","NC","NC","NC","NC","NC","NC","NC","NC","NC","NC","NC","NC","NC","NC","NC","NC","NC","NC","NC","NC","NC","NC","NC","NC","NC","NC","NC","NC","NC","NC","NC","NC","NC","NC","NC","NC","NC","NC","NC","NC","NC","NC","NC","NC","NC","NC","NC","NC","NC","NC","NC","NC","NC","NC","NC","NC","NC","NC","NC","NC","NC","NC","NC","NC","NC","NC","NC","NC","NC","NC","NC","NC","NC","NC"]
[null,"GANTEAUME Gilles","MVT Quai A","Quai A",{"$error":"#DIV/0!"},null,null,"NC","NC","NC","NC","NC","NC","NC","NC","NC","NC","NC","NC","NC","NC","NC","NC","NC","NC","NC","NC","NC","NC","NC","NC","NC","NC","NC","NC","NC","NC","NC","NC","NC","NC","NC","NC","NC","NC","NC","NC","NC","NC","NC","NC","NC","NC","NC","NC","NC","NC","NC","NC","NC","NC","NC","NC","NC","NC","NC","NC","NC","NC","NC","NC","NC","NC","NC","NC","NC","NC","NC","NC","NC","NC","NC","NC","NC","NC","NC"]
[null,"ZELKO Thierry","MVT Quai A","Quai A",{"$error":"#DIV/0!"},null,null,"NC","NC","NC","NC","NC","NC","NC","NC","NC","NC","NC","NC","NC","NC","NC","NC","NC","NC","NC","NC","NC","NC","NC","NC","NC","NC","NC","NC","NC","NC","NC","NC","NC","NC","NC","NC","NC","NC","NC","NC","NC","NC","NC","NC","NC","NC","NC","NC","NC","NC","NC","NC","NC","NC","NC","NC","NC","NC","NC","NC","NC","NC","NC","NC","NC","NC","NC","NC","NC","NC","NC","NC","NC","NC","NC","NC","NC","NC","NC"]
[null,"GRAMMATICO Cyrille","MVT Quai A","Quai A",{"$error":"#DIV/0!"},null,null,"NC","NC","NC","NC","NC","NC","NC","NC","NC","NC","NC","NC","NC","NC","NC","NC","NC","NC","NC","NC","NC","NC","NC","NC","NC","NC","NC","NC","NC","NC","NC","NC","NC","NC","NC","NC","NC","NC","NC","NC","NC","NC","NC","NC","NC","NC","NC","NC","NC","NC","NC","NC","NC","NC","NC","NC","NC","NC","NC","NC","NC","NC","NC","NC","NC","NC","NC","NC","NC","NC","NC","NC","NC","NC","NC","NC","NC","NC","NC"]
[null,"BERTRAND Jérôme","MVT Quai A","Quai A",{"$error":"#DIV/0!"},null,null,"NC","NC","NC","NC","NC","NC","NC","NC","NC","NC","NC","NC","NC","NC","NC","NC","NC","NC","NC","NC","NC","NC","NC","NC","NC","NC","NC","NC","NC","NC","NC","NC","NC","NC","NC","NC","NC","NC","NC","NC","NC","NC","NC","NC","NC","NC","NC","NC","NC","NC","NC","NC","NC","NC","NC","NC","NC","NC","NC","NC","NC","NC","NC","NC","NC","NC","NC","NC","NC","NC","NC","NC","NC","NC","NC","NC","NC","NC","NC"]
[null,"MINE Sébastien","MVT Quai A","Quai A",{"$error":"#DIV/0!"},null,null,"NC","NC","NC","NC","NC","NC","NC","NC","NC","NC","NC","NC","NC","NC","NC","NC","NC","NC","NC","NC","NC","NC","NC","NC","NC","NC","NC","NC","NC","NC","NC","NC","NC","NC","NC","NC","NC","NC","NC","NC","NC","NC","NC","NC","NC","NC","NC","NC","NC","NC","NC","NC","NC","NC","NC","NC","NC","NC","NC","NC","NC","NC","NC","NC","NC","NC","NC","NC","NC","NC","NC","NC","NC","NC","NC","NC","NC","NC","NC"]
[null,"BARET Olivier","MVT Quai A","Quai A",{"$error":"#DIV/0!"},null,null,"NC","NC","NC","NC","NC","NC","NC","NC","NC","NC","NC","NC","NC","NC","NC","NC","NC","NC","NC","NC","NC","NC","NC","NC","NC","NC","NC","NC","NC","NC","NC","NC","NC","NC","NC","NC","NC","NC","NC","NC","NC","NC","NC","NC","NC","NC","NC","NC","NC","NC","NC","NC","NC","NC","NC","NC","NC","NC","NC","NC","NC","NC","NC","NC","NC","NC","NC","NC","NC","NC","NC","NC","NC","NC","NC","NC","NC","NC","NC"]
[null,"BERTELLI Alain","MVT Quai A","Quai A",{"$error":"#DIV/0!"},null,null,"NC","NC","NC","NC","NC","NC","NC","NC","NC","NC","NC","NC","NC","NC","NC","NC","NC","NC","NC","NC","NC","NC","NC","NC","NC","NC","NC","NC","NC","NC","NC","NC","NC","NC","NC","NC","NC","NC","NC","NC","NC","NC","NC","NC","NC","NC","NC","NC","NC","NC","NC","NC","NC","NC","NC","NC","NC","NC","NC","NC","NC","NC","NC","NC","NC","NC","NC","NC","NC","NC","NC","NC","NC","NC","NC","NC","NC","NC","NC"]
[null,"MOUACI Hocine","MVT Quai A","Quai A",{"$error":"#DIV/0!"},null,null,"NC","NC","NC","NC","NC","NC","NC","NC","NC","NC","NC","NC","NC","NC","NC","NC","NC","NC","NC","NC","NC","NC","NC","NC","NC","NC","NC","NC","NC","NC","NC","NC","NC","NC","NC","NC","NC","NC","NC","NC","NC","NC","NC","NC","NC","NC","NC","NC","NC","NC","NC","NC","NC","NC","NC","NC","NC","NC","NC","NC","NC","NC","NC","NC","NC","NC","NC","NC","NC","NC","NC","NC","NC","NC","NC","NC","NC","NC","NC"]
[null,"SAHRAOUI Hamid","MVT Quai A","Quai A",{"$error":"#DIV/0!"},null,null,"NC","NC","NC","NC","NC","NC","NC","NC","NC","NC","NC","NC","NC","NC","NC","NC","NC","NC","NC","NC","NC","NC","NC","NC","NC","NC","NC","NC","NC","NC","NC","NC","NC","NC","NC","NC","NC","NC","NC","NC","NC","NC","NC","NC","NC","NC","NC","NC","NC","NC","NC","NC","NC","NC","NC","NC","NC","NC","NC","NC","NC","NC","NC","NC","NC","NC","NC","NC","NC","NC","NC","NC","NC","NC","NC","NC","NC","NC","NC"]
[null,"FRECHE Anne-Laure","MVT Quai A","Quai A",{"$error":"#DIV/0!"},null,null,"NC","NC","NC","NC","NC","NC","NC","NC","NC","NC","NC","NC","NC","NC","NC","NC","NC","NC","NC","NC","NC","NC","NC","NC","NC","NC","NC","NC","NC","NC","NC","NC","NC","NC","NC","NC","NC","NC","NC","NC","NC","NC","NC","NC","NC","NC","NC","NC","NC","NC","NC","NC","NC","NC","NC","NC","NC","NC","NC","NC","NC","NC","NC","NC","NC","NC","NC","NC","NC","NC","NC","NC","NC","NC","NC","NC","NC","NC","NC"]
[null,"KEROUANTON Guewen","MVT Quai A","Quai A",{"$error":"#DIV/0!"},null,null,"NC","NC","NC","NC","NC","NC","NC","NC","NC","NC","NC","NC","NC","NC","NC","NC","NC","NC","NC","NC","NC","NC","NC","NC","NC","NC","NC","NC","NC","NC","NC","NC","NC","NC","NC","NC","NC","NC","NC","NC","NC","NC","NC","NC","NC","NC","NC","NC","NC","NC","NC","NC","NC","NC","NC","NC","NC","NC","NC","NC","NC","NC","NC","NC","NC","NC","NC","NC","NC","NC","NC","NC","NC","NC","NC","NC","NC","NC","NC"]
[null,"CAVALLIER Emmanuel","PT Quai A","Quai A",{"$error":"#DIV/0!"},null,null,"NC","NC","NC","NC","NC","NC","NC","NC","NC","NC","NC","NC","NC","NC","NC","NC","NC","NC","NC","NC","NC","NC","NC","NC","NC","NC","NC","NC","NC","NC","NC","NC","NC","NC","NC","NC","NC","NC","NC","NC","NC","NC","NC","NC","NC","NC","NC","NC","NC","NC","NC","NC","NC","NC","NC","NC","NC","NC","NC","NC","NC","NC","NC","NC","NC","NC","NC","NC","NC","NC","NC","NC","NC","NC","NC","NC","NC","NC","NC"]
[null,"DE BONI gérald","PT Quai A","Quai A",{"$error":"#DIV/0!"},null,null,"NC","NC","NC","NC","NC","NC","NC","NC","NC","NC","NC","NC","NC","NC","NC","NC","NC","NC","NC","NC","NC","NC","NC","NC","NC","NC","NC","NC","NC","NC","NC","NC","NC","NC","NC","NC","NC","NC","NC","NC","NC","NC","NC","NC","NC","NC","NC","NC","NC","NC","NC","NC","NC","NC","NC","NC","NC","NC","NC","NC","NC","NC","NC","NC","NC","NC","NC","NC","NC","NC","NC","NC","NC","NC","NC","NC","NC","NC","NC"]
[null,"MESA Samuel","PT Quai A","Quai A",{"$error":"#DIV/0!"},null,null,"NC","NC","NC","NC","NC","NC","NC","NC","NC","NC","NC","NC","NC","NC","NC","NC","NC","NC","NC","NC","NC","NC","NC","NC","NC","NC","NC","NC","NC","NC","NC","NC","NC","NC","NC","NC","NC","NC","NC","NC","NC","NC","NC","NC","NC","NC","NC","NC","NC","NC","NC","NC","NC","NC","NC","NC","NC","NC","NC","NC","NC","NC","NC","NC","NC","NC","NC","NC","NC","NC","NC","NC","NC","NC","NC","NC","NC","NC","NC"]
[null,"NEISEN Guillaume","PT Quai A","Quai A",{"$error":"#DIV/0!"},null,null,"NC","NC","NC","NC","NC","NC","NC","NC","NC","NC","NC","NC","NC","NC","NC","NC","NC","NC","NC","NC","NC","NC","NC","NC","NC","NC","NC","NC","NC","NC","NC","NC","NC","NC","NC","NC","NC","NC","NC","NC","NC","NC","NC","NC","NC","NC","NC","NC","NC","NC","NC","NC","NC","NC","NC","NC","NC","NC","NC","NC","NC","NC","NC","NC","NC","NC","NC","NC","NC","NC","NC","NC","NC","NC","NC","NC","NC","NC","NC"]
[null,"FEMENIA Grégory","PT Quai A","Quai A",{"$error":"#DIV/0!"},null,null,"NC","NC","NC","NC","NC","NC","NC","NC","NC","NC","NC","NC","NC","NC","NC","NC","NC","NC","NC","NC","NC","NC","NC","NC","NC","NC","NC","NC","NC","NC","NC","NC","NC","NC","NC","NC","NC","NC","NC","NC","NC","NC","NC","NC","NC","NC","NC","NC","NC","NC","NC","NC","NC","NC","NC","NC","NC","NC","NC","NC","NC","NC","NC","NC","NC","NC","NC","NC","NC","NC","NC","NC","NC","NC","NC","NC","NC","NC","NC"]
[null,"DULUD Thomas","PT Quai A","Quai A",{"$error":"#DIV/0!"},null,null,"NC","NC","NC","NC","NC","NC","NC","NC","NC","NC","NC","NC","NC","NC","NC","NC","NC","NC","NC","NC","NC","NC","NC","NC","NC","NC","NC","NC","NC","NC","NC","NC","NC","NC","NC","NC","NC","NC","NC","NC","NC","NC","NC","NC","NC","NC","NC","NC","NC","NC","NC","NC","NC","NC","NC","NC","NC","NC","NC","NC","NC","NC","NC","NC","NC","NC","NC","NC","NC","NC","NC","NC","NC","NC","NC","NC","NC","NC","NC"]
[null,"BAUD Jonathan","PT Quai A","Quai A",{"$error":"#DIV/0!"},null,null,"NC","NC","NC","NC","NC","NC","NC","NC","NC","NC","NC","NC","NC","NC","NC","NC","NC","NC","NC","NC","NC","NC","NC","NC","NC","NC","NC","NC","NC","NC","NC","NC","NC","NC","NC","NC","NC","NC","NC","NC","NC","NC","NC","NC","NC","NC","NC","NC","NC","NC","NC","NC","NC","NC","NC","NC","NC","NC","NC","NC","NC","NC","NC","NC","NC","NC","NC","NC","NC","NC","NC","NC","NC","NC","NC","NC","NC","NC","NC"]
[null,"BOUCHER Nathanael","PT Quai A","Quai A",{"$error":"#DIV/0!"},null,null,"NC","NC","NC","NC","NC","NC","NC","NC","NC","NC","NC","NC","NC","NC","NC","NC","NC","NC","NC","NC","NC","NC","NC","NC","NC","NC","NC","NC","NC","NC","NC","NC","NC","NC","NC","NC","NC","NC","NC","NC","NC","NC","NC","NC","NC","NC","NC","NC","NC","NC","NC","NC","NC","NC","NC","NC","NC","NC","NC","NC","NC","NC","NC","NC","NC","NC","NC","NC","NC","NC","NC","NC","NC","NC","NC","NC","NC","NC","NC"]
[null,"BOSI Frédéric","PT Quai A","Quai A",{"$error":"#DIV/0!"},null,null,"NC","NC","NC","NC","NC","NC","NC","NC","NC","NC","NC","NC","NC","NC","NC","NC","NC","NC","NC","NC","NC","NC","NC","NC","NC","NC","NC","NC","NC","NC","NC","NC","NC","NC","NC","NC","NC","NC","NC","NC","NC","NC","NC","NC","NC","NC","NC","NC","NC","NC","NC","NC","NC","NC","NC","NC","NC","NC","NC","NC","NC","NC","NC","NC","NC","NC","NC","NC","NC","NC","NC","NC","NC","NC","NC","NC","NC","NC","NC"]
[null,"PIGNARD Ludovic","PT Quai A","Quai A",{"$error":"#DIV/0!"},null,null,"NC","NC","NC","NC","NC","NC","NC","NC","NC","NC","NC","NC","NC","NC","NC","NC","NC","NC","NC","NC","NC","NC","NC","NC","NC","NC","NC","NC","NC","NC","NC","NC","NC","NC","NC","NC","NC","NC","NC","NC","NC","NC","NC","NC","NC","NC","NC","NC","NC","NC","NC","NC","NC","NC","NC","NC","NC","NC","NC","NC","NC","NC","NC","NC","NC","NC","NC","NC","NC","NC","NC","NC","NC","NC","NC","NC","NC","NC","NC"]
[null,"CISSE Ibrahima","PT Quai A","Quai A",{"$error":"#DIV/0!"},null,null,"NC","NC","NC","NC","NC","NC","NC","NC","NC","NC","NC","NC","NC","NC","NC","NC","NC","NC","NC","NC","NC","NC","NC","NC","NC","NC","NC","NC","NC","NC","NC","NC","NC","NC","NC","NC","NC","NC","NC","NC","NC","NC","NC","NC","NC","NC","NC","NC","NC","NC","NC","NC","NC","NC","NC","NC","NC","NC","NC","NC","NC","NC","NC","NC","NC","NC","NC","NC","NC","NC","NC","NC","NC","NC","NC","NC","NC","NC","NC"]
[null,"BRUNEL Raymond","PT Quai A","Quai A",{"$error":"#DIV/0!"},null,null,"NC","NC","NC","NC","NC","NC","NC","NC","NC","NC","NC","NC","NC","NC","NC","NC","NC","NC","NC","NC","NC","NC","NC","NC","NC","NC","NC","NC","NC","NC","NC","NC","NC","NC","NC","NC","NC","NC","NC","NC","NC","NC","NC","NC","NC","NC","NC","NC","NC","NC","NC","NC","NC","NC","NC","NC","NC","NC","NC","NC","NC","NC","NC","NC","NC","NC","NC","NC","NC","NC","NC","NC","NC","NC","NC","NC","NC","NC","NC"]
[null,"ABADIE Pascal","PT Quai A","Quai A",{"$error":"#DIV/0!"},null,null,"NC","NC","NC","NC","NC","NC","NC","NC","NC","NC","NC","NC","NC","NC","NC","NC","NC","NC","NC","NC","NC","NC","NC","NC","NC","NC","NC","NC","NC","NC","NC","NC","NC","NC","NC","NC","NC","NC","NC","NC","NC","NC","NC","NC","NC","NC","NC","NC","NC","NC","NC","NC","NC","NC","NC","NC","NC","NC","NC","NC","NC","NC","NC","NC","NC","NC","NC","NC","NC","NC","NC","NC","NC","NC","NC","NC","NC","NC","NC"]
[null,"CLANET Cyril","PT Quai A","Quai A",{"$f":"SUM(H42:CH42)/(COUNTIFS(H42:CH42,1)+COUNTIFS(H42:CH42,0))","v":{"$error":"#DIV/0!"}},null,null,"NC","NC","NC","NC","NC","NC","NC","NC","NC","NC","NC","NC","NC","NC","NC","NC","NC","NC","NC","NC","NC","NC","NC","NC","NC","NC","NC","NC","NC","NC","NC","NC","NC","NC","NC","NC","NC","NC","NC","NC","NC","NC","NC","NC","NC","NC","NC","NC","NC","NC","NC","NC","NC","NC","NC","NC","NC","NC","NC","NC","NC","NC","NC","NC","NC","NC","NC","NC","NC","NC","NC","NC","NC","NC","NC","NC","NC","NC","NC"]
[null,"DELPODIO Robert","PT Quai A","Quai A",{"$error":"#DIV/0!"},null,null,"NC","NC","NC","NC","NC","NC","NC","NC","NC","NC","NC","NC","NC","NC","NC","NC","NC","NC","NC","NC","NC","NC","NC","NC","NC","NC","NC","NC","NC","NC","NC","NC","NC","NC","NC","NC","NC","NC","NC","NC","NC","NC","NC","NC","NC","NC","NC","NC","NC","NC","NC","NC","NC","NC","NC","NC","NC","NC","NC","NC","NC","NC","NC","NC","NC","NC","NC","NC","NC","NC","NC","NC","NC","NC","NC","NC","NC","NC","NC"]
[null,"FONTAINE Philippe","PT Quai A","Quai A",{"$error":"#DIV/0!"},null,null,"NC","NC","NC","NC","NC","NC","NC","NC","NC","NC","NC","NC","NC","NC","NC","NC","NC","NC","NC","NC","NC","NC","NC","NC","NC","NC","NC","NC","NC","NC","NC","NC","NC","NC","NC","NC","NC","NC","NC","NC","NC","NC","NC","NC","NC","NC","NC","NC","NC","NC","NC","NC","NC","NC","NC","NC","NC","NC","NC","NC","NC","NC","NC","NC","NC","NC","NC","NC","NC","NC","NC","NC","NC","NC","NC","NC","NC","NC","NC"]
[null,"RIDET Didier","PT Quai A","Quai A",{"$error":"#DIV/0!"},null,null,"NC","NC","NC","NC","NC","NC","NC","NC","NC","NC","NC","NC","NC","NC","NC","NC","NC","NC","NC","NC","NC","NC","NC","NC","NC","NC","NC","NC","NC","NC","NC","NC","NC","NC","NC","NC","NC","NC","NC","NC","NC","NC","NC","NC","NC","NC","NC","NC","NC","NC","NC","NC","NC","NC","NC","NC","NC","NC","NC","NC","NC","NC","NC","NC","NC","NC","NC","NC","NC","NC","NC","NC","NC","NC","NC","NC","NC","NC","NC"]
[null,"PHILY André","PT Quai A","Quai A",{"$error":"#DIV/0!"},null,null,"NC","NC","NC","NC","NC","NC","NC","NC","NC","NC","NC","NC","NC","NC","NC","NC","NC","NC","NC","NC","NC","NC","NC","NC","NC","NC","NC","NC","NC","NC","NC","NC","NC","NC","NC","NC","NC","NC","NC","NC","NC","NC","NC","NC","NC","NC","NC","NC","NC","NC","NC","NC","NC","NC","NC","NC","NC","NC","NC","NC","NC","NC","NC","NC","NC","NC","NC","NC","NC","NC","NC","NC","NC","NC","NC","NC","NC","NC","NC"]
[null,"VANNUCCI Francis","PT Quai A","Quai A",{"$error":"#DIV/0!"},null,null,"NC","NC","NC","NC","NC","NC","NC","NC","NC","NC","NC","NC","NC","NC","NC","NC","NC","NC","NC","NC","NC","NC","NC","NC","NC","NC","NC","NC","NC","NC","NC","NC","NC","NC","NC","NC","NC","NC","NC","NC","NC","NC","NC","NC","NC","NC","NC","NC","NC","NC","NC","NC","NC","NC","NC","NC","NC","NC","NC","NC","NC","NC","NC","NC","NC","NC","NC","NC","NC","NC","NC","NC","NC","NC","NC","NC","NC","NC","NC"]
[null,"SPIGA Hichem","PT Quai A","Quai A",{"$error":"#DIV/0!"},null,null,"NC","NC","NC","NC","NC","NC","NC","NC","NC","NC","NC","NC","NC","NC","NC","NC","NC","NC","NC","NC","NC","NC","NC","NC","NC","NC","NC","NC","NC","NC","NC","NC","NC","NC","NC","NC","NC","NC","NC","NC","NC","NC","NC","NC","NC","NC","NC","NC","NC","NC","NC","NC","NC","NC","NC","NC","NC","NC","NC","NC","NC","NC","NC","NC","NC","NC","NC","NC","NC","NC","NC","NC","NC","NC","NC","NC","NC","NC","NC"]
[null,"MULOT Pascal ","PT Quai A","Quai A",{"$error":"#DIV/0!"},null,null,"NC","NC","NC","NC","NC","NC","NC","NC","NC","NC","NC","NC","NC","NC","NC","NC","NC","NC","NC","NC","NC","NC","NC","NC","NC","NC","NC","NC","NC","NC","NC","NC","NC","NC","NC","NC","NC","NC","NC","NC","NC","NC","NC","NC","NC","NC","NC","NC","NC","NC","NC","NC","NC","NC","NC","NC","NC","NC","NC","NC","NC","NC","NC","NC","NC","NC","NC","NC","NC","NC","NC","NC","NC","NC","NC","NC","NC","NC","NC"]
[null,"FIXON Christophe","PT Quai A","Quai A",{"$error":"#DIV/0!"},null,null,"NC","NC","NC","NC","NC","NC","NC","NC","NC","NC","NC","NC","NC","NC","NC","NC","NC","NC","NC","NC","NC","NC","NC","NC","NC","NC","NC","NC","NC","NC","NC","NC","NC","NC","NC","NC","NC","NC","NC","NC","NC","NC","NC","NC","NC","NC","NC","NC","NC","NC","NC","NC","NC","NC","NC","NC","NC","NC","NC","NC","NC","NC","NC","NC","NC","NC","NC","NC","NC","NC","NC","NC","NC","NC","NC","NC","NC","NC","NC"]
[null,"MARTINEZ Dorian","PT Quai A","Quai A",{"$error":"#DIV/0!"},null,null,"NC","NC","NC","NC","NC","NC","NC","NC","NC","NC","NC","NC","NC","NC","NC","NC","NC","NC","NC","NC","NC","NC","NC","NC","NC","NC","NC","NC","NC","NC","NC","NC","NC","NC","NC","NC","NC","NC","NC","NC","NC","NC","NC","NC","NC","NC","NC","NC","NC","NC","NC","NC","NC","NC","NC","NC","NC","NC","NC","NC","NC","NC","NC","NC","NC","NC","NC","NC","NC","NC","NC","NC","NC","NC","NC","NC","NC","NC","NC"]
[null,"CUELLO Frédéric","PT Quai A","Quai A",{"$error":"#DIV/0!"},null,null,"NC","NC","NC","NC","NC","NC","NC","NC","NC","NC","NC","NC","NC","NC","NC","NC","NC","NC","NC","NC","NC","NC","NC","NC","NC","NC","NC","NC","NC","NC","NC","NC","NC","NC","NC","NC","NC","NC","NC","NC","NC","NC","NC","NC","NC","NC","NC","NC","NC","NC","NC","NC","NC","NC","NC","NC","NC","NC","NC","NC","NC","NC","NC","NC","NC","NC","NC","NC","NC","NC","NC","NC","NC","NC","NC","NC","NC","NC","NC"]
[null,"MEGE Stéphane","PT Point M","Point M",{"$error":"#DIV/0!"},null,null,"NC","NC","NC","NC","NC","NC","NC","NC","NC","NC","NC","NC","NC","NC","NC","NC","NC","NC","NC","NC","NC","NC","NC","NC","NC","NC","NC","NC","NC","NC","NC","NC","NC","NC","NC","NC","NC","NC","NC","NC","NC","NC","NC","NC","NC","NC","NC","NC","NC","NC","NC","NC","NC","NC","NC","NC","NC","NC","NC","NC","NC","NC","NC","NC","NC","NC","NC","NC","NC","NC","NC","NC","NC","NC","NC","NC","NC","NC","NC"]
[null,"DEGISORS Olivier","PT Point M","Point M",{"$error":"#DIV/0!"},null,null,"NC","NC","NC","NC","NC","NC","NC","NC","NC","NC","NC","NC","NC","NC","NC","NC","NC","NC","NC","NC","NC","NC","NC","NC","NC","NC","NC","NC","NC","NC","NC","NC","NC","NC","NC","NC","NC","NC","NC","NC","NC","NC","NC","NC","NC","NC","NC","NC","NC","NC","NC","NC","NC","NC","NC","NC","NC","NC","NC","NC","NC","NC","NC","NC","NC","NC","NC","NC","NC","NC","NC","NC","NC","NC","NC","NC","NC","NC","NC"]
[null,"KRIEGEL Tom","PT Point M","Point M",{"$error":"#DIV/0!"},null,null,"NC","NC","NC","NC","NC","NC","NC","NC","NC","NC","NC","NC","NC","NC","NC","NC","NC","NC","NC","NC","NC","NC","NC","NC","NC","NC","NC","NC","NC","NC","NC","NC","NC","NC","NC","NC","NC","NC","NC","NC","NC","NC","NC","NC","NC","NC","NC","NC","NC","NC","NC","NC","NC","NC","NC","NC","NC","NC","NC","NC","NC","NC","NC","NC","NC","NC","NC","NC","NC","NC","NC","NC","NC","NC","NC","NC","NC","NC","NC"]
[null,"CHARLOT Philippe","PT Point M","Point M",{"$error":"#DIV/0!"},null,null,"NC","NC","NC","NC","NC","NC","NC","NC","NC","NC","NC","NC","NC","NC","NC","NC","NC","NC","NC","NC","NC","NC","NC","NC","NC","NC","NC","NC","NC","NC","NC","NC","NC","NC","NC","NC","NC","NC","NC","NC","NC","NC","NC","NC","NC","NC","NC","NC","NC","NC","NC","NC","NC","NC","NC","NC","NC","NC","NC","NC","NC","NC","NC","NC","NC","NC","NC","NC","NC","NC","NC","NC","NC","NC","NC","NC","NC","NC","NC"]
[null,"LAMBERT Jacky","PT Point M","Point M",{"$error":"#DIV/0!"},null,null,"NC","NC","NC","NC","NC","NC","NC","NC","NC","NC","NC","NC","NC","NC","NC","NC","NC","NC","NC","NC","NC","NC","NC","NC","NC","NC","NC","NC","NC","NC","NC","NC","NC","NC","NC","NC","NC","NC","NC","NC","NC","NC","NC","NC","NC","NC","NC","NC","NC","NC","NC","NC","NC","NC","NC","NC","NC","NC","NC","NC","NC","NC","NC","NC","NC","NC","NC","NC","NC","NC","NC","NC","NC","NC","NC","NC","NC","NC","NC"]
[null,"PASQUIER Philippe","PT Point M","Point M",{"$error":"#DIV/0!"},null,null,"NC","NC","NC","NC","NC","NC","NC","NC","NC","NC","NC","NC","NC","NC","NC","NC","NC","NC","NC","NC","NC","NC","NC","NC","NC","NC","NC","NC","NC","NC","NC","NC","NC","NC","NC","NC","NC","NC","NC","NC","NC","NC","NC","NC","NC","NC","NC","NC","NC","NC","NC","NC","NC","NC","NC","NC","NC","NC","NC","NC","NC","NC","NC","NC","NC","NC","NC","NC","NC","NC","NC","NC","NC","NC","NC","NC","NC","NC","NC"]
[null,"PASTOR Jérôme","PT Point M","Point M",{"$error":"#DIV/0!"},null,null,"NC","NC","NC","NC","NC","NC","NC","NC","NC","NC","NC","NC","NC","NC","NC","NC","NC","NC","NC","NC","NC","NC","NC","NC","NC","NC","NC","NC","NC","NC","NC","NC","NC","NC","NC","NC","NC","NC","NC","NC","NC","NC","NC","NC","NC","NC","NC","NC","NC","NC","NC","NC","NC","NC","NC","NC","NC","NC","NC","NC","NC","NC","NC","NC","NC","NC","NC","NC","NC","NC","NC","NC","NC","NC","NC","NC","NC","NC","NC"]
[null,"PLACE Eric","PT Point M","Point M",{"$error":"#DIV/0!"},null,null,"NC","NC","NC","NC","NC","NC","NC","NC","NC","NC","NC","NC","NC","NC","NC","NC","NC","NC","NC","NC","NC","NC","NC","NC","NC","NC","NC","NC","NC","NC","NC","NC","NC","NC","NC","NC","NC","NC","NC","NC","NC","NC","NC","NC","NC","NC","NC","NC","NC","NC","NC","NC","NC","NC","NC","NC","NC","NC","NC","NC","NC","NC","NC","NC","NC","NC","NC","NC","NC","NC","NC","NC","NC","NC","NC","NC","NC","NC","NC"]
[null,"CASEVECCHIE J-Francois","PT Point M","Point M",{"$error":"#DIV/0!"},null,null,"NC","NC","NC","NC","NC","NC","NC","NC","NC","NC","NC","NC","NC","NC","NC","NC","NC","NC","NC","NC","NC","NC","NC","NC","NC","NC","NC","NC","NC","NC","NC","NC","NC","NC","NC","NC","NC","NC","NC","NC","NC","NC","NC","NC","NC","NC","NC","NC","NC","NC","NC","NC","NC","NC","NC","NC","NC","NC","NC","NC","NC","NC","NC","NC","NC","NC","NC","NC","NC","NC","NC","NC","NC","NC","NC","NC","NC","NC","NC"]
[null,"MADI Hamed","PT Point M","Point M",{"$error":"#DIV/0!"},null,null,"NC","NC","NC","NC","NC","NC","NC","NC","NC","NC","NC","NC","NC","NC","NC","NC","NC","NC","NC","NC","NC","NC","NC","NC","NC","NC","NC","NC","NC","NC","NC","NC","NC","NC","NC","NC","NC","NC","NC","NC","NC","NC","NC","NC","NC","NC","NC","NC","NC","NC","NC","NC","NC","NC","NC","NC","NC","NC","NC","NC","NC","NC","NC","NC","NC","NC","NC","NC","NC","NC","NC","NC","NC","NC","NC","NC","NC","NC","NC"]
[null,"NEDJMA Tewfik","PT Point M","Point M",{"$error":"#DIV/0!"},null,null,"NC","NC","NC","NC","NC","NC","NC","NC","NC","NC","NC","NC","NC","NC","NC","NC","NC","NC","NC","NC","NC","NC","NC","NC","NC","NC","NC","NC","NC","NC","NC","NC","NC","NC","NC","NC","NC","NC","NC","NC","NC","NC","NC","NC","NC","NC","NC","NC","NC","NC","NC","NC","NC","NC","NC","NC","NC","NC","NC","NC","NC","NC","NC","NC","NC","NC","NC","NC","NC","NC","NC","NC","NC","NC","NC","NC","NC","NC","NC"]
[null,"BEGUE Fabrice","PT Point M","Point M",{"$error":"#DIV/0!"},null,null,"NC","NC","NC","NC","NC","NC","NC","NC","NC","NC","NC","NC","NC","NC","NC","NC","NC","NC","NC","NC","NC","NC","NC","NC","NC","NC","NC","NC","NC","NC","NC","NC","NC","NC","NC","NC","NC","NC","NC","NC","NC","NC","NC","NC","NC","NC","NC","NC","NC","NC","NC","NC","NC","NC","NC","NC","NC","NC","NC","NC","NC","NC","NC","NC","NC","NC","NC","NC","NC","NC","NC","NC","NC","NC","NC","NC","NC","NC","NC"]
[null,"LECORDIER Dominique","PT Point M","Point M",{"$error":"#DIV/0!"},null,null,"NC","NC","NC","NC","NC","NC","NC","NC","NC","NC","NC","NC","NC","NC","NC","NC","NC","NC","NC","NC","NC","NC","NC","NC","NC","NC","NC","NC","NC","NC","NC","NC","NC","NC","NC","NC","NC","NC","NC","NC","NC","NC","NC","NC","NC","NC","NC","NC","NC","NC","NC","NC","NC","NC","NC","NC","NC","NC","NC","NC","NC","NC","NC","NC","NC","NC","NC","NC","NC","NC","NC","NC","NC","NC","NC","NC","NC","NC","NC"]
[null,"RAVELLA David","PT Point M","Point M",{"$error":"#DIV/0!"},null,null,"NC","NC","NC","NC","NC","NC","NC","NC","NC","NC","NC","NC","NC","NC","NC","NC","NC","NC","NC","NC","NC","NC","NC","NC","NC","NC","NC","NC","NC","NC","NC","NC","NC","NC","NC","NC","NC","NC","NC","NC","NC","NC","NC","NC","NC","NC","NC","NC","NC","NC","NC","NC","NC","NC","NC","NC","NC","NC","NC","NC","NC","NC","NC","NC","NC","NC","NC","NC","NC","NC","NC","NC","NC","NC","NC","NC","NC","NC","NC"]
[null,"DIETZINGER Yves","PT Point M","Point M",{"$error":"#DIV/0!"},null,null,"NC","NC","NC","NC","NC","NC","NC","NC","NC","NC","NC","NC","NC","NC","NC","NC","NC","NC","NC","NC","NC","NC","NC","NC","NC","NC","NC","NC","NC","NC","NC","NC","NC","NC","NC","NC","NC","NC","NC","NC","NC","NC","NC","NC","NC","NC","NC","NC","NC","NC","NC","NC","NC","NC","NC","NC","NC","NC","NC","NC","NC","NC","NC","NC","NC","NC","NC","NC","NC","NC","NC","NC","NC","NC","NC","NC","NC","NC","NC"]
[null,"CRAND Cyril","PT Point M","Quai A et point M - boite aux lettres M",{"$error":"#DIV/0!"},null,null,"NC","NC","NC","NC","NC","NC","NC","NC","NC","NC","NC","NC","NC","NC","NC","NC","NC","NC","NC","NC","NC","NC","NC","NC","NC","NC","NC","NC","NC","NC","NC","NC","NC","NC","NC","NC","NC","NC","NC","NC","NC","NC","NC","NC","NC","NC","NC","NC","NC","NC","NC","NC","NC","NC","NC","NC","NC","NC","NC","NC","NC","NC","NC","NC","NC","NC","NC","NC","NC","NC","NC","NC","NC","NC","NC","NC","NC","NC","NC"]
[null,"GRIVOT Laurent","PT Point M","Quai A et point M - boite aux lettres M",{"$error":"#DIV/0!"},null,null,"NC","NC","NC","NC","NC","NC","NC","NC","NC","NC","NC","NC","NC","NC","NC","NC","NC","NC","NC","NC","NC","NC","NC","NC","NC","NC","NC","NC","NC","NC","NC","NC","NC","NC","NC","NC","NC","NC","NC","NC","NC","NC","NC","NC","NC","NC","NC","NC","NC","NC","NC","NC","NC","NC","NC","NC","NC","NC","NC","NC","NC","NC","NC","NC","NC","NC","NC","NC","NC","NC","NC","NC","NC","NC","NC","NC","NC","NC","NC"]
[null,"NOURY Francois","PT Point M","Quai A et point M - boite aux lettres M",{"$error":"#DIV/0!"},null,null,"NC","NC","NC","NC","NC","NC","NC","NC","NC","NC","NC","NC","NC","NC","NC","NC","NC","NC","NC","NC","NC","NC","NC","NC","NC","NC","NC","NC","NC","NC","NC","NC","NC","NC","NC","NC","NC","NC","NC","NC","NC","NC","NC","NC","NC","NC","NC","NC","NC","NC","NC","NC","NC","NC","NC","NC","NC","NC","NC","NC","NC","NC","NC","NC","NC","NC","NC","NC","NC","NC","NC","NC","NC","NC","NC","NC","NC","NC","NC"]
[null,"GIOVANNETTI Frederic","PT Point M","Quai A et point M - boite aux lettres M",{"$error":"#DIV/0!"},null,null,"NC","NC","NC","NC","NC","NC","NC","NC","NC","NC","NC","NC","NC","NC","NC","NC","NC","NC","NC","NC","NC","NC","NC","NC","NC","NC","NC","NC","NC","NC","NC","NC","NC","NC","NC","NC","NC","NC","NC","NC","NC","NC","NC","NC","NC","NC","NC","NC","NC","NC","NC","NC","NC","NC","NC","NC","NC","NC","NC","NC","NC","NC","NC","NC","NC","NC","NC","NC","NC","NC","NC","NC","NC","NC","NC","NC","NC","NC","NC"]
[null,"NAILI Idriss","PT Point M","Quai A et point M - boite aux lettres M",{"$error":"#DIV/0!"},null,null,"NC","NC","NC","NC","NC","NC","NC","NC","NC","NC","NC","NC","NC","NC","NC","NC","NC","NC","NC","NC","NC","NC","NC","NC","NC","NC","NC","NC","NC","NC","NC","NC","NC","NC","NC","NC","NC","NC","NC","NC","NC","NC","NC","NC","NC","NC","NC","NC","NC","NC","NC","NC","NC","NC","NC","NC","NC","NC","NC","NC","NC","NC","NC","NC","NC","NC","NC","NC","NC","NC","NC","NC","NC","NC","NC","NC","NC","NC","NC"]
[null,"SANCHEZ Jeremy","PT Point M","Point M",{"$error":"#DIV/0!"},null,null,"NC","NC","NC","NC","NC","NC","NC","NC","NC","NC","NC","NC","NC","NC","NC","NC","NC","NC","NC","NC","NC","NC","NC","NC","NC","NC","NC","NC","NC","NC","NC","NC","NC","NC","NC","NC","NC","NC","NC","NC","NC","NC","NC","NC","NC","NC","NC","NC","NC","NC","NC","NC","NC","NC","NC","NC","NC","NC","NC","NC","NC","NC","NC","NC","NC","NC","NC","NC","NC","NC","NC","NC","NC","NC","NC","NC","NC","NC","NC"]
[null,"CAPPELLO Chloé","PT Réserve","Quai A",{"$f":"SUM(H74:CH74)/(COUNTIFS(H74:CH74,1)+COUNTIFS(H74:CH74,0))","v":{"v":0.42857142857142855,"d":"43%"}},null,null,1,"NC","NC","NC","NC","NC","NC","NC","NC","NC",1,1,"NC","NC",0,0,0,0,"NC","NC","NC","NC","NC","NC","NC","NC","NC","NC","NC","NC","NC","NC","NC","NC","NC","NC","NC","NC","NC","NC","NC","NC","NC","NC","NC","NC","NC","NC","NC","NC","NC","NC","NC","NC","NC","NC","NC","NC","NC","NC","NC","NC","NC","NC","NC","NC","NC","NC","NC","NC","NC","NC","NC","NC","NC","NC","NC","NC","NC"]
[null,"CARLOTTI Domonique","PT Réserve","Quai A et point M",{"v":0.75,"d":"75%"},null,null,1,"NC","NC","NC","NC","NC","NC","NC","NC","NC",1,1,"NC","NC","NC","NC","NC",0,"NC","NC","NC","NC","NC","NC","NC","NC","NC","NC","NC","NC","NC","NC","NC","NC","NC","NC","NC","NC","NC","NC","NC","NC","NC","NC","NC","NC","NC","NC","NC","NC","NC","NC","NC","NC","NC","NC","NC","NC","NC","NC","NC","NC","NC","NC","NC","NC","NC","NC","NC","NC","NC","NC","NC","NC","NC","NC","NC","NC","NC"]
[null,"CASSARO Serge","PT Réserve","Quai A",{"v":0.75,"d":"75%"},null,null,1,"NC","NC","NC","NC","NC","NC","NC","NC","NC",1,1,"NC","NC","NC","NC","NC",0,"NC","NC","NC","NC","NC","NC","NC","NC","NC","NC","NC","NC","NC","NC","NC","NC","NC","NC","NC","NC","NC","NC","NC","NC","NC","NC","NC","NC","NC","NC","NC","NC","NC","NC","NC","NC","NC","NC","NC","NC","NC","NC","NC","NC","NC","NC","NC","NC","NC","NC","NC","NC","NC","NC","NC","NC","NC","NC","NC","NC","NC"]
[null,"CORREARD Stéphane","PT Réserve","Quai A et point M",{"v":0.42857142857142855,"d":"43%"},null,null,1,"NC","NC","NC","NC","NC","NC","NC","NC","NC",1,1,"NC","NC",0,0,0,0,"NC","NC","NC","NC","NC","NC","NC","NC","NC","NC","NC","NC","NC","NC","NC","NC","NC","NC","NC","NC","NC","NC","NC","NC","NC","NC","NC","NC","NC","NC","NC","NC","NC","NC","NC","NC","NC","NC","NC","NC","NC","NC","NC","NC","NC","NC","NC","NC","NC","NC","NC","NC","NC","NC","NC","NC","NC","NC","NC","NC","NC"]
[null,"DUPUIS Jérôme","PT Réserve","Quai A et point M",{"v":0.42857142857142855,"d":"43%"},null,null,1,"NC","NC","NC","NC","NC","NC","NC","NC","NC",1,1,"NC","NC",0,0,0,0,"NC","NC","NC","NC","NC","NC","NC","NC","NC","NC","NC","NC","NC","NC","NC","NC","NC","NC","NC","NC","NC","NC","NC","NC","NC","NC","NC","NC","NC","NC","NC","NC","NC","NC","NC","NC","NC","NC","NC","NC","NC","NC","NC","NC","NC","NC","NC","NC","NC","NC","NC","NC","NC","NC","NC","NC","NC","NC","NC","NC","NC"]
[null,"FONTAINE Willy","PT Réserve","Quai A et point M",{"v":0.75,"d":"75%"},null,null,1,"NC","NC","NC","NC","NC","NC","NC","NC","NC",1,1,"NC","NC","NC","NC","NC",0,"NC","NC","NC","NC","NC","NC","NC","NC","NC","NC","NC","NC","NC","NC","NC","NC","NC","NC","NC","NC","NC","NC","NC","NC","NC","NC","NC","NC","NC","NC","NC","NC","NC","NC","NC","NC","NC","NC","NC","NC","NC","NC","NC","NC","NC","NC","NC","NC","NC","NC","NC","NC","NC","NC","NC","NC","NC","NC","NC","NC","NC"]
[null,"GONZALEZ Franck","PT Réserve","Quai A et point M",{"v":0.75,"d":"75%"},null,null,1,"NC","NC","NC","NC","NC","NC","NC","NC","NC",1,1,"NC","NC","NC","NC","NC",0,"NC","NC","NC","NC","NC","NC","NC","NC","NC","NC","NC","NC","NC","NC","NC","NC","NC","NC","NC","NC","NC","NC","NC","NC","NC","NC","NC","NC","NC","NC","NC","NC","NC","NC","NC","NC","NC","NC","NC","NC","NC","NC","NC","NC","NC","NC","NC","NC","NC","NC","NC","NC","NC","NC","NC","NC","NC","NC","NC","NC","NC"]
[null,"GRECO Zohra","PT Réserve","Quai A et point M",{"v":0.7142857142857143,"d":"71%"},null,null,1,1,1,1,1,1,1,1,"NC","NC",1,1,"NC","NC",0,0,0,0,"NC","NC","NC","NC","NC","NC","NC","NC","NC","NC","NC","NC","NC","NC","NC","NC","NC","NC","NC","NC","NC","NC","NC","NC","NC","NC","NC","NC","NC","NC","NC","NC","NC","NC","NC","NC","NC","NC","NC","NC","NC","NC","NC","NC","NC","NC","NC","NC","NC","NC","NC","NC","NC","NC","NC","NC","NC","NC","NC","NC","NC"]
[null,"HOUDANT Baptiste","PT Réserve","Quai A et point M",{"v":0.75,"d":"75%"},null,null,1,"NC","NC","NC","NC","NC","NC","NC","NC","NC",1,1,"NC","NC","NC","NC","NC",0,"NC","NC","NC","NC","NC","NC","NC","NC","NC","NC","NC","NC","NC","NC","NC","NC","NC","NC","NC","NC","NC","NC","NC","NC","NC","NC","NC","NC","NC","NC","NC","NC","NC","NC","NC","NC","NC","NC","NC","NC","NC","NC","NC","NC","NC","NC","NC","NC","NC","NC","NC","NC","NC","NC","NC","NC","NC","NC","NC","NC","NC"]
[null,"IBARZ Anthony","PT Réserve","Quai A et point M",{"v":0.75,"d":"75%"},null,null,1,"NC","NC","NC","NC","NC","NC","NC","NC","NC",1,1,"NC","NC","NC","NC","NC",0,"NC","NC","NC","NC","NC","NC","NC","NC","NC","NC","NC","NC","NC","NC","NC","NC","NC","NC","NC","NC","NC","NC","NC","NC","NC","NC","NC","NC","NC","NC","NC","NC","NC","NC","NC","NC","NC","NC","NC","NC","NC","NC","NC","NC","NC","NC","NC","NC","NC","NC","NC","NC","NC","NC","NC","NC","NC","NC","NC","NC","NC"]
[null,"LABORET Lawry","PT Réserve","Quai A et point M",{"v":0.75,"d":"75%"},null,null,1,"NC","NC","NC","NC","NC","NC","NC","NC","NC",1,1,"NC","NC","NC","NC","NC",0,"NC","NC","NC","NC","NC","NC","NC","NC","NC","NC","NC","NC","NC","NC","NC","NC","NC","NC","NC","NC","NC","NC","NC","NC","NC","NC","NC","NC","NC","NC","NC","NC","NC","NC","NC","NC","NC","NC","NC","NC","NC","NC","NC","NC","NC","NC","NC","NC","NC","NC","NC","NC","NC","NC","NC","NC","NC","NC","NC","NC","NC"]
[null,"MICHEL Sylvain","PT Réserve","Quai A et point M",{"v":0.42857142857142855,"d":"43%"},null,null,1,"NC","NC","NC","NC","NC","NC","NC","NC","NC",1,1,"NC","NC",0,0,0,0,"NC","NC","NC","NC","NC","NC","NC","NC","NC","NC","NC","NC","NC","NC","NC","NC","NC","NC","NC","NC","NC","NC","NC","NC","NC","NC","NC","NC","NC","NC","NC","NC","NC","NC","NC","NC","NC","NC","NC","NC","NC","NC","NC","NC","NC","NC","NC","NC","NC","NC","NC","NC","NC","NC","NC","NC","NC","NC","NC","NC","NC"]
[null,"RANALDI Cyril","PT Réserve","Quai A et point M",{"v":0.75,"d":"75%"},null,null,1,"NC","NC","NC","NC","NC","NC","NC","NC","NC",1,1,"NC","NC","NC","NC","NC",0,"NC","NC","NC","NC","NC","NC","NC","NC","NC","NC","NC","NC","NC","NC","NC","NC","NC","NC","NC","NC","NC","NC","NC","NC","NC","NC","NC","NC","NC","NC","NC","NC","NC","NC","NC","NC","NC","NC","NC","NC","NC","NC","NC","NC","NC","NC","NC","NC","NC","NC","NC","NC","NC","NC","NC","NC","NC","NC","NC","NC","NC"]
[null,"RIDET David","PT Réserve","Quai A",{"v":0.75,"d":"75%"},null,null,1,"NC","NC","NC","NC","NC","NC","NC","NC","NC",1,1,"NC","NC","NC","NC","NC",0,"NC","NC","NC","NC","NC","NC","NC","NC","NC","NC","NC","NC","NC","NC","NC","NC","NC","NC","NC","NC","NC","NC","NC","NC","NC","NC","NC","NC","NC","NC","NC","NC","NC","NC","NC","NC","NC","NC","NC","NC","NC","NC","NC","NC","NC","NC","NC","NC","NC","NC","NC","NC","NC","NC","NC","NC","NC","NC","NC","NC","NC"]
[null,"SARPI Cyril","PT Réserve","Quai A et point M",{"v":0.8333333333333334,"d":"83%"},null,null,1,1,1,"NC","NC","NC","NC","NC","NC","NC",1,1,"NC","NC","NC","NC","NC",0,"NC","NC","NC","NC","NC","NC","NC","NC","NC","NC","NC","NC","NC","NC","NC","NC","NC","NC","NC","NC","NC","NC","NC","NC","NC","NC","NC","NC","NC","NC","NC","NC","NC","NC","NC","NC","NC","NC","NC","NC","NC","NC","NC","NC","NC","NC","NC","NC","NC","NC","NC","NC","NC","NC","NC","NC","NC","NC","NC","NC","NC"]
[null,"SIMON Anthony","PT Réserve","Quai A et point M",{"v":0.42857142857142855,"d":"43%"},null,null,1,"NC","NC","NC","NC","NC","NC","NC","NC","NC",1,1,"NC","NC",0,0,0,0,"NC","NC","NC","NC","NC","NC","NC","NC","NC","NC","NC","NC","NC","NC","NC","NC","NC","NC","NC","NC","NC","NC","NC","NC","NC","NC","NC","NC","NC","NC","NC","NC","NC","NC","NC","NC","NC","NC","NC","NC","NC","NC","NC","NC","NC","NC","NC","NC","NC","NC","NC","NC","NC","NC","NC","NC","NC","NC","NC","NC","NC"]
[null,"TERRIBILE Isabelle","PT Réserve","Quai A et point M",{"v":0.42857142857142855,"d":"43%"},null,null,1,"NC","NC","NC","NC","NC","NC","NC","NC","NC",1,1,"NC","NC",0,0,0,0,"NC","NC","NC","NC","NC","NC","NC","NC","NC","NC","NC","NC","NC","NC","NC","NC","NC","NC","NC","NC","NC","NC","NC","NC","NC","NC","NC","NC","NC","NC","NC","NC","NC","NC","NC","NC","NC","NC","NC","NC","NC","NC","NC","NC","NC","NC","NC","NC","NC","NC","NC","NC","NC","NC","NC","NC","NC","NC","NC","NC","NC"]
[null,"YAGOUBI ALIBERT Stephan","PT Réserve","Quai A",{"v":0.6923076923076923,"d":"69%"},null,null,1,1,1,1,1,1,1,"NC","NC","NC",1,1,"NC","NC",0,0,0,0,"NC","NC","NC","NC","NC","NC","NC","NC","NC","NC","NC","NC","NC","NC","NC","NC","NC","NC","NC","NC","NC","NC","NC","NC","NC","NC","NC","NC","NC","NC","NC","NC","NC","NC","NC","NC","NC","NC","NC","NC","NC","NC","NC","NC","NC","NC","NC","NC","NC","NC","NC","NC","NC","NC","NC","NC","NC","NC","NC","NC","NC"]
[null,"ZIAD MOUSSAOUI Nasser","PT Réserve","Quai A",{"v":0.7142857142857143,"d":"71%"},null,null,1,1,1,1,1,1,1,1,"NC","NC",1,1,"NC","NC",0,0,0,0,"NC","NC","NC","NC","NC","NC","NC","NC","NC","NC","NC","NC","NC","NC","NC","NC","NC","NC","NC","NC","NC","NC","NC","NC","NC","NC","NC","NC","NC","NC","NC","NC","NC","NC","NC","NC","NC","NC","NC","NC","NC","NC","NC","NC","NC","NC","NC","NC","NC","NC","NC","NC","NC","NC","NC","NC","NC","NC","NC","NC","NC"]
[null,"ZIDANI Samir","PT Réserve","Quai A et point M",{"v":0.9090909090909091,"d":"91%"},null,null,1,1,1,1,1,1,1,1,"NC","NC",1,1,"NC","NC","NC","NC","NC",0,"NC","NC","NC","NC","NC","NC","NC","NC","NC","NC","NC","NC","NC","NC","NC","NC","NC","NC","NC","NC","NC","NC","NC","NC","NC","NC","NC","NC","NC","NC","NC","NC","NC","NC","NC","NC","NC","NC","NC","NC","NC","NC","NC","NC","NC","NC","NC","NC","NC","NC","NC","NC","NC","NC","NC","NC","NC","NC","NC","NC","NC"]