{"text_format":"3","workbook":"xlsx","n_sheets":2,"sheets":["Base_Complète","Filtres"],"not_rendered":{"macros":1,"defined_names":2},"read":"whole","date_system":"1900"}

{"sheet":"Base_Complète","index":0,"n_rows":1,"n_cols":104,"rows_kept":1}
["Identifiant","POND","Département","Zone","Voiture_Disposition","Sexe","CSP_Détail","CSP_4tranches","Age_5tranches","Age_3tranches","Age15etplus","Age16etplus","Age18etplus","Internet_Mobile","MOBILES_IDF","UTIL_TC","UTIL_RATP","UTIL_VOITURE","UTIL_VOITUREPASSAGER","UTIL_VOITURECONDUCTEUR","UTIL_COVOITURAGE","UTIL_AUTOPARTAGE","UTIL_VOITURELOCATION","UTIL_SERVICELOCATION","UTIL_2ROUESMOTORISE","UTIL_SERVICESCOOTERS","UTIL_VELIB","UTIL_VELO","UTIL_VELOLOCATION","UTIL_TAXI","UTIL_VTC","UTIL_UBERPOOL","UTIL_SERVICESUBER","UTIL_METRO","UTIL_RER","UTIL_RERAB","UTIL_BP","UTIL_BBRATP","UTIL_BBNONRATP","UTIL_NOCTILIEN","UTIL_TRANSILIEN","UTIL_TRAMWAY","FREQUENCE_TC","FREQUENCE_RATP","FREQUENCE_VOITURE","FREQUENCE_METRO","FREQUENCE_RERAB","FREQUENCE_RERA","FREQUENCE_RERB","FREQUENCE_BP","FREQUENCE_BBRATP","FREQUENCE_NOCTILIEN","FREQUENCE_TRAMWAY","RER_A","RER_B","RER_C","RER_D","RER_E","METRO_1","METRO_2","METRO_3","METRO_3bis","METRO_4","METRO_5","METRO_6","METRO_7","METRO_7bis","METRO_8","METRO_9","METRO_10","METRO_11","METRO_12","METRO_13","METRO_14","TRAM_T1","TRAM_T2","TRAM_T3A","TRAM_T3B","TRAM_T4","TRAM_T5","TRAM_T6","TRAM_T7","TRAM_T8","Multitralité","UTIL_FORFAIT","UTIL_UNITAIRE","UTIL_NAVANNUEL","UTIL_IMAGINER","UTIL_NAVMOIS","UTIL_NAVSEMAINE","UTIL_SOLIDARITEMOIS","UTIL_SOLIDARITESEMAINE","UTIL_AMETHYSTE","UTIL_NAVGRATUITE","UTIL_BILLETOD","UTIL_TICKETACCES","UTIL_TICKETTPLUS","UTIL_MOBILIS","UTIL_JEUNESWE","UTIL_PARISVISITE","UTIL_ORLYBUS","UTIL_ROISSYBUS","UTIL_ORLYVAL","selection"]

{"sheet":"Filtres","index":1,"n_rows":194,"n_cols":5,"rows_kept":194}
[null,"Liste","Colonne","Filtres","Colonne"]
[{"$f":"IFERROR(LEFT(B2,SEARCH(\"_\",B2)-1),\"\")","v":"SEXE"},"SEXE_2","Sexe","Un homme",{"$f":"IFERROR(MATCH(C2,Base_Complète!$1:$1,0),\"\")","v":6}]
[{"$f":"IFERROR(LEFT(B3,SEARCH(\"_\",B3)-1),\"\")","v":"SEXE"},"SEXE_3","Sexe","Une femme",{"$f":"IFERROR(MATCH(C3,Base_Complète!$1:$1,0),\"\")","v":6}]
[{"$f":"IFERROR(LEFT(B4,SEARCH(\"_\",B4)-1),\"\")","v":"Einternet"},"Einternet_2","Internet_Mobile","01 - Oui",{"$f":"IFERROR(MATCH(C4,Base_Complète!$1:$1,0),\"\")","v":14}]
[{"$f":"IFERROR(LEFT(B5,SEARCH(\"_\",B5)-1),\"\")","v":"CSP"},"CSP_3","CSP_Détail","01 - CSP+",{"$f":"IFERROR(MATCH(C5,Base_Complète!$1:$1,0),\"\")","v":7}]
[{"$f":"IFERROR(LEFT(B6,SEARCH(\"_\",B6)-1),\"\")","v":"Age"},"Age_3","Age_5tranches","10-17 ans",{"$f":"IFERROR(MATCH(C6,Base_Complète!$1:$1,0),\"\")","v":9}]
[{"$f":"IFERROR(LEFT(B7,SEARCH(\"_\",B7)-1),\"\")","v":"Age"},"Age_4","Age_5tranches","18-25 ans",{"$f":"IFERROR(MATCH(C7,Base_Complète!$1:$1,0),\"\")","v":9}]
[{"$f":"IFERROR(LEFT(B8,SEARCH(\"_\",B8)-1),\"\")","v":""},{"$nulls":3},{"$f":"IFERROR(MATCH(C8,Base_Complète!$1:$1,0),\"\")","v":""}]
[{"$f":"IFERROR(LEFT(B9,SEARCH(\"_\",B9)-1),\"\")","v":""},{"$nulls":3},{"$f":"IFERROR(MATCH(C9,Base_Complète!$1:$1,0),\"\")","v":""}]
[{"$f":"IFERROR(LEFT(B10,SEARCH(\"_\",B10)-1),\"\")","v":""},{"$nulls":3},{"$f":"IFERROR(MATCH(C10,Base_Complète!$1:$1,0),\"\")","v":""}]
[{"$f":"IFERROR(LEFT(B11,SEARCH(\"_\",B11)-1),\"\")","v":""},{"$nulls":3},{"$f":"IFERROR(MATCH(C11,Base_Complète!$1:$1,0),\"\")","v":""}]
[{"$f":"IFERROR(LEFT(B12,SEARCH(\"_\",B12)-1),\"\")","v":""},{"$nulls":3},{"$f":"IFERROR(MATCH(C12,Base_Complète!$1:$1,0),\"\")","v":""}]
[{"$f":"IFERROR(LEFT(B13,SEARCH(\"_\",B13)-1),\"\")","v":""},{"$nulls":3},{"$f":"IFERROR(MATCH(C13,Base_Complète!$1:$1,0),\"\")","v":""}]
[{"$f":"IFERROR(LEFT(B14,SEARCH(\"_\",B14)-1),\"\")","v":""},{"$nulls":3},{"$f":"IFERROR(MATCH(C14,Base_Complète!$1:$1,0),\"\")","v":""}]
[{"$f":"IFERROR(LEFT(B15,SEARCH(\"_\",B15)-1),\"\")","v":""},{"$nulls":3},{"$f":"IFERROR(MATCH(C15,Base_Complète!$1:$1,0),\"\")","v":""}]
[{"$f":"IFERROR(LEFT(B16,SEARCH(\"_\",B16)-1),\"\")","v":""},{"$nulls":3},{"$f":"IFERROR(MATCH(C16,Base_Complète!$1:$1,0),\"\")","v":""}]
[{"$f":"IFERROR(LEFT(B17,SEARCH(\"_\",B17)-1),\"\")","v":""},{"$nulls":3},{"$f":"IFERROR(MATCH(C17,Base_Complète!$1:$1,0),\"\")","v":""}]
[{"$f":"IFERROR(LEFT(B18,SEARCH(\"_\",B18)-1),\"\")","v":""},{"$nulls":3},{"$f":"IFERROR(MATCH(C18,Base_Complète!$1:$1,0),\"\")","v":""}]
[{"$f":"IFERROR(LEFT(B19,SEARCH(\"_\",B19)-1),\"\")","v":""},{"$nulls":3},{"$f":"IFERROR(MATCH(C19,Base_Complète!$1:$1,0),\"\")","v":""}]
[{"$f":"IFERROR(LEFT(B20,SEARCH(\"_\",B20)-1),\"\")","v":""},{"$nulls":3},{"$f":"IFERROR(MATCH(C20,Base_Complète!$1:$1,0),\"\")","v":""}]
[{"$f":"IFERROR(LEFT(B21,SEARCH(\"_\",B21)-1),\"\")","v":""},{"$nulls":3},{"$f":"IFERROR(MATCH(C21,Base_Complète!$1:$1,0),\"\")","v":""}]
[{"$f":"IFERROR(LEFT(B22,SEARCH(\"_\",B22)-1),\"\")","v":""},{"$nulls":3},{"$f":"IFERROR(MATCH(C22,Base_Complète!$1:$1,0),\"\")","v":""}]
[{"$f":"IFERROR(LEFT(B23,SEARCH(\"_\",B23)-1),\"\")","v":""},{"$nulls":3},{"$f":"IFERROR(MATCH(C23,Base_Complète!$1:$1,0),\"\")","v":""}]
[{"$f":"IFERROR(LEFT(B24,SEARCH(\"_\",B24)-1),\"\")","v":""},{"$nulls":3},{"$f":"IFERROR(MATCH(C24,Base_Complète!$1:$1,0),\"\")","v":""}]
[{"$f":"IFERROR(LEFT(B25,SEARCH(\"_\",B25)-1),\"\")","v":""},{"$nulls":3},{"$f":"IFERROR(MATCH(C25,Base_Complète!$1:$1,0),\"\")","v":""}]
[{"$f":"IFERROR(LEFT(B26,SEARCH(\"_\",B26)-1),\"\")","v":""},{"$nulls":3},{"$f":"IFERROR(MATCH(C26,Base_Complète!$1:$1,0),\"\")","v":""}]
[{"$f":"IFERROR(LEFT(B27,SEARCH(\"_\",B27)-1),\"\")","v":""},{"$nulls":3},{"$f":"IFERROR(MATCH(C27,Base_Complète!$1:$1,0),\"\")","v":""}]
[{"$f":"IFERROR(LEFT(B28,SEARCH(\"_\",B28)-1),\"\")","v":""},{"$nulls":3},{"$f":"IFERROR(MATCH(C28,Base_Complète!$1:$1,0),\"\")","v":""}]
[{"$f":"IFERROR(LEFT(B29,SEARCH(\"_\",B29)-1),\"\")","v":""},{"$nulls":3},{"$f":"IFERROR(MATCH(C29,Base_Complète!$1:$1,0),\"\")","v":""}]
[{"$f":"IFERROR(LEFT(B30,SEARCH(\"_\",B30)-1),\"\")","v":""},{"$nulls":3},{"$f":"IFERROR(MATCH(C30,Base_Complète!$1:$1,0),\"\")","v":""}]
[{"$f":"IFERROR(LEFT(B31,SEARCH(\"_\",B31)-1),\"\")","v":""},{"$nulls":3},{"$f":"IFERROR(MATCH(C31,Base_Complète!$1:$1,0),\"\")","v":""}]
[{"$f":"IFERROR(LEFT(B32,SEARCH(\"_\",B32)-1),\"\")","v":""},{"$nulls":3},{"$f":"IFERROR(MATCH(C32,Base_Complète!$1:$1,0),\"\")","v":""}]
[{"$f":"IFERROR(LEFT(B33,SEARCH(\"_\",B33)-1),\"\")","v":""},{"$nulls":3},{"$f":"IFERROR(MATCH(C33,Base_Complète!$1:$1,0),\"\")","v":""}]
[{"$f":"IFERROR(LEFT(B34,SEARCH(\"_\",B34)-1),\"\")","v":""},{"$nulls":3},{"$f":"IFERROR(MATCH(C34,Base_Complète!$1:$1,0),\"\")","v":""}]
[{"$f":"IFERROR(LEFT(B35,SEARCH(\"_\",B35)-1),\"\")","v":""},{"$nulls":3},{"$f":"IFERROR(MATCH(C35,Base_Complète!$1:$1,0),\"\")","v":""}]
[{"$f":"IFERROR(LEFT(B36,SEARCH(\"_\",B36)-1),\"\")","v":""},{"$nulls":3},{"$f":"IFERROR(MATCH(C36,Base_Complète!$1:$1,0),\"\")","v":""}]
[{"$f":"IFERROR(LEFT(B37,SEARCH(\"_\",B37)-1),\"\")","v":""},{"$nulls":3},{"$f":"IFERROR(MATCH(C37,Base_Complète!$1:$1,0),\"\")","v":""}]
[{"$f":"IFERROR(LEFT(B38,SEARCH(\"_\",B38)-1),\"\")","v":""},{"$nulls":3},{"$f":"IFERROR(MATCH(C38,Base_Complète!$1:$1,0),\"\")","v":""}]
[{"$f":"IFERROR(LEFT(B39,SEARCH(\"_\",B39)-1),\"\")","v":""},{"$nulls":3},{"$f":"IFERROR(MATCH(C39,Base_Complète!$1:$1,0),\"\")","v":""}]
[{"$f":"IFERROR(LEFT(B40,SEARCH(\"_\",B40)-1),\"\")","v":""},{"$nulls":3},{"$f":"IFERROR(MATCH(C40,Base_Complète!$1:$1,0),\"\")","v":""}]
[{"$f":"IFERROR(LEFT(B41,SEARCH(\"_\",B41)-1),\"\")","v":""},{"$nulls":3},{"$f":"IFERROR(MATCH(C41,Base_Complète!$1:$1,0),\"\")","v":""}]
[{"$f":"IFERROR(LEFT(B42,SEARCH(\"_\",B42)-1),\"\")","v":""},{"$nulls":3},{"$f":"IFERROR(MATCH(C42,Base_Complète!$1:$1,0),\"\")","v":""}]
[{"$f":"IFERROR(LEFT(B43,SEARCH(\"_\",B43)-1),\"\")","v":""},{"$nulls":3},{"$f":"IFERROR(MATCH(C43,Base_Complète!$1:$1,0),\"\")","v":""}]
[{"$f":"IFERROR(LEFT(B44,SEARCH(\"_\",B44)-1),\"\")","v":""},{"$nulls":3},{"$f":"IFERROR(MATCH(C44,Base_Complète!$1:$1,0),\"\")","v":""}]
[{"$f":"IFERROR(LEFT(B45,SEARCH(\"_\",B45)-1),\"\")","v":""},{"$nulls":3},{"$f":"IFERROR(MATCH(C45,Base_Complète!$1:$1,0),\"\")","v":""}]
[{"$f":"IFERROR(LEFT(B46,SEARCH(\"_\",B46)-1),\"\")","v":""},{"$nulls":3},{"$f":"IFERROR(MATCH(C46,Base_Complète!$1:$1,0),\"\")","v":""}]
[{"$f":"IFERROR(LEFT(B47,SEARCH(\"_\",B47)-1),\"\")","v":""},{"$nulls":3},{"$f":"IFERROR(MATCH(C47,Base_Complète!$1:$1,0),\"\")","v":""}]
[{"$f":"IFERROR(LEFT(B48,SEARCH(\"_\",B48)-1),\"\")","v":""},{"$nulls":3},{"$f":"IFERROR(MATCH(C48,Base_Complète!$1:$1,0),\"\")","v":""}]
[{"$f":"IFERROR(LEFT(B49,SEARCH(\"_\",B49)-1),\"\")","v":""},{"$nulls":3},{"$f":"IFERROR(MATCH(C49,Base_Complète!$1:$1,0),\"\")","v":""}]
[{"$f":"IFERROR(LEFT(B50,SEARCH(\"_\",B50)-1),\"\")","v":""},{"$nulls":3},{"$f":"IFERROR(MATCH(C50,Base_Complète!$1:$1,0),\"\")","v":""}]
[{"$f":"IFERROR(LEFT(B51,SEARCH(\"_\",B51)-1),\"\")","v":""},{"$nulls":3},{"$f":"IFERROR(MATCH(C51,Base_Complète!$1:$1,0),\"\")","v":""}]
[{"$f":"IFERROR(LEFT(B52,SEARCH(\"_\",B52)-1),\"\")","v":""},{"$nulls":3},{"$f":"IFERROR(MATCH(C52,Base_Complète!$1:$1,0),\"\")","v":""}]
[{"$f":"IFERROR(LEFT(B53,SEARCH(\"_\",B53)-1),\"\")","v":""},{"$nulls":3},{"$f":"IFERROR(MATCH(C53,Base_Complète!$1:$1,0),\"\")","v":""}]
[{"$f":"IFERROR(LEFT(B54,SEARCH(\"_\",B54)-1),\"\")","v":""},{"$nulls":3},{"$f":"IFERROR(MATCH(C54,Base_Complète!$1:$1,0),\"\")","v":""}]
[{"$f":"IFERROR(LEFT(B55,SEARCH(\"_\",B55)-1),\"\")","v":""},{"$nulls":3},{"$f":"IFERROR(MATCH(C55,Base_Complète!$1:$1,0),\"\")","v":""}]
[{"$f":"IFERROR(LEFT(B56,SEARCH(\"_\",B56)-1),\"\")","v":""},{"$nulls":3},{"$f":"IFERROR(MATCH(C56,Base_Complète!$1:$1,0),\"\")","v":""}]
[{"$f":"IFERROR(LEFT(B57,SEARCH(\"_\",B57)-1),\"\")","v":""},{"$nulls":3},{"$f":"IFERROR(MATCH(C57,Base_Complète!$1:$1,0),\"\")","v":""}]
[{"$f":"IFERROR(LEFT(B58,SEARCH(\"_\",B58)-1),\"\")","v":""},{"$nulls":3},{"$f":"IFERROR(MATCH(C58,Base_Complète!$1:$1,0),\"\")","v":""}]
[{"$f":"IFERROR(LEFT(B59,SEARCH(\"_\",B59)-1),\"\")","v":""},{"$nulls":3},{"$f":"IFERROR(MATCH(C59,Base_Complète!$1:$1,0),\"\")","v":""}]
[{"$f":"IFERROR(LEFT(B60,SEARCH(\"_\",B60)-1),\"\")","v":""},{"$nulls":3},{"$f":"IFERROR(MATCH(C60,Base_Complète!$1:$1,0),\"\")","v":""}]
[{"$f":"IFERROR(LEFT(B61,SEARCH(\"_\",B61)-1),\"\")","v":""},{"$nulls":3},{"$f":"IFERROR(MATCH(C61,Base_Complète!$1:$1,0),\"\")","v":""}]
[{"$f":"IFERROR(LEFT(B62,SEARCH(\"_\",B62)-1),\"\")","v":""},{"$nulls":3},{"$f":"IFERROR(MATCH(C62,Base_Complète!$1:$1,0),\"\")","v":""}]
[{"$f":"IFERROR(LEFT(B63,SEARCH(\"_\",B63)-1),\"\")","v":""},{"$nulls":3},{"$f":"IFERROR(MATCH(C63,Base_Complète!$1:$1,0),\"\")","v":""}]
[{"$f":"IFERROR(LEFT(B64,SEARCH(\"_\",B64)-1),\"\")","v":""},{"$nulls":3},{"$f":"IFERROR(MATCH(C64,Base_Complète!$1:$1,0),\"\")","v":""}]
[{"$f":"IFERROR(LEFT(B65,SEARCH(\"_\",B65)-1),\"\")","v":""},{"$nulls":3},{"$f":"IFERROR(MATCH(C65,Base_Complète!$1:$1,0),\"\")","v":""}]
[{"$f":"IFERROR(LEFT(B66,SEARCH(\"_\",B66)-1),\"\")","v":""},{"$nulls":3},{"$f":"IFERROR(MATCH(C66,Base_Complète!$1:$1,0),\"\")","v":""}]
[{"$f":"IFERROR(LEFT(B67,SEARCH(\"_\",B67)-1),\"\")","v":""},{"$nulls":3},{"$f":"IFERROR(MATCH(C67,Base_Complète!$1:$1,0),\"\")","v":""}]
[{"$f":"IFERROR(LEFT(B68,SEARCH(\"_\",B68)-1),\"\")","v":""},{"$nulls":3},{"$f":"IFERROR(MATCH(C68,Base_Complète!$1:$1,0),\"\")","v":""}]
[{"$f":"IFERROR(LEFT(B69,SEARCH(\"_\",B69)-1),\"\")","v":""},{"$nulls":3},{"$f":"IFERROR(MATCH(C69,Base_Complète!$1:$1,0),\"\")","v":""}]
[{"$f":"IFERROR(LEFT(B70,SEARCH(\"_\",B70)-1),\"\")","v":""},{"$nulls":3},{"$f":"IFERROR(MATCH(C70,Base_Complète!$1:$1,0),\"\")","v":""}]
[{"$f":"IFERROR(LEFT(B71,SEARCH(\"_\",B71)-1),\"\")","v":""},{"$nulls":3},{"$f":"IFERROR(MATCH(C71,Base_Complète!$1:$1,0),\"\")","v":""}]
[{"$f":"IFERROR(LEFT(B72,SEARCH(\"_\",B72)-1),\"\")","v":""},{"$nulls":3},{"$f":"IFERROR(MATCH(C72,Base_Complète!$1:$1,0),\"\")","v":""}]
[{"$f":"IFERROR(LEFT(B73,SEARCH(\"_\",B73)-1),\"\")","v":""},{"$nulls":3},{"$f":"IFERROR(MATCH(C73,Base_Complète!$1:$1,0),\"\")","v":""}]
[{"$f":"IFERROR(LEFT(B74,SEARCH(\"_\",B74)-1),\"\")","v":""},{"$nulls":3},{"$f":"IFERROR(MATCH(C74,Base_Complète!$1:$1,0),\"\")","v":""}]
[{"$f":"IFERROR(LEFT(B75,SEARCH(\"_\",B75)-1),\"\")","v":""},{"$nulls":3},{"$f":"IFERROR(MATCH(C75,Base_Complète!$1:$1,0),\"\")","v":""}]
[{"$f":"IFERROR(LEFT(B76,SEARCH(\"_\",B76)-1),\"\")","v":""},{"$nulls":3},{"$f":"IFERROR(MATCH(C76,Base_Complète!$1:$1,0),\"\")","v":""}]
[{"$f":"IFERROR(LEFT(B77,SEARCH(\"_\",B77)-1),\"\")","v":""},{"$nulls":3},{"$f":"IFERROR(MATCH(C77,Base_Complète!$1:$1,0),\"\")","v":""}]
[{"$f":"IFERROR(LEFT(B78,SEARCH(\"_\",B78)-1),\"\")","v":""},{"$nulls":3},{"$f":"IFERROR(MATCH(C78,Base_Complète!$1:$1,0),\"\")","v":""}]
[{"$f":"IFERROR(LEFT(B79,SEARCH(\"_\",B79)-1),\"\")","v":""},{"$nulls":3},{"$f":"IFERROR(MATCH(C79,Base_Complète!$1:$1,0),\"\")","v":""}]
[{"$f":"IFERROR(LEFT(B80,SEARCH(\"_\",B80)-1),\"\")","v":""},{"$nulls":3},{"$f":"IFERROR(MATCH(C80,Base_Complète!$1:$1,0),\"\")","v":""}]
[{"$f":"IFERROR(LEFT(B81,SEARCH(\"_\",B81)-1),\"\")","v":""},{"$nulls":3},{"$f":"IFERROR(MATCH(C81,Base_Complète!$1:$1,0),\"\")","v":""}]
[{"$f":"IFERROR(LEFT(B82,SEARCH(\"_\",B82)-1),\"\")","v":""},{"$nulls":3},{"$f":"IFERROR(MATCH(C82,Base_Complète!$1:$1,0),\"\")","v":""}]
[{"$f":"IFERROR(LEFT(B83,SEARCH(\"_\",B83)-1),\"\")","v":""},{"$nulls":3},{"$f":"IFERROR(MATCH(C83,Base_Complète!$1:$1,0),\"\")","v":""}]
[{"$f":"IFERROR(LEFT(B84,SEARCH(\"_\",B84)-1),\"\")","v":""},{"$nulls":3},{"$f":"IFERROR(MATCH(C84,Base_Complète!$1:$1,0),\"\")","v":""}]
[{"$f":"IFERROR(LEFT(B85,SEARCH(\"_\",B85)-1),\"\")","v":""},{"$nulls":3},{"$f":"IFERROR(MATCH(C85,Base_Complète!$1:$1,0),\"\")","v":""}]
[{"$f":"IFERROR(LEFT(B86,SEARCH(\"_\",B86)-1),\"\")","v":""},{"$nulls":3},{"$f":"IFERROR(MATCH(C86,Base_Complète!$1:$1,0),\"\")","v":""}]
[{"$f":"IFERROR(LEFT(B87,SEARCH(\"_\",B87)-1),\"\")","v":""},{"$nulls":3},{"$f":"IFERROR(MATCH(C87,Base_Complète!$1:$1,0),\"\")","v":""}]
[{"$f":"IFERROR(LEFT(B88,SEARCH(\"_\",B88)-1),\"\")","v":""},{"$nulls":3},{"$f":"IFERROR(MATCH(C88,Base_Complète!$1:$1,0),\"\")","v":""}]
[{"$f":"IFERROR(LEFT(B89,SEARCH(\"_\",B89)-1),\"\")","v":""},{"$nulls":3},{"$f":"IFERROR(MATCH(C89,Base_Complète!$1:$1,0),\"\")","v":""}]
[{"$f":"IFERROR(LEFT(B90,SEARCH(\"_\",B90)-1),\"\")","v":""},{"$nulls":3},{"$f":"IFERROR(MATCH(C90,Base_Complète!$1:$1,0),\"\")","v":""}]
[{"$f":"IFERROR(LEFT(B91,SEARCH(\"_\",B91)-1),\"\")","v":""},{"$nulls":3},{"$f":"IFERROR(MATCH(C91,Base_Complète!$1:$1,0),\"\")","v":""}]
[{"$f":"IFERROR(LEFT(B92,SEARCH(\"_\",B92)-1),\"\")","v":""},{"$nulls":3},{"$f":"IFERROR(MATCH(C92,Base_Complète!$1:$1,0),\"\")","v":""}]
[{"$f":"IFERROR(LEFT(B93,SEARCH(\"_\",B93)-1),\"\")","v":""},{"$nulls":3},{"$f":"IFERROR(MATCH(C93,Base_Complète!$1:$1,0),\"\")","v":""}]
[{"$f":"IFERROR(LEFT(B94,SEARCH(\"_\",B94)-1),\"\")","v":""},{"$nulls":3},{"$f":"IFERROR(MATCH(C94,Base_Complète!$1:$1,0),\"\")","v":""}]
[{"$f":"IFERROR(LEFT(B95,SEARCH(\"_\",B95)-1),\"\")","v":""},{"$nulls":3},{"$f":"IFERROR(MATCH(C95,Base_Complète!$1:$1,0),\"\")","v":""}]
[{"$f":"IFERROR(LEFT(B96,SEARCH(\"_\",B96)-1),\"\")","v":""},{"$nulls":3},{"$f":"IFERROR(MATCH(C96,Base_Complète!$1:$1,0),\"\")","v":""}]
[{"$f":"IFERROR(LEFT(B97,SEARCH(\"_\",B97)-1),\"\")","v":""},{"$nulls":3},{"$f":"IFERROR(MATCH(C97,Base_Complète!$1:$1,0),\"\")","v":""}]
[{"$f":"IFERROR(LEFT(B98,SEARCH(\"_\",B98)-1),\"\")","v":""},{"$nulls":3},{"$f":"IFERROR(MATCH(C98,Base_Complète!$1:$1,0),\"\")","v":""}]
[{"$f":"IFERROR(LEFT(B99,SEARCH(\"_\",B99)-1),\"\")","v":""},{"$nulls":3},{"$f":"IFERROR(MATCH(C99,Base_Complète!$1:$1,0),\"\")","v":""}]
[{"$f":"IFERROR(LEFT(B100,SEARCH(\"_\",B100)-1),\"\")","v":""},{"$nulls":3},{"$f":"IFERROR(MATCH(C100,Base_Complète!$1:$1,0),\"\")","v":""}]
[{"$f":"IFERROR(LEFT(B101,SEARCH(\"_\",B101)-1),\"\")","v":""},{"$nulls":3},{"$f":"IFERROR(MATCH(C101,Base_Complète!$1:$1,0),\"\")","v":""}]
[{"$f":"IFERROR(LEFT(B102,SEARCH(\"_\",B102)-1),\"\")","v":""},{"$nulls":3},{"$f":"IFERROR(MATCH(C102,Base_Complète!$1:$1,0),\"\")","v":""}]
[{"$f":"IFERROR(LEFT(B103,SEARCH(\"_\",B103)-1),\"\")","v":""},{"$nulls":3},{"$f":"IFERROR(MATCH(C103,Base_Complète!$1:$1,0),\"\")","v":""}]
[{"$f":"IFERROR(LEFT(B104,SEARCH(\"_\",B104)-1),\"\")","v":""},{"$nulls":3},{"$f":"IFERROR(MATCH(C104,Base_Complète!$1:$1,0),\"\")","v":""}]
[{"$f":"IFERROR(LEFT(B105,SEARCH(\"_\",B105)-1),\"\")","v":""},{"$nulls":3},{"$f":"IFERROR(MATCH(C105,Base_Complète!$1:$1,0),\"\")","v":""}]
[{"$f":"IFERROR(LEFT(B106,SEARCH(\"_\",B106)-1),\"\")","v":""},{"$nulls":3},{"$f":"IFERROR(MATCH(C106,Base_Complète!$1:$1,0),\"\")","v":""}]
[{"$f":"IFERROR(LEFT(B107,SEARCH(\"_\",B107)-1),\"\")","v":""},{"$nulls":3},{"$f":"IFERROR(MATCH(C107,Base_Complète!$1:$1,0),\"\")","v":""}]
[{"$f":"IFERROR(LEFT(B108,SEARCH(\"_\",B108)-1),\"\")","v":""},{"$nulls":3},{"$f":"IFERROR(MATCH(C108,Base_Complète!$1:$1,0),\"\")","v":""}]
[{"$f":"IFERROR(LEFT(B109,SEARCH(\"_\",B109)-1),\"\")","v":""},{"$nulls":3},{"$f":"IFERROR(MATCH(C109,Base_Complète!$1:$1,0),\"\")","v":""}]
[{"$f":"IFERROR(LEFT(B110,SEARCH(\"_\",B110)-1),\"\")","v":""},{"$nulls":3},{"$f":"IFERROR(MATCH(C110,Base_Complète!$1:$1,0),\"\")","v":""}]
[{"$f":"IFERROR(LEFT(B111,SEARCH(\"_\",B111)-1),\"\")","v":""},{"$nulls":3},{"$f":"IFERROR(MATCH(C111,Base_Complète!$1:$1,0),\"\")","v":""}]
[{"$f":"IFERROR(LEFT(B112,SEARCH(\"_\",B112)-1),\"\")","v":""},{"$nulls":3},{"$f":"IFERROR(MATCH(C112,Base_Complète!$1:$1,0),\"\")","v":""}]
[{"$f":"IFERROR(LEFT(B113,SEARCH(\"_\",B113)-1),\"\")","v":""},{"$nulls":3},{"$f":"IFERROR(MATCH(C113,Base_Complète!$1:$1,0),\"\")","v":""}]
[{"$f":"IFERROR(LEFT(B114,SEARCH(\"_\",B114)-1),\"\")","v":""},{"$nulls":3},{"$f":"IFERROR(MATCH(C114,Base_Complète!$1:$1,0),\"\")","v":""}]
[{"$f":"IFERROR(LEFT(B115,SEARCH(\"_\",B115)-1),\"\")","v":""},{"$nulls":3},{"$f":"IFERROR(MATCH(C115,Base_Complète!$1:$1,0),\"\")","v":""}]
[{"$f":"IFERROR(LEFT(B116,SEARCH(\"_\",B116)-1),\"\")","v":""},{"$nulls":3},{"$f":"IFERROR(MATCH(C116,Base_Complète!$1:$1,0),\"\")","v":""}]
[{"$f":"IFERROR(LEFT(B117,SEARCH(\"_\",B117)-1),\"\")","v":""},{"$nulls":3},{"$f":"IFERROR(MATCH(C117,Base_Complète!$1:$1,0),\"\")","v":""}]
[{"$f":"IFERROR(LEFT(B118,SEARCH(\"_\",B118)-1),\"\")","v":""},{"$nulls":3},{"$f":"IFERROR(MATCH(C118,Base_Complète!$1:$1,0),\"\")","v":""}]
[{"$f":"IFERROR(LEFT(B119,SEARCH(\"_\",B119)-1),\"\")","v":""},{"$nulls":3},{"$f":"IFERROR(MATCH(C119,Base_Complète!$1:$1,0),\"\")","v":""}]
[{"$f":"IFERROR(LEFT(B120,SEARCH(\"_\",B120)-1),\"\")","v":""},{"$nulls":3},{"$f":"IFERROR(MATCH(C120,Base_Complète!$1:$1,0),\"\")","v":""}]
{"$rows_left_out":74}