{"text_format":"3","workbook":"xlsx","n_sheets":6,"sheets":["calculs - masquer","planning pers - masquer","plan_pers_vac","trame_planning_machine","trame_planning_personnel","roulement_vacances"],"not_rendered":{"macros":1,"defined_names":2},"read":"whole","date_system":"1900"}

{"sheet":"calculs - masquer","index":0,"n_rows":81,"n_cols":27,"rows_kept":81,"hidden":true,"merged":[[0,2,0,12],[0,14,0,15],[0,22,0,26],[34,0,34,1]]}
["horaires",null,"mise en place date - semaine, jour, mois, année - mise en forme we",{"$nulls":11},"Initiales",null,null,"formule colonne DOUB planning",null,"horaires en cas maintenance - intitulé",null,null,"Vacances scolaires"]
["P-A",null,"n° mois",{"$f":"TEXT(\"1/\"&trame_planning_machine!$D$2,\"m\")","v":"1"},{"$f":"IF(trame_planning_machine!$D$1=\"\",\"\",IF($F2=\"\",\"\",DATE(trame_planning_machine!$D$1,$D$2,$F2)))","v":"2016-01-01"},1,{"$f":"IF($E2<>\"\",(IF(WEEKDAY($E2,2)>=6,\"we\",\"\")),\"we\")","v":""},{"$f":"IF(E2=\"\",\"\",UPPER(LEFT(TEXT(WEEKDAY($E2),\"jjjj\"),2))&\" \"&$F2)","v":"VE 1"},{"$f":"IF(F2=\"\",\"\",LEFT(TEXT(WEEKDAY($E2),\"jjjj\"),2)&\" \"&$F2)","v":"ve 1"},{"$f":"E2","v":"2016-01-01"},{"$f":"IF(ISNA(MATCH($J2,$B$43:$B$54,0)),\"\",\"f\")","v":"f"},{"$f":"IF(J2=\"\",\"\",IF(COUNTIF($W$7:$AA$81,J2)>0,\"PRESENT\",\"ABSENT\"))","v":"PRESENT"},{"$f":"IF(L2=\"PRESENT\",\"v\",\"\")","v":"v"},{"$nulls":4},"=SI('planning pers - masquer'!BG2=\"DOUB\";\"AG \";\"\")&SI('planning pers - masquer'!BG35=\"DOUB\";\"CB \";\"\")&SI('planning pers - masquer'!BH68=\"DOUB\";\"CC \";\"\")&SI('planning pers - masquer'!BG101=\"DOUB\";\"CG \";\"\")&SI('planning pers - masquer'!BG134=\"DOUB\";\"HV \";\"\")&SI('planning pers - masquer'!BG167=\"DOUB\";\"IP \";\"\")&SI('planning pers - masquer'!BG200=\"DOUB\";\"MG \";\"\")&SI('planning pers - masquer'!BG233=\"DOUB\";\"ML \";\"\")&SI('planning pers - masquer'!BG266=\"DOUB\";\"MOM \";\"\")&SI('planning pers - masquer'!BG299=\"DOUB\";\"MP \";\"\")&SI('planning pers - masquer'!BG332=\"DOUB\";\"OC \";\"\")&SI('planning pers - masquer'!BG365=\"DOUB\";\"PW \";\"\")&SI('planning pers - masquer'!BG398=\"DOUB\";\"RN \";\"\")&SI('planning pers - masquer'!BG431=\"DOUB\";\"SR \";\"\")&SI('planning pers - masquer'!BG464=\"DOUB\";\"TS \";\"\")&SI('planning pers - masquer'!BG497=\"DOUB\";\"VC \";\"\")",null,"MAIN",null,null,"Toussaint","Noël","Vac d'hiver","Vac de printemps","Vac d'été"]
["P-B",null,"nb jour/mois",{"$f":"IF(trame_planning_machine!$D$1=\"\",\"\",DAY(DATE(trame_planning_machine!$D$1,$D$2+1,0)))","v":31},{"$f":"IF(trame_planning_machine!$D$1=\"\",\"\",IF($F3=\"\",\"\",DATE(trame_planning_machine!$D$1,$D$2,$F3)))","v":"2016-01-02"},{"$f":"IF($F2>=$D$3,\"\",$F2+1)","v":2},{"$f":"IF($E3<>\"\",(IF(WEEKDAY($E3,2)>=6,\"we\",\"\")),\"we\")","v":"we"},{"$f":"IF(E3=\"\",\"\",UPPER(LEFT(TEXT(WEEKDAY($E3),\"jjjj\"),2))&\" \"&$F3)","v":"SA 2"},{"$f":"IF(F3=\"\",\"\",LEFT(TEXT(WEEKDAY($E3),\"jjjj\"),2)&\" \"&$F3)","v":"sa 2"},{"$f":"E3","v":"2016-01-02"},{"$f":"IF(ISNA(MATCH($J3,$B$43:$B$54,0)),\"\",\"f\")","v":""},{"$f":"IF(J3=\"\",\"\",IF(COUNTIF($W$7:$AA$81,J3)>0,\"PRESENT\",\"ABSENT\"))","v":"PRESENT"},{"$f":"IF(L3=\"PRESENT\",\"v\",\"\")","v":"v"},{"$nulls":6},"F",null,"durée :  ",{"$f":"W5-W4","v":4},{"$f":"X5-X4","v":9},-18,3,15]
["P-C",{"$nulls":3},{"$f":"IF(trame_planning_machine!$D$1=\"\",\"\",IF($F4=\"\",\"\",DATE(trame_planning_machine!$D$1,$D$2,$F4)))","v":"2016-01-03"},3,"we","DI 3","di 3","2016-01-03","","PRESENT","v",null,"a","CB",{"$nulls":5},"du :  ","2016-01-01","2016-02-01","2016-03-02","2016-04-05","2016-05-03"]
["P-D",{"$nulls":3},{"$f":"IF(trame_planning_machine!$D$1=\"\",\"\",IF($F5=\"\",\"\",DATE(trame_planning_machine!$D$1,$D$2,$F5)))","v":"2016-01-04"},4,"","LU 4","lu 4","2016-01-04","","PRESENT","v",null,"b","CC",null,"formule colonne \"manip restant\"",{"$nulls":3},"au :  ","2016-01-05","2016-02-10","2016-02-13","2016-04-08","2016-05-18"]
["P-E",{"$nulls":3},{"$f":"IF(trame_planning_machine!$D$1=\"\",\"\",IF($F6=\"\",\"\",DATE(trame_planning_machine!$D$1,$D$2,$F6)))","v":"2016-01-05"},5,"","MA 5","ma 5","2016-01-05","","PRESENT","v",null,"c","VC",null,"=SI(NB.SI(D6:AB6;\"AG\");\"\";\"AG \")&SI(NB.SI(D6:AB6;\"CB\");\"\";\"CB \")&SI(NB.SI(D6:AB6;\"CC\");\"\";\"CC \")&SI(NB.SI(D6:AB6;\"CG\");\"\";\"CG \")&SI(NB.SI(D6:AB6;\"HV\");\"\";\"HV \")&SI(NB.SI(D6:AB6;\"IP\");\"\";\"IP \")&SI(NB.SI(D6:AB6;\"MG\");\"\";\"MG \")&SI(NB.SI(D6:AB6;\"ML\");\"\";\"ML \")&SI(NB.SI(D6:AB6;\"MOM\");\"\";\"MOM \")&SI(NB.SI(D6:AB6;\"MP\");\"\";\"MP \")&SI(NB.SI(D6:AB6;\"OC\");\"\";\"OC \")&SI(NB.SI(D6:AB6;\"PW\");\"\";\"PW \")&SI(NB.SI(D6:AB6;\"RN\");\"\";\"RN \")&SI(NB.SI(D6:AB6;\"SR\");\"\";\"SR \")&SI(NB.SI(D6:AB6;\"TS\");\"\";\"TS \")&SI(NB.SI(D6:AB6;\"VC\");\"\";\"VC\")",{"$nulls":4},"http://www.education.gouv.fr/pid25058/le-calendrier-scolaire.html?annee=159&zone=0&search_input=75000"]
["T-A",{"$nulls":3},{"$f":"IF(trame_planning_machine!$D$1=\"\",\"\",IF($F7=\"\",\"\",DATE(trame_planning_machine!$D$1,$D$2,$F7)))","v":"2016-01-06"},6,"","ME 6","me 6","2016-01-06","","ABSENT","",null,"d","OC",{"$nulls":6},{"$f":"W4","v":"2016-01-01"},{"$f":"X4","v":"2016-02-01"},"2016-03-02","2016-04-05","2016-05-03"]
["T-B",{"$nulls":3},{"$f":"IF(trame_planning_machine!$D$1=\"\",\"\",IF($F8=\"\",\"\",DATE(trame_planning_machine!$D$1,$D$2,$F8)))","v":"2016-01-07"},7,"","JE 7","je 7","2016-01-07","","ABSENT","",null,"e","MP",{"$nulls":6},{"$f":"IF(W7=\"\",\"\",IF(W7=$W$5,\"\",W7+1))","v":"2016-01-02"},{"$f":"IF(X7=\"\",\"\",IF(X7=$X$5,\"\",X7+1))","v":"2016-02-02"},{"$f":"IF(Y7=\"\",\"\",IF(Y7=$Y$5,\"\",Y7+1))","v":"2016-03-03"},{"$f":"IF(Z7=\"\",\"\",IF(Z7=$Z$5,\"\",Z7+1))","v":"2016-04-06"},{"$f":"IF(AA7=\"\",\"\",IF(AA7=$AA$5,\"\",AA7+1))","v":"2016-05-04"}]
["T-C",{"$nulls":3},{"$f":"IF(trame_planning_machine!$D$1=\"\",\"\",IF($F9=\"\",\"\",DATE(trame_planning_machine!$D$1,$D$2,$F9)))","v":"2016-01-08"},8,"","VE 8","ve 8","2016-01-08","","ABSENT","",null,"f","MG",{"$nulls":6},{"$f":"IF(W8=\"\",\"\",IF(W8=$W$5,\"\",W8+1))","v":"2016-01-03"},{"$f":"IF(X8=\"\",\"\",IF(X8=$X$5,\"\",X8+1))","v":"2016-02-03"},{"$f":"IF(Y8=\"\",\"\",IF(Y8=$Y$5,\"\",Y8+1))","v":"2016-03-04"},{"$f":"IF(Z8=\"\",\"\",IF(Z8=$Z$5,\"\",Z8+1))","v":"2016-04-07"},{"$f":"IF(AA8=\"\",\"\",IF(AA8=$AA$5,\"\",AA8+1))","v":"2016-05-05"}]
["T-D",{"$nulls":3},{"$f":"IF(trame_planning_machine!$D$1=\"\",\"\",IF($F10=\"\",\"\",DATE(trame_planning_machine!$D$1,$D$2,$F10)))","v":"2016-01-09"},9,"we","SA 9","sa 9","2016-01-09","","ABSENT","",null,"g","CG",{"$nulls":6},"2016-01-04","2016-02-04","2016-03-05","2016-04-08","2016-05-06"]
["T-E",{"$nulls":3},{"$f":"IF(trame_planning_machine!$D$1=\"\",\"\",IF($F11=\"\",\"\",DATE(trame_planning_machine!$D$1,$D$2,$F11)))","v":"2016-01-10"},10,"we","DI 10","di 10","2016-01-10","","ABSENT","",null,"h","AG",{"$nulls":6},"2016-01-05","2016-02-05","2016-03-06","","2016-05-07"]
["SCA",{"$nulls":3},{"$f":"IF(trame_planning_machine!$D$1=\"\",\"\",IF($F12=\"\",\"\",DATE(trame_planning_machine!$D$1,$D$2,$F12)))","v":"2016-01-11"},11,"","LU 11","lu 11","2016-01-11","","ABSENT","",null,"i","ML",{"$nulls":6},"","2016-02-06","2016-03-07","","2016-05-08"]
["PHY",{"$nulls":3},{"$f":"IF(trame_planning_machine!$D$1=\"\",\"\",IF($F13=\"\",\"\",DATE(trame_planning_machine!$D$1,$D$2,$F13)))","v":"2016-01-12"},12,"","MA 12","ma 12","2016-01-12","","ABSENT","",null,"j","MOM",{"$nulls":6},"","2016-02-07","2016-03-08","","2016-05-09"]
["CP",{"$nulls":3},{"$f":"IF(trame_planning_machine!$D$1=\"\",\"\",IF($F14=\"\",\"\",DATE(trame_planning_machine!$D$1,$D$2,$F14)))","v":"2016-01-13"},13,"","ME 13","me 13","2016-01-13","","ABSENT","",null,"k","RN",{"$nulls":6},"","2016-02-08","2016-03-09","","2016-05-10"]
["MAIN",{"$nulls":3},{"$f":"IF(trame_planning_machine!$D$1=\"\",\"\",IF($F15=\"\",\"\",DATE(trame_planning_machine!$D$1,$D$2,$F15)))","v":"2016-01-14"},14,"","JE 14","je 14","2016-01-14","","ABSENT","",null,"l","IP",{"$nulls":6},"","2016-02-09","2016-03-10","","2016-05-11"]
["FORM",{"$nulls":3},{"$f":"IF(trame_planning_machine!$D$1=\"\",\"\",IF($F16=\"\",\"\",DATE(trame_planning_machine!$D$1,$D$2,$F16)))","v":"2016-01-15"},15,"","VE 15","ve 15","2016-01-15","","ABSENT","",null,"m","SR",{"$nulls":6},"","2016-02-10","2016-03-11","","2016-05-12"]
["DOUB",{"$nulls":3},{"$f":"IF(trame_planning_machine!$D$1=\"\",\"\",IF($F17=\"\",\"\",DATE(trame_planning_machine!$D$1,$D$2,$F17)))","v":"2016-01-16"},16,"we","SA 16","sa 16","2016-01-16","","ABSENT","",null,"n","TS",{"$nulls":6},"","","2016-03-12","","2016-05-13"]
[{"$nulls":4},{"$f":"IF(trame_planning_machine!$D$1=\"\",\"\",IF($F18=\"\",\"\",DATE(trame_planning_machine!$D$1,$D$2,$F18)))","v":"2016-01-17"},17,"we","DI 17","di 17","2016-01-17","","ABSENT","",null,"o","HV",{"$nulls":6},"","","2016-03-13","","2016-05-14"]
[{"$nulls":4},{"$f":"IF(trame_planning_machine!$D$1=\"\",\"\",IF($F19=\"\",\"\",DATE(trame_planning_machine!$D$1,$D$2,$F19)))","v":"2016-01-18"},18,"","LU 18","lu 18","2016-01-18","","ABSENT","",null,"p","PW",{"$nulls":6},"","","2016-03-14","","2016-05-15"]
[{"$nulls":4},{"$f":"IF(trame_planning_machine!$D$1=\"\",\"\",IF($F20=\"\",\"\",DATE(trame_planning_machine!$D$1,$D$2,$F20)))","v":"2016-01-19"},19,"","MA 19","ma 19","2016-01-19","","ABSENT","",{"$nulls":9},"","","2016-03-15","","2016-05-16"]
["MAIN",{"$nulls":3},{"$f":"IF(trame_planning_machine!$D$1=\"\",\"\",IF($F21=\"\",\"\",DATE(trame_planning_machine!$D$1,$D$2,$F21)))","v":"2016-01-20"},20,"","ME 20","me 20","2016-01-20","","ABSENT","",{"$nulls":9},"","","2016-03-16","","2016-05-17"]
["F",{"$nulls":3},{"$f":"IF(trame_planning_machine!$D$1=\"\",\"\",IF($F22=\"\",\"\",DATE(trame_planning_machine!$D$1,$D$2,$F22)))","v":"2016-01-21"},21,"","JE 21","je 21","2016-01-21","","ABSENT","",{"$nulls":9},"","","2016-03-17","","2016-05-18"]
[{"$nulls":4},{"$f":"IF(trame_planning_machine!$D$1=\"\",\"\",IF($F23=\"\",\"\",DATE(trame_planning_machine!$D$1,$D$2,$F23)))","v":"2016-01-22"},22,"","VE 22","ve 22","2016-01-22","","ABSENT","",{"$nulls":9},"","","2016-03-18","",""]
[{"$nulls":4},{"$f":"IF(trame_planning_machine!$D$1=\"\",\"\",IF($F24=\"\",\"\",DATE(trame_planning_machine!$D$1,$D$2,$F24)))","v":"2016-01-23"},23,"we","SA 23","sa 23","2016-01-23","","ABSENT","",{"$nulls":9},"","","2016-03-19","",""]
[{"$nulls":4},{"$f":"IF(trame_planning_machine!$D$1=\"\",\"\",IF($F25=\"\",\"\",DATE(trame_planning_machine!$D$1,$D$2,$F25)))","v":"2016-01-24"},24,"we","DI 24","di 24","2016-01-24","","ABSENT","",{"$nulls":9},"","","2016-03-20","",""]
[{"$nulls":4},{"$f":"IF(trame_planning_machine!$D$1=\"\",\"\",IF($F26=\"\",\"\",DATE(trame_planning_machine!$D$1,$D$2,$F26)))","v":"2016-01-25"},25,"","LU 25","lu 25","2016-01-25","","ABSENT","",{"$nulls":9},"","","2016-03-21","",""]
[{"$nulls":4},{"$f":"IF(trame_planning_machine!$D$1=\"\",\"\",IF($F27=\"\",\"\",DATE(trame_planning_machine!$D$1,$D$2,$F27)))","v":"2016-01-26"},26,"","MA 26","ma 26","2016-01-26","","ABSENT","",{"$nulls":9},{"$f":"IF(W26=\"\",\"\",IF(W26=$W$5,\"\",W26+1))","v":""},{"$f":"IF(X26=\"\",\"\",IF(X26=$X$5,\"\",X26+1))","v":""},{"$f":"IF(Y26=\"\",\"\",IF(Y26=$Y$5,\"\",Y26+1))","v":"2016-03-22"},{"$f":"IF(Z26=\"\",\"\",IF(Z26=$Z$5,\"\",Z26+1))","v":""},""]
[{"$nulls":4},{"$f":"IF(trame_planning_machine!$D$1=\"\",\"\",IF($F28=\"\",\"\",DATE(trame_planning_machine!$D$1,$D$2,$F28)))","v":"2016-01-27"},27,"","ME 27","me 27","2016-01-27","","ABSENT","",{"$nulls":9},"","","2016-03-23","",""]
[{"$nulls":4},{"$f":"IF(trame_planning_machine!$D$1=\"\",\"\",IF($F29=\"\",\"\",DATE(trame_planning_machine!$D$1,$D$2,$F29)))","v":"2016-01-28"},28,"","JE 28","je 28","2016-01-28","","ABSENT","",{"$nulls":9},"","","2016-03-24","",""]
[{"$nulls":4},{"$f":"IF(trame_planning_machine!$D$1=\"\",\"\",IF($F30=\"\",\"\",DATE(trame_planning_machine!$D$1,$D$2,$F30)))","v":"2016-01-29"},29,"","VE 29","ve 29","2016-01-29","","ABSENT","",{"$nulls":9},"","","2016-03-25","",""]
[{"$nulls":4},{"$f":"IF(trame_planning_machine!$D$1=\"\",\"\",IF($F31=\"\",\"\",DATE(trame_planning_machine!$D$1,$D$2,$F31)))","v":"2016-01-30"},30,"we","SA 30","sa 30","2016-01-30","","ABSENT","",{"$nulls":9},"","","2016-03-26","",""]
[{"$nulls":4},{"$f":"IF(trame_planning_machine!$D$1=\"\",\"\",IF($F32=\"\",\"\",DATE(trame_planning_machine!$D$1,$D$2,$F32)))","v":"2016-01-31"},31,"we","DI 31","di 31","2016-01-31",{"$f":"IF(ISNA(MATCH($J32,$B$43:$B$54,0)),\"\",\"f\")","v":""},"ABSENT","",{"$nulls":9},"","","2016-03-27","",""]
[{"$nulls":22},"","","2016-03-28","",""]
[{"$nulls":22},"","","2016-03-29","",""]
["jours feriés à l'année",{"$nulls":21},"","","2016-03-30","",""]
[{"$f":"\"01/01/\"&trame_planning_machine!AO1","v":"01/01/2016"},"date de référence",{"$nulls":20},"","","2016-03-31","",""]
[{"$nulls":22},"","","2016-04-01","",""]
[{"$nulls":22},"","","2016-04-02","",""]
[{"$nulls":22},"","","2016-04-03","",""]
[{"$nulls":22},"","","2016-04-04","",""]
[{"$nulls":22},"","","2016-04-05","",""]
[{"$f":"IF(ISNA(MATCH(A34,$B$34:$B$42,0)),\"\",1)","v":""},{"$f":"trame_planning_machine!AO1","v":"2016"},{"$nulls":20},"","","2016-04-06","",""]
["Premier de l'an",{"$f":"DATE(B42,1,1)","v":"2016-01-01"},{"$nulls":20},"","","2016-04-07","",""]
["Lundi de Pâques",{"$f":"B54+1","v":"2016-03-28"},{"$nulls":20},"","","2016-04-08","",""]
["Fête du travail",{"$f":"DATE(B42,5,1)","v":"2016-05-01"},{"$nulls":20},"","","2016-04-09","",""]
["Victoire de 1945",{"$f":"DATE(B42,5,8)","v":"2016-05-08"},{"$nulls":20},"","","2016-04-10","",""]
["Ascension",{"$f":"B54+39","v":"2016-05-05"},{"$nulls":20},"","","2016-04-11","",""]
["Pentecôte",{"$f":"B54+50","v":"2016-05-16"},{"$nulls":20},"","","2016-04-12","",""]
["Fête nationale",{"$f":"DATE(B42,7,14)","v":"2016-07-14"},{"$nulls":20},"","","2016-04-13","",""]
["Assomption",{"$f":"DATE(B42,8,15)","v":"2016-08-15"},{"$nulls":20},"","","2016-04-14","",""]
["Toussaint",{"$f":"DATE(B42,11,1)","v":"2016-11-01"},{"$nulls":20},"","","2016-04-15","",""]
["Armistice",{"$f":"DATE(B42,11,11)","v":"2016-11-11"},{"$nulls":20},"","","2016-04-16","",""]
["Noël",{"$f":"DATE(B42,12,25)","v":"2016-12-25"},{"$nulls":20},"","","2016-04-17","",""]
["Pâques",{"$f":"DATE(B42,IF((25-MOD((11*MOD(B42-1900,19)+4-INT((7*MOD(B42-1900,19)+1)/19)),29)-MOD(B42-1900+INT((B42-1900)/4)+31-MOD((11*MOD(B42-1900,19)+4-INT((7*MOD(B42-1900,19)+1)/19)),29),7))>0,4,3),IF((25-MOD((11*MOD(B42-1900,19)+4-INT((7*MOD(B42-1900,19)+1)/19)),29)-MOD(B42-1900+INT((B42-1900)/4)+31-MOD((11*MOD(B42-1900,19)+4-INT((7*MOD(B42-1900,19)+1)/19)),29),7))>0,(25-MOD((11*MOD(B42-1900,19)+4-INT((7*MOD(B42-1900,19)+1)/19)),29)-MOD(B42-1900+INT((B42-1900)/4)+31-MOD((11*MOD(B42-1900,19)+4-INT((7*MOD(B42-1900,19)+1)/19)),29),7)),31+(25-MOD((11*MOD(B42-1900,19)+4-INT((7*MOD(B42-1900,19)+1)/19)),29)-MOD(B42-1900+INT((B42-1900)/4)+31-MOD((11*MOD(B42-1900,19)+4-INT((7*MOD(B42-1900,19)+1)/19)),29),7))))","v":"2016-03-27"},{"$nulls":20},"","","2016-04-18","",""]
[{"$nulls":22},"","","2016-04-19","",""]
[{"$nulls":22},"","","2016-04-20","",""]
[{"$nulls":22},"","","2016-04-21","",""]
[{"$nulls":22},"","","2016-04-22","",""]
[{"$nulls":22},"","","2016-04-23","",""]
[{"$nulls":22},"","","2016-04-24","",""]
[{"$nulls":22},"","","2016-04-25","",""]
[{"$nulls":22},"","","2016-04-26","",""]
[{"$nulls":22},"","","2016-04-27","",""]
[{"$nulls":22},"","","2016-04-28","",""]
[{"$nulls":22},"","","2016-04-29","",""]
[{"$nulls":22},"","","2016-04-30","",""]
[{"$nulls":22},"","","2016-05-01","",""]
[{"$nulls":22},"","","2016-05-02","",""]
[{"$nulls":22},"","","2016-05-03","",""]
[{"$nulls":22},"","","2016-05-04","",""]
[{"$nulls":22},"","","2016-05-05","",""]
[{"$nulls":22},"","","2016-05-06","",""]
[{"$nulls":22},"","","2016-05-07","",{"$f":"IF(AA72=\"\",\"\",IF(AA72=$AA$5,\"\",AA72+1))","v":""}]
[{"$nulls":22},"","","2016-05-08","",""]
[{"$nulls":22},"","","2016-05-09","",""]
[{"$nulls":22},"","","2016-05-10","",""]
[{"$nulls":22},"","","2016-05-11","",""]
[{"$nulls":22},"","","2016-05-12","",""]
[{"$nulls":22},"","","2016-05-13","",""]
[{"$nulls":22},"","","2016-05-14","",""]
[{"$nulls":22},"","","2016-05-15","",""]

{"sheet":"planning pers - masquer","index":1,"n_rows":527,"n_cols":91,"rows_kept":527,"hidden":true,"merged":[[32,32,32,36],[32,37,32,41],[32,42,32,44]]}
[null,null,"TOUT","P-A","P-B","P-C","P-D","P-E","T-A","T-B","T-C","T-D","T-E","SCAN","SCAN","SCAN","PHY","MAIN","MAIN","MAIN","MAIN","MAIN","CP","CP","CP","CP","CP","FORM","FORM",{"$nulls":31},{"$f":"BH2","v":"vide"},{"$f":"BH3","v":"vide"},{"$f":"BH4","v":"vide"},{"$f":"BH5","v":"vide"},{"$f":"BH6","v":"vide"},{"$f":"BH7","v":"vide"},{"$f":"BH8","v":"vide"},{"$f":"BH9","v":"vide"},{"$f":"BH10","v":"vide"},{"$f":"BH11","v":"vide"},{"$f":"BH12","v":"vide"},{"$f":"BH13","v":"vide"},{"$f":"BH14","v":"vide"},{"$f":"BH15","v":"vide"},{"$f":"BH16","v":"vide"},{"$f":"BH17","v":"vide"},{"$f":"BH18","v":"vide"},{"$f":"BH19","v":"vide"},{"$f":"BH20","v":"vide"},{"$f":"BH21","v":"vide"},{"$f":"BH22","v":"vide"},{"$f":"BH23","v":"vide"},{"$f":"BH24","v":"vide"},{"$f":"BH25","v":"vide"},{"$f":"BH26","v":"vide"},{"$f":"BH27","v":"vide"},{"$f":"BH28","v":"vide"},{"$f":"BH29","v":"vide"},{"$f":"BH30","v":"vide"},{"$f":"BH31","v":"vide"},{"$f":"BH32","v":"vide"}]
[null,null,{"$f":"trame_planning_machine!$C6","v":"ve 1"},{"$f":"trame_planning_machine!$D6","v":"00:00:00"},{"$f":"trame_planning_machine!$E6","v":"00:00:00"},{"$f":"trame_planning_machine!$F6","v":"00:00:00"},{"$f":"trame_planning_machine!$G6","v":"00:00:00"},{"$f":"trame_planning_machine!$H6","v":"00:00:00"},{"$f":"trame_planning_machine!$I6","v":"00:00:00"},{"$f":"trame_planning_machine!$J6","v":"00:00:00"},{"$f":"trame_planning_machine!$K6","v":"00:00:00"},{"$f":"trame_planning_machine!$L6","v":"00:00:00"},{"$f":"trame_planning_machine!$M6","v":"00:00:00"},{"$f":"trame_planning_machine!$N6","v":"00:00:00"},{"$f":"trame_planning_machine!$O6","v":"00:00:00"},{"$f":"trame_planning_machine!$P6","v":"00:00:00"},{"$f":"trame_planning_machine!$R6","v":"00:00:00"},{"$f":"trame_planning_machine!$T6","v":"00:00:00"},{"$f":"trame_planning_machine!$U6","v":"00:00:00"},{"$f":"trame_planning_machine!$V6","v":"00:00:00"},{"$f":"trame_planning_machine!$W6","v":"00:00:00"},{"$f":"trame_planning_machine!$X6","v":"00:00:00"},{"$f":"trame_planning_machine!$Z6","v":"00:00:00"},{"$f":"trame_planning_machine!$AA6","v":"00:00:00"},{"$f":"trame_planning_machine!$AB6","v":"00:00:00"},{"$f":"trame_planning_machine!$AC6","v":"00:00:00"},{"$f":"trame_planning_machine!$AD6","v":"00:00:00"},{"$f":"trame_planning_machine!$AF6","v":"00:00:00"},{"$f":"trame_planning_machine!$AG6","v":"00:00:00"},null,"AG",{"$f":"trame_planning_machine!$C$6","v":"ve 1"},{"$f":"IF($D$2=$AE$2,$D$1,\"\")","v":""},{"$f":"IF(E2=$AE$2,$E$1,\"\")","v":""},{"$f":"IF($F$2=$AE$2,$F$1,\"\")","v":""},{"$f":"IF($G$2=$AE$2,$G$1,\"\")","v":""},{"$f":"IF($H$2=$AE$2,$H$1,\"\")","v":""},{"$f":"IF($I$2=$AE$2,$I$1,\"\")","v":""},{"$f":"IF($J$2=$AE$2,$J$1,\"\")","v":""},{"$f":"IF($K$2=$AE$2,$K$1,\"\")","v":""},{"$f":"IF($L$2=$AE$2,$L$1,\"\")","v":""},{"$f":"IF($M$2=$AE$2,$M$1,\"\")","v":""},{"$f":"IF($N$2=$AE$2,$N$1,\"\")","v":""},{"$f":"IF($O$2=$AE$2,$O$1,\"\")","v":""},{"$f":"IF($P$2=$AE$2,$P$1,\"\")","v":""},{"$f":"IF($Q$2=$AE$2,$Q$1,\"\")","v":""},{"$f":"IF($R$2=$AE$2,$R$1,\"\")","v":""},{"$f":"IF($S$2=$AE$2,$S$1,\"\")","v":""},{"$f":"IF($T$2=$AE$2,$T$1,\"\")","v":""},{"$f":"IF($U$2=$AE$2,$U$1,\"\")","v":""},{"$f":"IF($V$2=$AE$2,$V$1,\"\")","v":""},{"$f":"IF($W$2=$AE$2,$W$1,\"\")","v":""},{"$f":"IF($X$2=$AE$2,$X$1,\"\")","v":""},{"$f":"IF($Y$2=$AE$2,$Y$1,\"\")","v":""},{"$f":"IF($Z$2=$AE$2,$Z$1,\"\")","v":""},{"$f":"IF($AA$2=$AE$2,$AA$1,\"\")","v":""},{"$f":"IF(ISERROR(SEARCH(\"AG*\",$AB$2)),\"\",$AB$1)","v":""},{"$f":"IF(ISERROR(SEARCH(\"AG*\",$AC$2)),\"\",$AC$1)","v":""},{"$f":"IF(BI2>1,\"DOUB\",\"\")","v":""},{"$f":"IF(ISNA(LOOKUP(2.1,1/(AG2:BG2<>\"\"),AG2:BG2)),\"vide\",LOOKUP(2.1,1/(AG2:BG2<>\"\"),AG2:BG2))","v":"vide"},{"$f":"SUMPRODUCT((AG2:BF2<>\"\")*1)","v":0}]
[null,null,{"$f":"trame_planning_machine!$C7","v":"sa 2"},{"$f":"trame_planning_machine!$D7","v":"00:00:00"},{"$f":"trame_planning_machine!$E7","v":"00:00:00"},{"$f":"trame_planning_machine!$F7","v":"00:00:00"},{"$f":"trame_planning_machine!$G7","v":"00:00:00"},{"$f":"trame_planning_machine!$H7","v":"00:00:00"},{"$f":"trame_planning_machine!$I7","v":"00:00:00"},{"$f":"trame_planning_machine!$J7","v":"00:00:00"},{"$f":"trame_planning_machine!$K7","v":"00:00:00"},{"$f":"trame_planning_machine!$L7","v":"00:00:00"},{"$f":"trame_planning_machine!$M7","v":"00:00:00"},{"$f":"trame_planning_machine!$N7","v":"00:00:00"},{"$f":"trame_planning_machine!$O7","v":"00:00:00"},{"$f":"trame_planning_machine!$P7","v":"00:00:00"},{"$f":"trame_planning_machine!$R7","v":"00:00:00"},{"$f":"trame_planning_machine!$T7","v":"00:00:00"},{"$f":"trame_planning_machine!$U7","v":"00:00:00"},{"$f":"trame_planning_machine!$V7","v":"00:00:00"},{"$f":"trame_planning_machine!$W7","v":"00:00:00"},{"$f":"trame_planning_machine!$X7","v":"00:00:00"},{"$f":"trame_planning_machine!$Z7","v":"00:00:00"},{"$f":"trame_planning_machine!$AA7","v":"00:00:00"},{"$f":"trame_planning_machine!$AB7","v":"00:00:00"},{"$f":"trame_planning_machine!$AC7","v":"00:00:00"},{"$f":"trame_planning_machine!$AD7","v":"00:00:00"},{"$f":"trame_planning_machine!$AF7","v":"00:00:00"},{"$f":"trame_planning_machine!$AG7","v":"00:00:00"},null,null,{"$f":"trame_planning_machine!$C$7","v":"sa 2"},{"$f":"IF(D3=$AE$2,$D$1,\"\")","v":""},{"$f":"IF(E3=$AE$2,$E$1,\"\")","v":""},{"$f":"IF(F3=$AE$2,$F$1,\"\")","v":""},{"$f":"IF(G3=$AE$2,$G$1,\"\")","v":""},{"$f":"IF(H3=$AE$2,$H$1,\"\")","v":""},{"$f":"IF(I3=$AE$2,$I$1,\"\")","v":""},{"$f":"IF(J3=$AE$2,$J$1,\"\")","v":""},{"$f":"IF(K3=$AE$2,$K$1,\"\")","v":""},{"$f":"IF(L3=$AE$2,$L$1,\"\")","v":""},{"$f":"IF(M3=$AE$2,$M$1,\"\")","v":""},{"$f":"IF(N3=$AE$2,$N$1,\"\")","v":""},{"$f":"IF(O3=$AE$2,$O$1,\"\")","v":""},{"$f":"IF(P3=$AE$2,$P$1,\"\")","v":""},{"$f":"IF(Q3=$AE$2,$Q$1,\"\")","v":""},{"$f":"IF(R3=$AE$2,$R$1,\"\")","v":""},{"$f":"IF(S3=$AE$2,$S$1,\"\")","v":""},{"$f":"IF(T3=$AE$2,$T$1,\"\")","v":""},{"$f":"IF(U3=$AE$2,$U$1,\"\")","v":""},{"$f":"IF(V3=$AE$2,$V$1,\"\")","v":""},{"$f":"IF(W3=$AE$2,$W$1,\"\")","v":""},{"$f":"IF(X3=$AE$2,$X$1,\"\")","v":""},{"$f":"IF(Y3=$AE$2,$Y$1,\"\")","v":""},{"$f":"IF(Z3=$AE$2,$Z$1,\"\")","v":""},{"$f":"IF(AA3=$AE$2,$AA$1,\"\")","v":""},{"$f":"IF(ISERROR(SEARCH(\"AG*\",$AB3)),\"\",$AB$1)","v":""},{"$f":"IF(ISERROR(SEARCH(\"AG*\",$AC3)),\"\",$AC$1)","v":""},{"$f":"IF(BI3>1,\"DOUB\",\"\")","v":""},{"$f":"IF(ISNA(LOOKUP(2.1,1/(AG3:BG3<>\"\"),AG3:BG3)),\"vide\",LOOKUP(2.1,1/(AG3:BG3<>\"\"),AG3:BG3))","v":"vide"},{"$f":"SUMPRODUCT((AG3:BF3<>\"\")*1)","v":0}]
[null,null,{"$f":"trame_planning_machine!$C8","v":"di 3"},{"$f":"trame_planning_machine!$D8","v":"00:00:00"},{"$f":"trame_planning_machine!$E8","v":"00:00:00"},{"$f":"trame_planning_machine!$F8","v":"00:00:00"},{"$f":"trame_planning_machine!$G8","v":"00:00:00"},{"$f":"trame_planning_machine!$H8","v":"00:00:00"},{"$f":"trame_planning_machine!$I8","v":"00:00:00"},{"$f":"trame_planning_machine!$J8","v":"00:00:00"},{"$f":"trame_planning_machine!$K8","v":"00:00:00"},{"$f":"trame_planning_machine!$L8","v":"00:00:00"},{"$f":"trame_planning_machine!$M8","v":"00:00:00"},{"$f":"trame_planning_machine!$N8","v":"00:00:00"},{"$f":"trame_planning_machine!$O8","v":"00:00:00"},{"$f":"trame_planning_machine!$P8","v":"00:00:00"},{"$f":"trame_planning_machine!$R8","v":"00:00:00"},{"$f":"trame_planning_machine!$T8","v":"00:00:00"},{"$f":"trame_planning_machine!$U8","v":"00:00:00"},{"$f":"trame_planning_machine!$V8","v":"00:00:00"},{"$f":"trame_planning_machine!$W8","v":"00:00:00"},{"$f":"trame_planning_machine!$X8","v":"00:00:00"},{"$f":"trame_planning_machine!$Z8","v":"00:00:00"},{"$f":"trame_planning_machine!$AA8","v":"00:00:00"},{"$f":"trame_planning_machine!$AB8","v":"00:00:00"},{"$f":"trame_planning_machine!$AC8","v":"00:00:00"},{"$f":"trame_planning_machine!$AD8","v":"00:00:00"},{"$f":"trame_planning_machine!$AF8","v":"00:00:00"},{"$f":"trame_planning_machine!$AG8","v":"00:00:00"},null,null,{"$f":"trame_planning_machine!$C$8","v":"di 3"},"","","","","","","","","","","","","","","","","","","","","","","","","","","",{"$f":"IF(ISNA(LOOKUP(2.1,1/(AG4:BG4<>\"\"),AG4:BG4)),\"vide\",LOOKUP(2.1,1/(AG4:BG4<>\"\"),AG4:BG4))","v":"vide"},0]
[null,null,{"$f":"trame_planning_machine!$C9","v":"lu 4"},{"$f":"trame_planning_machine!$D9","v":"00:00:00"},{"$f":"trame_planning_machine!$E9","v":"00:00:00"},{"$f":"trame_planning_machine!$F9","v":"00:00:00"},{"$f":"trame_planning_machine!$G9","v":"00:00:00"},{"$f":"trame_planning_machine!$H9","v":"00:00:00"},{"$f":"trame_planning_machine!$I9","v":"00:00:00"},{"$f":"trame_planning_machine!$J9","v":"00:00:00"},{"$f":"trame_planning_machine!$K9","v":"00:00:00"},{"$f":"trame_planning_machine!$L9","v":"00:00:00"},{"$f":"trame_planning_machine!$M9","v":"00:00:00"},{"$f":"trame_planning_machine!$N9","v":"00:00:00"},{"$f":"trame_planning_machine!$O9","v":"00:00:00"},{"$f":"trame_planning_machine!$P9","v":"00:00:00"},{"$f":"trame_planning_machine!$R9","v":"00:00:00"},{"$f":"trame_planning_machine!$T9","v":"00:00:00"},{"$f":"trame_planning_machine!$U9","v":"00:00:00"},{"$f":"trame_planning_machine!$V9","v":"00:00:00"},{"$f":"trame_planning_machine!$W9","v":"00:00:00"},{"$f":"trame_planning_machine!$X9","v":"00:00:00"},{"$f":"trame_planning_machine!$Z9","v":"00:00:00"},{"$f":"trame_planning_machine!$AA9","v":"00:00:00"},{"$f":"trame_planning_machine!$AB9","v":"00:00:00"},{"$f":"trame_planning_machine!$AC9","v":"00:00:00"},{"$f":"trame_planning_machine!$AD9","v":"00:00:00"},{"$f":"trame_planning_machine!$AF9","v":"00:00:00"},{"$f":"trame_planning_machine!$AG9","v":"00:00:00"},null,null,{"$f":"trame_planning_machine!$C$9","v":"lu 4"},"","","","","","","","","","","","","","","","","","","","","","","","","","","","vide",0]
[null,null,{"$f":"trame_planning_machine!$C10","v":"ma 5"},{"$f":"trame_planning_machine!$D10","v":"00:00:00"},{"$f":"trame_planning_machine!$E10","v":"00:00:00"},{"$f":"trame_planning_machine!$F10","v":"00:00:00"},{"$f":"trame_planning_machine!$G10","v":"00:00:00"},{"$f":"trame_planning_machine!$H10","v":"00:00:00"},{"$f":"trame_planning_machine!$I10","v":"00:00:00"},{"$f":"trame_planning_machine!$J10","v":"00:00:00"},{"$f":"trame_planning_machine!$K10","v":"00:00:00"},{"$f":"trame_planning_machine!$L10","v":"00:00:00"},{"$f":"trame_planning_machine!$M10","v":"00:00:00"},{"$f":"trame_planning_machine!$N10","v":"00:00:00"},{"$f":"trame_planning_machine!$O10","v":"00:00:00"},{"$f":"trame_planning_machine!$P10","v":"00:00:00"},{"$f":"trame_planning_machine!$R10","v":"00:00:00"},{"$f":"trame_planning_machine!$T10","v":"00:00:00"},{"$f":"trame_planning_machine!$U10","v":"00:00:00"},{"$f":"trame_planning_machine!$V10","v":"00:00:00"},{"$f":"trame_planning_machine!$W10","v":"00:00:00"},{"$f":"trame_planning_machine!$X10","v":"00:00:00"},{"$f":"trame_planning_machine!$Z10","v":"00:00:00"},{"$f":"trame_planning_machine!$AA10","v":"00:00:00"},{"$f":"trame_planning_machine!$AB10","v":"00:00:00"},{"$f":"trame_planning_machine!$AC10","v":"00:00:00"},{"$f":"trame_planning_machine!$AD10","v":"00:00:00"},{"$f":"trame_planning_machine!$AF10","v":"00:00:00"},{"$f":"trame_planning_machine!$AG10","v":"00:00:00"},null,null,{"$f":"trame_planning_machine!$C$10","v":"ma 5"},"","","","","","","","","","","","","","","","","","","","","","","","","","","","vide",0]
[null,null,{"$f":"trame_planning_machine!$C11","v":"me 6"},{"$f":"trame_planning_machine!$D11","v":"00:00:00"},{"$f":"trame_planning_machine!$E11","v":"00:00:00"},{"$f":"trame_planning_machine!$F11","v":"00:00:00"},{"$f":"trame_planning_machine!$G11","v":"00:00:00"},{"$f":"trame_planning_machine!$H11","v":"00:00:00"},{"$f":"trame_planning_machine!$I11","v":"00:00:00"},{"$f":"trame_planning_machine!$J11","v":"00:00:00"},{"$f":"trame_planning_machine!$K11","v":"00:00:00"},{"$f":"trame_planning_machine!$L11","v":"00:00:00"},{"$f":"trame_planning_machine!$M11","v":"00:00:00"},{"$f":"trame_planning_machine!$N11","v":"00:00:00"},{"$f":"trame_planning_machine!$O11","v":"00:00:00"},{"$f":"trame_planning_machine!$P11","v":"00:00:00"},{"$f":"trame_planning_machine!$R11","v":"00:00:00"},{"$f":"trame_planning_machine!$T11","v":"00:00:00"},{"$f":"trame_planning_machine!$U11","v":"00:00:00"},{"$f":"trame_planning_machine!$V11","v":"00:00:00"},{"$f":"trame_planning_machine!$W11","v":"00:00:00"},{"$f":"trame_planning_machine!$X11","v":"00:00:00"},{"$f":"trame_planning_machine!$Z11","v":"00:00:00"},{"$f":"trame_planning_machine!$AA11","v":"00:00:00"},{"$f":"trame_planning_machine!$AB11","v":"00:00:00"},{"$f":"trame_planning_machine!$AC11","v":"00:00:00"},{"$f":"trame_planning_machine!$AD11","v":"00:00:00"},{"$f":"trame_planning_machine!$AF11","v":"00:00:00"},{"$f":"trame_planning_machine!$AG11","v":"00:00:00"},null,null,{"$f":"trame_planning_machine!$C$11","v":"me 6"},"","","","","","","","","","","","","","","","","","","","","","","","","","","","vide",0]
[null,null,{"$f":"trame_planning_machine!$C12","v":"je 7"},{"$f":"trame_planning_machine!$D12","v":"00:00:00"},{"$f":"trame_planning_machine!$E12","v":"00:00:00"},{"$f":"trame_planning_machine!$F12","v":"00:00:00"},{"$f":"trame_planning_machine!$G12","v":"00:00:00"},{"$f":"trame_planning_machine!$H12","v":"00:00:00"},{"$f":"trame_planning_machine!$I12","v":"00:00:00"},{"$f":"trame_planning_machine!$J12","v":"00:00:00"},{"$f":"trame_planning_machine!$K12","v":"00:00:00"},{"$f":"trame_planning_machine!$L12","v":"00:00:00"},{"$f":"trame_planning_machine!$M12","v":"00:00:00"},{"$f":"trame_planning_machine!$N12","v":"00:00:00"},{"$f":"trame_planning_machine!$O12","v":"00:00:00"},{"$f":"trame_planning_machine!$P12","v":"00:00:00"},{"$f":"trame_planning_machine!$R12","v":"00:00:00"},{"$f":"trame_planning_machine!$T12","v":"00:00:00"},{"$f":"trame_planning_machine!$U12","v":"00:00:00"},{"$f":"trame_planning_machine!$V12","v":"00:00:00"},{"$f":"trame_planning_machine!$W12","v":"00:00:00"},{"$f":"trame_planning_machine!$X12","v":"00:00:00"},{"$f":"trame_planning_machine!$Z12","v":"00:00:00"},{"$f":"trame_planning_machine!$AA12","v":"00:00:00"},{"$f":"trame_planning_machine!$AB12","v":"00:00:00"},{"$f":"trame_planning_machine!$AC12","v":"00:00:00"},{"$f":"trame_planning_machine!$AD12","v":"00:00:00"},{"$f":"trame_planning_machine!$AF12","v":"00:00:00"},{"$f":"trame_planning_machine!$AG12","v":"00:00:00"},null,null,{"$f":"trame_planning_machine!$C$12","v":"je 7"},"","","","","","","","","","","","","","","","","","","","","","","","","","","","vide",0]
[null,null,{"$f":"trame_planning_machine!$C13","v":"ve 8"},{"$f":"trame_planning_machine!$D13","v":"00:00:00"},{"$f":"trame_planning_machine!$E13","v":"00:00:00"},{"$f":"trame_planning_machine!$F13","v":"00:00:00"},{"$f":"trame_planning_machine!$G13","v":"00:00:00"},{"$f":"trame_planning_machine!$H13","v":"00:00:00"},{"$f":"trame_planning_machine!$I13","v":"00:00:00"},{"$f":"trame_planning_machine!$J13","v":"00:00:00"},{"$f":"trame_planning_machine!$K13","v":"00:00:00"},{"$f":"trame_planning_machine!$L13","v":"00:00:00"},{"$f":"trame_planning_machine!$M13","v":"00:00:00"},{"$f":"trame_planning_machine!$N13","v":"00:00:00"},{"$f":"trame_planning_machine!$O13","v":"00:00:00"},{"$f":"trame_planning_machine!$P13","v":"00:00:00"},{"$f":"trame_planning_machine!$R13","v":"00:00:00"},{"$f":"trame_planning_machine!$T13","v":"00:00:00"},{"$f":"trame_planning_machine!$U13","v":"00:00:00"},{"$f":"trame_planning_machine!$V13","v":"00:00:00"},{"$f":"trame_planning_machine!$W13","v":"00:00:00"},{"$f":"trame_planning_machine!$X13","v":"00:00:00"},{"$f":"trame_planning_machine!$Z13","v":"00:00:00"},{"$f":"trame_planning_machine!$AA13","v":"00:00:00"},{"$f":"trame_planning_machine!$AB13","v":"00:00:00"},{"$f":"trame_planning_machine!$AC13","v":"00:00:00"},{"$f":"trame_planning_machine!$AD13","v":"00:00:00"},{"$f":"trame_planning_machine!$AF13","v":"00:00:00"},{"$f":"trame_planning_machine!$AG13","v":"00:00:00"},null,null,{"$f":"trame_planning_machine!$C$13","v":"ve 8"},"","","","","","","","","","","","","","","","","","","","","","","","","","","","vide",0]
[null,null,{"$f":"trame_planning_machine!$C14","v":"sa 9"},{"$f":"trame_planning_machine!$D14","v":"00:00:00"},{"$f":"trame_planning_machine!$E14","v":"00:00:00"},{"$f":"trame_planning_machine!$F14","v":"00:00:00"},{"$f":"trame_planning_machine!$G14","v":"00:00:00"},{"$f":"trame_planning_machine!$H14","v":"00:00:00"},{"$f":"trame_planning_machine!$I14","v":"00:00:00"},{"$f":"trame_planning_machine!$J14","v":"00:00:00"},{"$f":"trame_planning_machine!$K14","v":"00:00:00"},{"$f":"trame_planning_machine!$L14","v":"00:00:00"},{"$f":"trame_planning_machine!$M14","v":"00:00:00"},{"$f":"trame_planning_machine!$N14","v":"00:00:00"},{"$f":"trame_planning_machine!$O14","v":"00:00:00"},{"$f":"trame_planning_machine!$P14","v":"00:00:00"},{"$f":"trame_planning_machine!$R14","v":"00:00:00"},{"$f":"trame_planning_machine!$T14","v":"00:00:00"},{"$f":"trame_planning_machine!$U14","v":"00:00:00"},{"$f":"trame_planning_machine!$V14","v":"00:00:00"},{"$f":"trame_planning_machine!$W14","v":"00:00:00"},{"$f":"trame_planning_machine!$X14","v":"00:00:00"},{"$f":"trame_planning_machine!$Z14","v":"00:00:00"},{"$f":"trame_planning_machine!$AA14","v":"00:00:00"},{"$f":"trame_planning_machine!$AB14","v":"00:00:00"},{"$f":"trame_planning_machine!$AC14","v":"00:00:00"},{"$f":"trame_planning_machine!$AD14","v":"00:00:00"},{"$f":"trame_planning_machine!$AF14","v":"00:00:00"},{"$f":"trame_planning_machine!$AG14","v":"00:00:00"},null,null,{"$f":"trame_planning_machine!$C$14","v":"sa 9"},"","","","","","","","","","","","","","","","","","","","","","","","","","","","vide",0]
[null,null,{"$f":"trame_planning_machine!$C15","v":"di 10"},{"$f":"trame_planning_machine!$D15","v":"00:00:00"},{"$f":"trame_planning_machine!$E15","v":"00:00:00"},{"$f":"trame_planning_machine!$F15","v":"00:00:00"},{"$f":"trame_planning_machine!$G15","v":"00:00:00"},{"$f":"trame_planning_machine!$H15","v":"00:00:00"},{"$f":"trame_planning_machine!$I15","v":"00:00:00"},{"$f":"trame_planning_machine!$J15","v":"00:00:00"},{"$f":"trame_planning_machine!$K15","v":"00:00:00"},{"$f":"trame_planning_machine!$L15","v":"00:00:00"},{"$f":"trame_planning_machine!$M15","v":"00:00:00"},{"$f":"trame_planning_machine!$N15","v":"00:00:00"},{"$f":"trame_planning_machine!$O15","v":"00:00:00"},{"$f":"trame_planning_machine!$P15","v":"00:00:00"},{"$f":"trame_planning_machine!$R15","v":"00:00:00"},{"$f":"trame_planning_machine!$T15","v":"00:00:00"},{"$f":"trame_planning_machine!$U15","v":"00:00:00"},{"$f":"trame_planning_machine!$V15","v":"00:00:00"},{"$f":"trame_planning_machine!$W15","v":"00:00:00"},{"$f":"trame_planning_machine!$X15","v":"00:00:00"},{"$f":"trame_planning_machine!$Z15","v":"00:00:00"},{"$f":"trame_planning_machine!$AA15","v":"00:00:00"},{"$f":"trame_planning_machine!$AB15","v":"00:00:00"},{"$f":"trame_planning_machine!$AC15","v":"00:00:00"},{"$f":"trame_planning_machine!$AD15","v":"00:00:00"},{"$f":"trame_planning_machine!$AF15","v":"00:00:00"},{"$f":"trame_planning_machine!$AG15","v":"00:00:00"},null,null,{"$f":"trame_planning_machine!$C$15","v":"di 10"},"","","","","","","","","","","","","","","","","","","","","","","","","","","","vide",0]
[null,null,{"$f":"trame_planning_machine!$C16","v":"lu 11"},{"$f":"trame_planning_machine!$D16","v":"00:00:00"},{"$f":"trame_planning_machine!$E16","v":"00:00:00"},{"$f":"trame_planning_machine!$F16","v":"00:00:00"},{"$f":"trame_planning_machine!$G16","v":"00:00:00"},{"$f":"trame_planning_machine!$H16","v":"00:00:00"},{"$f":"trame_planning_machine!$I16","v":"00:00:00"},{"$f":"trame_planning_machine!$J16","v":"00:00:00"},{"$f":"trame_planning_machine!$K16","v":"00:00:00"},{"$f":"trame_planning_machine!$L16","v":"00:00:00"},{"$f":"trame_planning_machine!$M16","v":"00:00:00"},{"$f":"trame_planning_machine!$N16","v":"00:00:00"},{"$f":"trame_planning_machine!$O16","v":"00:00:00"},{"$f":"trame_planning_machine!$P16","v":"00:00:00"},{"$f":"trame_planning_machine!$R16","v":"00:00:00"},{"$f":"trame_planning_machine!$T16","v":"00:00:00"},{"$f":"trame_planning_machine!$U16","v":"00:00:00"},{"$f":"trame_planning_machine!$V16","v":"00:00:00"},{"$f":"trame_planning_machine!$W16","v":"00:00:00"},{"$f":"trame_planning_machine!$X16","v":"00:00:00"},{"$f":"trame_planning_machine!$Z16","v":"00:00:00"},{"$f":"trame_planning_machine!$AA16","v":"00:00:00"},{"$f":"trame_planning_machine!$AB16","v":"00:00:00"},{"$f":"trame_planning_machine!$AC16","v":"00:00:00"},{"$f":"trame_planning_machine!$AD16","v":"00:00:00"},{"$f":"trame_planning_machine!$AF16","v":"00:00:00"},{"$f":"trame_planning_machine!$AG16","v":"00:00:00"},null,null,{"$f":"trame_planning_machine!$C$16","v":"lu 11"},"","","","","","","","","","","","","","","","","","","","","","","","","","","","vide",0]
[null,null,{"$f":"trame_planning_machine!$C17","v":"ma 12"},{"$f":"trame_planning_machine!$D17","v":"00:00:00"},{"$f":"trame_planning_machine!$E17","v":"00:00:00"},{"$f":"trame_planning_machine!$F17","v":"00:00:00"},{"$f":"trame_planning_machine!$G17","v":"00:00:00"},{"$f":"trame_planning_machine!$H17","v":"00:00:00"},{"$f":"trame_planning_machine!$I17","v":"00:00:00"},{"$f":"trame_planning_machine!$J17","v":"00:00:00"},{"$f":"trame_planning_machine!$K17","v":"00:00:00"},{"$f":"trame_planning_machine!$L17","v":"00:00:00"},{"$f":"trame_planning_machine!$M17","v":"00:00:00"},{"$f":"trame_planning_machine!$N17","v":"00:00:00"},{"$f":"trame_planning_machine!$O17","v":"00:00:00"},{"$f":"trame_planning_machine!$P17","v":"00:00:00"},{"$f":"trame_planning_machine!$R17","v":"00:00:00"},{"$f":"trame_planning_machine!$T17","v":"00:00:00"},{"$f":"trame_planning_machine!$U17","v":"00:00:00"},{"$f":"trame_planning_machine!$V17","v":"00:00:00"},{"$f":"trame_planning_machine!$W17","v":"00:00:00"},{"$f":"trame_planning_machine!$X17","v":"00:00:00"},{"$f":"trame_planning_machine!$Z17","v":"00:00:00"},{"$f":"trame_planning_machine!$AA17","v":"00:00:00"},{"$f":"trame_planning_machine!$AB17","v":"00:00:00"},{"$f":"trame_planning_machine!$AC17","v":"00:00:00"},{"$f":"trame_planning_machine!$AD17","v":"00:00:00"},{"$f":"trame_planning_machine!$AF17","v":"00:00:00"},{"$f":"trame_planning_machine!$AG17","v":"00:00:00"},null,null,{"$f":"trame_planning_machine!$C$17","v":"ma 12"},"","","","","","","","","","","","","","","","","","","","","","","","","","","","vide",0]
[null,null,{"$f":"trame_planning_machine!$C18","v":"me 13"},{"$f":"trame_planning_machine!$D18","v":"00:00:00"},{"$f":"trame_planning_machine!$E18","v":"00:00:00"},{"$f":"trame_planning_machine!$F18","v":"00:00:00"},{"$f":"trame_planning_machine!$G18","v":"00:00:00"},{"$f":"trame_planning_machine!$H18","v":"00:00:00"},{"$f":"trame_planning_machine!$I18","v":"00:00:00"},{"$f":"trame_planning_machine!$J18","v":"00:00:00"},{"$f":"trame_planning_machine!$K18","v":"00:00:00"},{"$f":"trame_planning_machine!$L18","v":"00:00:00"},{"$f":"trame_planning_machine!$M18","v":"00:00:00"},{"$f":"trame_planning_machine!$N18","v":"00:00:00"},{"$f":"trame_planning_machine!$O18","v":"00:00:00"},{"$f":"trame_planning_machine!$P18","v":"00:00:00"},{"$f":"trame_planning_machine!$R18","v":"00:00:00"},{"$f":"trame_planning_machine!$T18","v":"00:00:00"},{"$f":"trame_planning_machine!$U18","v":"00:00:00"},{"$f":"trame_planning_machine!$V18","v":"00:00:00"},{"$f":"trame_planning_machine!$W18","v":"00:00:00"},{"$f":"trame_planning_machine!$X18","v":"00:00:00"},{"$f":"trame_planning_machine!$Z18","v":"00:00:00"},{"$f":"trame_planning_machine!$AA18","v":"00:00:00"},{"$f":"trame_planning_machine!$AB18","v":"00:00:00"},{"$f":"trame_planning_machine!$AC18","v":"00:00:00"},{"$f":"trame_planning_machine!$AD18","v":"00:00:00"},{"$f":"trame_planning_machine!$AF18","v":"00:00:00"},{"$f":"trame_planning_machine!$AG18","v":"00:00:00"},null,null,{"$f":"trame_planning_machine!$C$18","v":"me 13"},"","","","","","","","","","","","","","","","","","","","","","","","","","","","vide",0]
[null,null,{"$f":"trame_planning_machine!$C19","v":"je 14"},{"$f":"trame_planning_machine!$D19","v":"00:00:00"},{"$f":"trame_planning_machine!$E19","v":"00:00:00"},{"$f":"trame_planning_machine!$F19","v":"00:00:00"},{"$f":"trame_planning_machine!$G19","v":"00:00:00"},{"$f":"trame_planning_machine!$H19","v":"00:00:00"},{"$f":"trame_planning_machine!$I19","v":"00:00:00"},{"$f":"trame_planning_machine!$J19","v":"00:00:00"},{"$f":"trame_planning_machine!$K19","v":"00:00:00"},{"$f":"trame_planning_machine!$L19","v":"00:00:00"},{"$f":"trame_planning_machine!$M19","v":"00:00:00"},{"$f":"trame_planning_machine!$N19","v":"00:00:00"},{"$f":"trame_planning_machine!$O19","v":"00:00:00"},{"$f":"trame_planning_machine!$P19","v":"00:00:00"},{"$f":"trame_planning_machine!$R19","v":"00:00:00"},{"$f":"trame_planning_machine!$T19","v":"00:00:00"},{"$f":"trame_planning_machine!$U19","v":"00:00:00"},{"$f":"trame_planning_machine!$V19","v":"00:00:00"},{"$f":"trame_planning_machine!$W19","v":"00:00:00"},{"$f":"trame_planning_machine!$X19","v":"00:00:00"},{"$f":"trame_planning_machine!$Z19","v":"00:00:00"},{"$f":"trame_planning_machine!$AA19","v":"00:00:00"},{"$f":"trame_planning_machine!$AB19","v":"00:00:00"},{"$f":"trame_planning_machine!$AC19","v":"00:00:00"},{"$f":"trame_planning_machine!$AD19","v":"00:00:00"},{"$f":"trame_planning_machine!$AF19","v":"00:00:00"},{"$f":"trame_planning_machine!$AG19","v":"00:00:00"},null,null,{"$f":"trame_planning_machine!$C$19","v":"je 14"},"","","","","","","","","","","","","","","","","","","","","","","","","","","","vide",0]
[null,null,{"$f":"trame_planning_machine!$C20","v":"ve 15"},{"$f":"trame_planning_machine!$D20","v":"00:00:00"},{"$f":"trame_planning_machine!$E20","v":"00:00:00"},{"$f":"trame_planning_machine!$F20","v":"00:00:00"},{"$f":"trame_planning_machine!$G20","v":"00:00:00"},{"$f":"trame_planning_machine!$H20","v":"00:00:00"},{"$f":"trame_planning_machine!$I20","v":"00:00:00"},{"$f":"trame_planning_machine!$J20","v":"00:00:00"},{"$f":"trame_planning_machine!$K20","v":"00:00:00"},{"$f":"trame_planning_machine!$L20","v":"00:00:00"},{"$f":"trame_planning_machine!$M20","v":"00:00:00"},{"$f":"trame_planning_machine!$N20","v":"00:00:00"},{"$f":"trame_planning_machine!$O20","v":"00:00:00"},{"$f":"trame_planning_machine!$P20","v":"00:00:00"},{"$f":"trame_planning_machine!$R20","v":"00:00:00"},{"$f":"trame_planning_machine!$T20","v":"00:00:00"},{"$f":"trame_planning_machine!$U20","v":"00:00:00"},{"$f":"trame_planning_machine!$V20","v":"00:00:00"},{"$f":"trame_planning_machine!$W20","v":"00:00:00"},{"$f":"trame_planning_machine!$X20","v":"00:00:00"},{"$f":"trame_planning_machine!$Z20","v":"00:00:00"},{"$f":"trame_planning_machine!$AA20","v":"00:00:00"},{"$f":"trame_planning_machine!$AB20","v":"00:00:00"},{"$f":"trame_planning_machine!$AC20","v":"00:00:00"},{"$f":"trame_planning_machine!$AD20","v":"00:00:00"},{"$f":"trame_planning_machine!$AF20","v":"00:00:00"},{"$f":"trame_planning_machine!$AG20","v":"00:00:00"},null,null,{"$f":"trame_planning_machine!$C$20","v":"ve 15"},"","","","","","","","","","","","","","","","","","","","","","","","","","","","vide",0]
[null,null,{"$f":"trame_planning_machine!$C21","v":"sa 16"},{"$f":"trame_planning_machine!$D21","v":"00:00:00"},{"$f":"trame_planning_machine!$E21","v":"00:00:00"},{"$f":"trame_planning_machine!$F21","v":"00:00:00"},{"$f":"trame_planning_machine!$G21","v":"00:00:00"},{"$f":"trame_planning_machine!$H21","v":"00:00:00"},{"$f":"trame_planning_machine!$I21","v":"00:00:00"},{"$f":"trame_planning_machine!$J21","v":"00:00:00"},{"$f":"trame_planning_machine!$K21","v":"00:00:00"},{"$f":"trame_planning_machine!$L21","v":"00:00:00"},{"$f":"trame_planning_machine!$M21","v":"00:00:00"},{"$f":"trame_planning_machine!$N21","v":"00:00:00"},{"$f":"trame_planning_machine!$O21","v":"00:00:00"},{"$f":"trame_planning_machine!$P21","v":"00:00:00"},{"$f":"trame_planning_machine!$R21","v":"00:00:00"},{"$f":"trame_planning_machine!$T21","v":"00:00:00"},{"$f":"trame_planning_machine!$U21","v":"00:00:00"},{"$f":"trame_planning_machine!$V21","v":"00:00:00"},{"$f":"trame_planning_machine!$W21","v":"00:00:00"},{"$f":"trame_planning_machine!$X21","v":"00:00:00"},{"$f":"trame_planning_machine!$Z21","v":"00:00:00"},{"$f":"trame_planning_machine!$AA21","v":"00:00:00"},{"$f":"trame_planning_machine!$AB21","v":"00:00:00"},{"$f":"trame_planning_machine!$AC21","v":"00:00:00"},{"$f":"trame_planning_machine!$AD21","v":"00:00:00"},{"$f":"trame_planning_machine!$AF21","v":"00:00:00"},{"$f":"trame_planning_machine!$AG21","v":"00:00:00"},null,null,{"$f":"trame_planning_machine!$C$21","v":"sa 16"},"","","","","","","","","","","","","","","","","","","","","","","","","","","","vide",0]
[null,null,{"$f":"trame_planning_machine!$C22","v":"di 17"},{"$f":"trame_planning_machine!$D22","v":"00:00:00"},{"$f":"trame_planning_machine!$E22","v":"00:00:00"},{"$f":"trame_planning_machine!$F22","v":"00:00:00"},{"$f":"trame_planning_machine!$G22","v":"00:00:00"},{"$f":"trame_planning_machine!$H22","v":"00:00:00"},{"$f":"trame_planning_machine!$I22","v":"00:00:00"},{"$f":"trame_planning_machine!$J22","v":"00:00:00"},{"$f":"trame_planning_machine!$K22","v":"00:00:00"},{"$f":"trame_planning_machine!$L22","v":"00:00:00"},{"$f":"trame_planning_machine!$M22","v":"00:00:00"},{"$f":"trame_planning_machine!$N22","v":"00:00:00"},{"$f":"trame_planning_machine!$O22","v":"00:00:00"},{"$f":"trame_planning_machine!$P22","v":"00:00:00"},{"$f":"trame_planning_machine!$R22","v":"00:00:00"},{"$f":"trame_planning_machine!$T22","v":"00:00:00"},{"$f":"trame_planning_machine!$U22","v":"00:00:00"},{"$f":"trame_planning_machine!$V22","v":"00:00:00"},{"$f":"trame_planning_machine!$W22","v":"00:00:00"},{"$f":"trame_planning_machine!$X22","v":"00:00:00"},{"$f":"trame_planning_machine!$Z22","v":"00:00:00"},{"$f":"trame_planning_machine!$AA22","v":"00:00:00"},{"$f":"trame_planning_machine!$AB22","v":"00:00:00"},{"$f":"trame_planning_machine!$AC22","v":"00:00:00"},{"$f":"trame_planning_machine!$AD22","v":"00:00:00"},{"$f":"trame_planning_machine!$AF22","v":"00:00:00"},{"$f":"trame_planning_machine!$AG22","v":"00:00:00"},null,null,{"$f":"trame_planning_machine!$C$22","v":"di 17"},"","","","","","","","","","","","","","","","","","","","","","","","","","","","vide",0]
[null,null,{"$f":"trame_planning_machine!$C23","v":"lu 18"},{"$f":"trame_planning_machine!$D23","v":"00:00:00"},{"$f":"trame_planning_machine!$E23","v":"00:00:00"},{"$f":"trame_planning_machine!$F23","v":"00:00:00"},{"$f":"trame_planning_machine!$G23","v":"00:00:00"},{"$f":"trame_planning_machine!$H23","v":"00:00:00"},{"$f":"trame_planning_machine!$I23","v":"00:00:00"},{"$f":"trame_planning_machine!$J23","v":"00:00:00"},{"$f":"trame_planning_machine!$K23","v":"00:00:00"},{"$f":"trame_planning_machine!$L23","v":"00:00:00"},{"$f":"trame_planning_machine!$M23","v":"00:00:00"},{"$f":"trame_planning_machine!$N23","v":"00:00:00"},{"$f":"trame_planning_machine!$O23","v":"00:00:00"},{"$f":"trame_planning_machine!$P23","v":"00:00:00"},{"$f":"trame_planning_machine!$R23","v":"00:00:00"},{"$f":"trame_planning_machine!$T23","v":"00:00:00"},{"$f":"trame_planning_machine!$U23","v":"00:00:00"},{"$f":"trame_planning_machine!$V23","v":"00:00:00"},{"$f":"trame_planning_machine!$W23","v":"00:00:00"},{"$f":"trame_planning_machine!$X23","v":"00:00:00"},{"$f":"trame_planning_machine!$Z23","v":"00:00:00"},{"$f":"trame_planning_machine!$AA23","v":"00:00:00"},{"$f":"trame_planning_machine!$AB23","v":"00:00:00"},{"$f":"trame_planning_machine!$AC23","v":"00:00:00"},{"$f":"trame_planning_machine!$AD23","v":"00:00:00"},{"$f":"trame_planning_machine!$AF23","v":"00:00:00"},{"$f":"trame_planning_machine!$AG23","v":"00:00:00"},null,null,{"$f":"trame_planning_machine!$C$23","v":"lu 18"},"","","","","","","","","","","","","","","","","","","","","","","","","","","","vide",0]
[null,null,{"$f":"trame_planning_machine!$C24","v":"ma 19"},{"$f":"trame_planning_machine!$D24","v":"00:00:00"},{"$f":"trame_planning_machine!$E24","v":"00:00:00"},{"$f":"trame_planning_machine!$F24","v":"00:00:00"},{"$f":"trame_planning_machine!$G24","v":"00:00:00"},{"$f":"trame_planning_machine!$H24","v":"00:00:00"},{"$f":"trame_planning_machine!$I24","v":"00:00:00"},{"$f":"trame_planning_machine!$J24","v":"00:00:00"},{"$f":"trame_planning_machine!$K24","v":"00:00:00"},{"$f":"trame_planning_machine!$L24","v":"00:00:00"},{"$f":"trame_planning_machine!$M24","v":"00:00:00"},{"$f":"trame_planning_machine!$N24","v":"00:00:00"},{"$f":"trame_planning_machine!$O24","v":"00:00:00"},{"$f":"trame_planning_machine!$P24","v":"00:00:00"},{"$f":"trame_planning_machine!$R24","v":"00:00:00"},{"$f":"trame_planning_machine!$T24","v":"00:00:00"},{"$f":"trame_planning_machine!$U24","v":"00:00:00"},{"$f":"trame_planning_machine!$V24","v":"00:00:00"},{"$f":"trame_planning_machine!$W24","v":"00:00:00"},{"$f":"trame_planning_machine!$X24","v":"00:00:00"},{"$f":"trame_planning_machine!$Z24","v":"00:00:00"},{"$f":"trame_planning_machine!$AA24","v":"00:00:00"},{"$f":"trame_planning_machine!$AB24","v":"00:00:00"},{"$f":"trame_planning_machine!$AC24","v":"00:00:00"},{"$f":"trame_planning_machine!$AD24","v":"00:00:00"},{"$f":"trame_planning_machine!$AF24","v":"00:00:00"},{"$f":"trame_planning_machine!$AG24","v":"00:00:00"},null,null,{"$f":"trame_planning_machine!$C$24","v":"ma 19"},"","","","","","","","","","","","","","","","","","","","","","","","","","","","vide",0]
[null,null,{"$f":"trame_planning_machine!$C25","v":"me 20"},{"$f":"trame_planning_machine!$D25","v":"00:00:00"},{"$f":"trame_planning_machine!$E25","v":"00:00:00"},{"$f":"trame_planning_machine!$F25","v":"00:00:00"},{"$f":"trame_planning_machine!$G25","v":"00:00:00"},{"$f":"trame_planning_machine!$H25","v":"00:00:00"},{"$f":"trame_planning_machine!$I25","v":"00:00:00"},{"$f":"trame_planning_machine!$J25","v":"00:00:00"},{"$f":"trame_planning_machine!$K25","v":"00:00:00"},{"$f":"trame_planning_machine!$L25","v":"00:00:00"},{"$f":"trame_planning_machine!$M25","v":"00:00:00"},{"$f":"trame_planning_machine!$N25","v":"00:00:00"},{"$f":"trame_planning_machine!$O25","v":"00:00:00"},{"$f":"trame_planning_machine!$P25","v":"00:00:00"},{"$f":"trame_planning_machine!$R25","v":"00:00:00"},{"$f":"trame_planning_machine!$T25","v":"00:00:00"},{"$f":"trame_planning_machine!$U25","v":"00:00:00"},{"$f":"trame_planning_machine!$V25","v":"00:00:00"},{"$f":"trame_planning_machine!$W25","v":"00:00:00"},{"$f":"trame_planning_machine!$X25","v":"00:00:00"},{"$f":"trame_planning_machine!$Z25","v":"00:00:00"},{"$f":"trame_planning_machine!$AA25","v":"00:00:00"},{"$f":"trame_planning_machine!$AB25","v":"00:00:00"},{"$f":"trame_planning_machine!$AC25","v":"00:00:00"},{"$f":"trame_planning_machine!$AD25","v":"00:00:00"},{"$f":"trame_planning_machine!$AF25","v":"00:00:00"},{"$f":"trame_planning_machine!$AG25","v":"00:00:00"},null,null,{"$f":"trame_planning_machine!$C$25","v":"me 20"},"","","","","","","","","","","","","","","","","","","","","","","","","","","","vide",0]
[null,null,{"$f":"trame_planning_machine!$C26","v":"je 21"},{"$f":"trame_planning_machine!$D26","v":"00:00:00"},{"$f":"trame_planning_machine!$E26","v":"00:00:00"},{"$f":"trame_planning_machine!$F26","v":"00:00:00"},{"$f":"trame_planning_machine!$G26","v":"00:00:00"},{"$f":"trame_planning_machine!$H26","v":"00:00:00"},{"$f":"trame_planning_machine!$I26","v":"00:00:00"},{"$f":"trame_planning_machine!$J26","v":"00:00:00"},{"$f":"trame_planning_machine!$K26","v":"00:00:00"},{"$f":"trame_planning_machine!$L26","v":"00:00:00"},{"$f":"trame_planning_machine!$M26","v":"00:00:00"},{"$f":"trame_planning_machine!$N26","v":"00:00:00"},{"$f":"trame_planning_machine!$O26","v":"00:00:00"},{"$f":"trame_planning_machine!$P26","v":"00:00:00"},{"$f":"trame_planning_machine!$R26","v":"00:00:00"},{"$f":"trame_planning_machine!$T26","v":"00:00:00"},{"$f":"trame_planning_machine!$U26","v":"00:00:00"},{"$f":"trame_planning_machine!$V26","v":"00:00:00"},{"$f":"trame_planning_machine!$W26","v":"00:00:00"},{"$f":"trame_planning_machine!$X26","v":"00:00:00"},{"$f":"trame_planning_machine!$Z26","v":"00:00:00"},{"$f":"trame_planning_machine!$AA26","v":"00:00:00"},{"$f":"trame_planning_machine!$AB26","v":"00:00:00"},{"$f":"trame_planning_machine!$AC26","v":"00:00:00"},{"$f":"trame_planning_machine!$AD26","v":"00:00:00"},{"$f":"trame_planning_machine!$AF26","v":"00:00:00"},{"$f":"trame_planning_machine!$AG26","v":"00:00:00"},null,null,{"$f":"trame_planning_machine!$C$26","v":"je 21"},"","","","","","","","","","","","","","","","","","","","","","","","","","","","vide",0]
[null,null,{"$f":"trame_planning_machine!$C27","v":"ve 22"},{"$f":"trame_planning_machine!$D27","v":"00:00:00"},{"$f":"trame_planning_machine!$E27","v":"00:00:00"},{"$f":"trame_planning_machine!$F27","v":"00:00:00"},{"$f":"trame_planning_machine!$G27","v":"00:00:00"},{"$f":"trame_planning_machine!$H27","v":"00:00:00"},{"$f":"trame_planning_machine!$I27","v":"00:00:00"},{"$f":"trame_planning_machine!$J27","v":"00:00:00"},{"$f":"trame_planning_machine!$K27","v":"00:00:00"},{"$f":"trame_planning_machine!$L27","v":"00:00:00"},{"$f":"trame_planning_machine!$M27","v":"00:00:00"},{"$f":"trame_planning_machine!$N27","v":"00:00:00"},{"$f":"trame_planning_machine!$O27","v":"00:00:00"},{"$f":"trame_planning_machine!$P27","v":"00:00:00"},{"$f":"trame_planning_machine!$R27","v":"00:00:00"},{"$f":"trame_planning_machine!$T27","v":"00:00:00"},{"$f":"trame_planning_machine!$U27","v":"00:00:00"},{"$f":"trame_planning_machine!$V27","v":"00:00:00"},{"$f":"trame_planning_machine!$W27","v":"00:00:00"},{"$f":"trame_planning_machine!$X27","v":"00:00:00"},{"$f":"trame_planning_machine!$Z27","v":"00:00:00"},{"$f":"trame_planning_machine!$AA27","v":"00:00:00"},{"$f":"trame_planning_machine!$AB27","v":"00:00:00"},{"$f":"trame_planning_machine!$AC27","v":"00:00:00"},{"$f":"trame_planning_machine!$AD27","v":"00:00:00"},{"$f":"trame_planning_machine!$AF27","v":"00:00:00"},{"$f":"trame_planning_machine!$AG27","v":"00:00:00"},null,null,{"$f":"trame_planning_machine!$C$27","v":"ve 22"},"","","","","","","","","","","","","","","","","","","","","","","","","","","","vide",0]
[null,null,{"$f":"trame_planning_machine!$C28","v":"sa 23"},{"$f":"trame_planning_machine!$D28","v":"00:00:00"},{"$f":"trame_planning_machine!$E28","v":"00:00:00"},{"$f":"trame_planning_machine!$F28","v":"00:00:00"},{"$f":"trame_planning_machine!$G28","v":"00:00:00"},{"$f":"trame_planning_machine!$H28","v":"00:00:00"},{"$f":"trame_planning_machine!$I28","v":"00:00:00"},{"$f":"trame_planning_machine!$J28","v":"00:00:00"},{"$f":"trame_planning_machine!$K28","v":"00:00:00"},{"$f":"trame_planning_machine!$L28","v":"00:00:00"},{"$f":"trame_planning_machine!$M28","v":"00:00:00"},{"$f":"trame_planning_machine!$N28","v":"00:00:00"},{"$f":"trame_planning_machine!$O28","v":"00:00:00"},{"$f":"trame_planning_machine!$P28","v":"00:00:00"},{"$f":"trame_planning_machine!$R28","v":"00:00:00"},{"$f":"trame_planning_machine!$T28","v":"00:00:00"},{"$f":"trame_planning_machine!$U28","v":"00:00:00"},{"$f":"trame_planning_machine!$V28","v":"00:00:00"},{"$f":"trame_planning_machine!$W28","v":"00:00:00"},{"$f":"trame_planning_machine!$X28","v":"00:00:00"},{"$f":"trame_planning_machine!$Z28","v":"00:00:00"},{"$f":"trame_planning_machine!$AA28","v":"00:00:00"},{"$f":"trame_planning_machine!$AB28","v":"00:00:00"},{"$f":"trame_planning_machine!$AC28","v":"00:00:00"},{"$f":"trame_planning_machine!$AD28","v":"00:00:00"},{"$f":"trame_planning_machine!$AF28","v":"00:00:00"},{"$f":"trame_planning_machine!$AG28","v":"00:00:00"},null,null,{"$f":"trame_planning_machine!$C$28","v":"sa 23"},"","","","","","","","","","","","","","","","","","","","","","","","","","","","vide",0]
[null,null,{"$f":"trame_planning_machine!$C29","v":"di 24"},{"$f":"trame_planning_machine!$D29","v":"00:00:00"},{"$f":"trame_planning_machine!$E29","v":"00:00:00"},{"$f":"trame_planning_machine!$F29","v":"00:00:00"},{"$f":"trame_planning_machine!$G29","v":"00:00:00"},{"$f":"trame_planning_machine!$H29","v":"00:00:00"},{"$f":"trame_planning_machine!$I29","v":"00:00:00"},{"$f":"trame_planning_machine!$J29","v":"00:00:00"},{"$f":"trame_planning_machine!$K29","v":"00:00:00"},{"$f":"trame_planning_machine!$L29","v":"00:00:00"},{"$f":"trame_planning_machine!$M29","v":"00:00:00"},{"$f":"trame_planning_machine!$N29","v":"00:00:00"},{"$f":"trame_planning_machine!$O29","v":"00:00:00"},{"$f":"trame_planning_machine!$P29","v":"00:00:00"},{"$f":"trame_planning_machine!$R29","v":"00:00:00"},{"$f":"trame_planning_machine!$T29","v":"00:00:00"},{"$f":"trame_planning_machine!$U29","v":"00:00:00"},{"$f":"trame_planning_machine!$V29","v":"00:00:00"},{"$f":"trame_planning_machine!$W29","v":"00:00:00"},{"$f":"trame_planning_machine!$X29","v":"00:00:00"},{"$f":"trame_planning_machine!$Z29","v":"00:00:00"},{"$f":"trame_planning_machine!$AA29","v":"00:00:00"},{"$f":"trame_planning_machine!$AB29","v":"00:00:00"},{"$f":"trame_planning_machine!$AC29","v":"00:00:00"},{"$f":"trame_planning_machine!$AD29","v":"00:00:00"},{"$f":"trame_planning_machine!$AF29","v":"00:00:00"},{"$f":"trame_planning_machine!$AG29","v":"00:00:00"},null,null,{"$f":"trame_planning_machine!$C$29","v":"di 24"},"","","","","","","","","","","","","","","","","","","","","","","","","","","","vide",0]
[null,null,{"$f":"trame_planning_machine!$C30","v":"lu 25"},{"$f":"trame_planning_machine!$D30","v":"00:00:00"},{"$f":"trame_planning_machine!$E30","v":"00:00:00"},{"$f":"trame_planning_machine!$F30","v":"00:00:00"},{"$f":"trame_planning_machine!$G30","v":"00:00:00"},{"$f":"trame_planning_machine!$H30","v":"00:00:00"},{"$f":"trame_planning_machine!$I30","v":"00:00:00"},{"$f":"trame_planning_machine!$J30","v":"00:00:00"},{"$f":"trame_planning_machine!$K30","v":"00:00:00"},{"$f":"trame_planning_machine!$L30","v":"00:00:00"},{"$f":"trame_planning_machine!$M30","v":"00:00:00"},{"$f":"trame_planning_machine!$N30","v":"00:00:00"},{"$f":"trame_planning_machine!$O30","v":"00:00:00"},{"$f":"trame_planning_machine!$P30","v":"00:00:00"},{"$f":"trame_planning_machine!$R30","v":"00:00:00"},{"$f":"trame_planning_machine!$T30","v":"00:00:00"},{"$f":"trame_planning_machine!$U30","v":"00:00:00"},{"$f":"trame_planning_machine!$V30","v":"00:00:00"},{"$f":"trame_planning_machine!$W30","v":"00:00:00"},{"$f":"trame_planning_machine!$X30","v":"00:00:00"},{"$f":"trame_planning_machine!$Z30","v":"00:00:00"},{"$f":"trame_planning_machine!$AA30","v":"00:00:00"},{"$f":"trame_planning_machine!$AB30","v":"00:00:00"},{"$f":"trame_planning_machine!$AC30","v":"00:00:00"},{"$f":"trame_planning_machine!$AD30","v":"00:00:00"},{"$f":"trame_planning_machine!$AF30","v":"00:00:00"},{"$f":"trame_planning_machine!$AG30","v":"00:00:00"},null,null,{"$f":"trame_planning_machine!$C$30","v":"lu 25"},"","","","","","","","","","","","","","","","","","","","","","","","","","","","vide",0]
[null,null,{"$f":"trame_planning_machine!$C31","v":"ma 26"},{"$f":"trame_planning_machine!$D31","v":"00:00:00"},{"$f":"trame_planning_machine!$E31","v":"00:00:00"},{"$f":"trame_planning_machine!$F31","v":"00:00:00"},{"$f":"trame_planning_machine!$G31","v":"00:00:00"},{"$f":"trame_planning_machine!$H31","v":"00:00:00"},{"$f":"trame_planning_machine!$I31","v":"00:00:00"},{"$f":"trame_planning_machine!$J31","v":"00:00:00"},{"$f":"trame_planning_machine!$K31","v":"00:00:00"},{"$f":"trame_planning_machine!$L31","v":"00:00:00"},{"$f":"trame_planning_machine!$M31","v":"00:00:00"},{"$f":"trame_planning_machine!$N31","v":"00:00:00"},{"$f":"trame_planning_machine!$O31","v":"00:00:00"},{"$f":"trame_planning_machine!$P31","v":"00:00:00"},{"$f":"trame_planning_machine!$R31","v":"00:00:00"},{"$f":"trame_planning_machine!$T31","v":"00:00:00"},{"$f":"trame_planning_machine!$U31","v":"00:00:00"},{"$f":"trame_planning_machine!$V31","v":"00:00:00"},{"$f":"trame_planning_machine!$W31","v":"00:00:00"},{"$f":"trame_planning_machine!$X31","v":"00:00:00"},{"$f":"trame_planning_machine!$Z31","v":"00:00:00"},{"$f":"trame_planning_machine!$AA31","v":"00:00:00"},{"$f":"trame_planning_machine!$AB31","v":"00:00:00"},{"$f":"trame_planning_machine!$AC31","v":"00:00:00"},{"$f":"trame_planning_machine!$AD31","v":"00:00:00"},{"$f":"trame_planning_machine!$AF31","v":"00:00:00"},{"$f":"trame_planning_machine!$AG31","v":"00:00:00"},null,null,{"$f":"trame_planning_machine!$C$31","v":"ma 26"},"","","","","","","","","","","","","","","","","","","","","","","","","","","","vide",0]
[null,null,{"$f":"trame_planning_machine!$C32","v":"me 27"},{"$f":"trame_planning_machine!$D32","v":"00:00:00"},{"$f":"trame_planning_machine!$E32","v":"00:00:00"},{"$f":"trame_planning_machine!$F32","v":"00:00:00"},{"$f":"trame_planning_machine!$G32","v":"00:00:00"},{"$f":"trame_planning_machine!$H32","v":"00:00:00"},{"$f":"trame_planning_machine!$I32","v":"00:00:00"},{"$f":"trame_planning_machine!$J32","v":"00:00:00"},{"$f":"trame_planning_machine!$K32","v":"00:00:00"},{"$f":"trame_planning_machine!$L32","v":"00:00:00"},{"$f":"trame_planning_machine!$M32","v":"00:00:00"},{"$f":"trame_planning_machine!$N32","v":"00:00:00"},{"$f":"trame_planning_machine!$O32","v":"00:00:00"},{"$f":"trame_planning_machine!$P32","v":"00:00:00"},{"$f":"trame_planning_machine!$R32","v":"00:00:00"},{"$f":"trame_planning_machine!$T32","v":"00:00:00"},{"$f":"trame_planning_machine!$U32","v":"00:00:00"},{"$f":"trame_planning_machine!$V32","v":"00:00:00"},{"$f":"trame_planning_machine!$W32","v":"00:00:00"},{"$f":"trame_planning_machine!$X32","v":"00:00:00"},{"$f":"trame_planning_machine!$Z32","v":"00:00:00"},{"$f":"trame_planning_machine!$AA32","v":"00:00:00"},{"$f":"trame_planning_machine!$AB32","v":"00:00:00"},{"$f":"trame_planning_machine!$AC32","v":"00:00:00"},{"$f":"trame_planning_machine!$AD32","v":"00:00:00"},{"$f":"trame_planning_machine!$AF32","v":"00:00:00"},{"$f":"trame_planning_machine!$AG32","v":"00:00:00"},null,null,{"$f":"trame_planning_machine!$C$32","v":"me 27"},"","","","","","","","","","","","","","","","","","","","","","","","","","","","vide",0]
[null,null,{"$f":"trame_planning_machine!$C33","v":"je 28"},{"$f":"trame_planning_machine!$D33","v":"00:00:00"},{"$f":"trame_planning_machine!$E33","v":"00:00:00"},{"$f":"trame_planning_machine!$F33","v":"00:00:00"},{"$f":"trame_planning_machine!$G33","v":"00:00:00"},{"$f":"trame_planning_machine!$H33","v":"00:00:00"},{"$f":"trame_planning_machine!$I33","v":"00:00:00"},{"$f":"trame_planning_machine!$J33","v":"00:00:00"},{"$f":"trame_planning_machine!$K33","v":"00:00:00"},{"$f":"trame_planning_machine!$L33","v":"00:00:00"},{"$f":"trame_planning_machine!$M33","v":"00:00:00"},{"$f":"trame_planning_machine!$N33","v":"00:00:00"},{"$f":"trame_planning_machine!$O33","v":"00:00:00"},{"$f":"trame_planning_machine!$P33","v":"00:00:00"},{"$f":"trame_planning_machine!$R33","v":"00:00:00"},{"$f":"trame_planning_machine!$T33","v":"00:00:00"},{"$f":"trame_planning_machine!$U33","v":"00:00:00"},{"$f":"trame_planning_machine!$V33","v":"00:00:00"},{"$f":"trame_planning_machine!$W33","v":"00:00:00"},{"$f":"trame_planning_machine!$X33","v":"00:00:00"},{"$f":"trame_planning_machine!$Z33","v":"00:00:00"},{"$f":"trame_planning_machine!$AA33","v":"00:00:00"},{"$f":"trame_planning_machine!$AB33","v":"00:00:00"},{"$f":"trame_planning_machine!$AC33","v":"00:00:00"},{"$f":"trame_planning_machine!$AD33","v":"00:00:00"},{"$f":"trame_planning_machine!$AF33","v":"00:00:00"},{"$f":"trame_planning_machine!$AG33","v":"00:00:00"},null,null,{"$f":"trame_planning_machine!$C$33","v":"je 28"},"","","","","","","","","","","","","","","","","","","","","","","","","","","","vide",0]
[null,null,{"$f":"trame_planning_machine!$C34","v":"ve 29"},{"$f":"trame_planning_machine!$D34","v":"00:00:00"},{"$f":"trame_planning_machine!$E34","v":"00:00:00"},{"$f":"trame_planning_machine!$F34","v":"00:00:00"},{"$f":"trame_planning_machine!$G34","v":"00:00:00"},{"$f":"trame_planning_machine!$H34","v":"00:00:00"},{"$f":"trame_planning_machine!$I34","v":"00:00:00"},{"$f":"trame_planning_machine!$J34","v":"00:00:00"},{"$f":"trame_planning_machine!$K34","v":"00:00:00"},{"$f":"trame_planning_machine!$L34","v":"00:00:00"},{"$f":"trame_planning_machine!$M34","v":"00:00:00"},{"$f":"trame_planning_machine!$N34","v":"00:00:00"},{"$f":"trame_planning_machine!$O34","v":"00:00:00"},{"$f":"trame_planning_machine!$P34","v":"00:00:00"},{"$f":"trame_planning_machine!$R34","v":"00:00:00"},{"$f":"trame_planning_machine!$T34","v":"00:00:00"},{"$f":"trame_planning_machine!$U34","v":"00:00:00"},{"$f":"trame_planning_machine!$V34","v":"00:00:00"},{"$f":"trame_planning_machine!$W34","v":"00:00:00"},{"$f":"trame_planning_machine!$X34","v":"00:00:00"},{"$f":"trame_planning_machine!$Z34","v":"00:00:00"},{"$f":"trame_planning_machine!$AA34","v":"00:00:00"},{"$f":"trame_planning_machine!$AB34","v":"00:00:00"},{"$f":"trame_planning_machine!$AC34","v":"00:00:00"},{"$f":"trame_planning_machine!$AD34","v":"00:00:00"},{"$f":"trame_planning_machine!$AF34","v":"00:00:00"},{"$f":"trame_planning_machine!$AG34","v":"00:00:00"},null,null,{"$f":"trame_planning_machine!$C$34","v":"ve 29"},"","","","","","","","","","","","","","","","","","","","","","","","","","","","vide",0]
[null,null,{"$f":"trame_planning_machine!$C35","v":"sa 30"},{"$f":"trame_planning_machine!$D35","v":"00:00:00"},{"$f":"trame_planning_machine!$E35","v":"00:00:00"},{"$f":"trame_planning_machine!$F35","v":"00:00:00"},{"$f":"trame_planning_machine!$G35","v":"00:00:00"},{"$f":"trame_planning_machine!$H35","v":"00:00:00"},{"$f":"trame_planning_machine!$I35","v":"00:00:00"},{"$f":"trame_planning_machine!$J35","v":"00:00:00"},{"$f":"trame_planning_machine!$K35","v":"00:00:00"},{"$f":"trame_planning_machine!$L35","v":"00:00:00"},{"$f":"trame_planning_machine!$M35","v":"00:00:00"},{"$f":"trame_planning_machine!$N35","v":"00:00:00"},{"$f":"trame_planning_machine!$O35","v":"00:00:00"},{"$f":"trame_planning_machine!$P35","v":"00:00:00"},{"$f":"trame_planning_machine!$R35","v":"00:00:00"},{"$f":"trame_planning_machine!$T35","v":"00:00:00"},{"$f":"trame_planning_machine!$U35","v":"00:00:00"},{"$f":"trame_planning_machine!$V35","v":"00:00:00"},{"$f":"trame_planning_machine!$W35","v":"00:00:00"},{"$f":"trame_planning_machine!$X35","v":"00:00:00"},{"$f":"trame_planning_machine!$Z35","v":"00:00:00"},{"$f":"trame_planning_machine!$AA35","v":"00:00:00"},{"$f":"trame_planning_machine!$AB35","v":"00:00:00"},{"$f":"trame_planning_machine!$AC35","v":"00:00:00"},{"$f":"trame_planning_machine!$AD35","v":"00:00:00"},{"$f":"trame_planning_machine!$AF35","v":"00:00:00"},{"$f":"trame_planning_machine!$AG35","v":"00:00:00"},null,null,{"$f":"trame_planning_machine!$C$35","v":"sa 30"},"","","","","","","","","","","","","","","","","","","","","","","","","","","","vide",0]
[null,null,{"$f":"trame_planning_machine!$C36","v":"di 31"},{"$f":"trame_planning_machine!$D36","v":"00:00:00"},{"$f":"trame_planning_machine!$E36","v":"00:00:00"},{"$f":"trame_planning_machine!$F36","v":"00:00:00"},{"$f":"trame_planning_machine!$G36","v":"00:00:00"},{"$f":"trame_planning_machine!$H36","v":"00:00:00"},{"$f":"trame_planning_machine!$I36","v":"00:00:00"},{"$f":"trame_planning_machine!$J36","v":"00:00:00"},{"$f":"trame_planning_machine!$K36","v":"00:00:00"},{"$f":"trame_planning_machine!$L36","v":"00:00:00"},{"$f":"trame_planning_machine!$M36","v":"00:00:00"},{"$f":"trame_planning_machine!$N36","v":"00:00:00"},{"$f":"trame_planning_machine!$O36","v":"00:00:00"},{"$f":"trame_planning_machine!$P36","v":"00:00:00"},{"$f":"trame_planning_machine!$R36","v":"00:00:00"},{"$f":"trame_planning_machine!$T36","v":"00:00:00"},{"$f":"trame_planning_machine!$U36","v":"00:00:00"},{"$f":"trame_planning_machine!$V36","v":"00:00:00"},{"$f":"trame_planning_machine!$W36","v":"00:00:00"},{"$f":"trame_planning_machine!$X36","v":"00:00:00"},{"$f":"trame_planning_machine!$Z36","v":"00:00:00"},{"$f":"trame_planning_machine!$AA36","v":"00:00:00"},{"$f":"trame_planning_machine!$AB36","v":"00:00:00"},{"$f":"trame_planning_machine!$AC36","v":"00:00:00"},{"$f":"trame_planning_machine!$AD36","v":"00:00:00"},{"$f":"trame_planning_machine!$AF36","v":"00:00:00"},{"$f":"trame_planning_machine!$AG36","v":"00:00:00"},null,null,{"$f":"trame_planning_machine!$C$36","v":"di 31"},"","","","","","","","","","","","","","","","","","","","","","","","","","","","vide",0]
[]
[{"$nulls":60},{"$f":"BH35","v":"vide"},{"$f":"BH36","v":"vide"},{"$f":"BH37","v":"vide"},{"$f":"BH38","v":"vide"},{"$f":"BH39","v":"vide"},{"$f":"BH40","v":"vide"},{"$f":"BH41","v":"vide"},{"$f":"BH42","v":"vide"},{"$f":"BH43","v":"vide"},{"$f":"BH44","v":"vide"},{"$f":"BH45","v":"vide"},{"$f":"BH46","v":"vide"},{"$f":"BH47","v":"vide"},{"$f":"BH48","v":"vide"},{"$f":"BH49","v":"vide"},{"$f":"BH50","v":"vide"},{"$f":"BH51","v":"vide"},{"$f":"BH52","v":"vide"},{"$f":"BH53","v":"vide"},{"$f":"BH54","v":"vide"},{"$f":"BH55","v":"vide"},{"$f":"BH56","v":"vide"},{"$f":"BH57","v":"vide"},{"$f":"BH58","v":"vide"},{"$f":"BH59","v":"vide"},{"$f":"BH60","v":"vide"},{"$f":"BH61","v":"vide"},{"$f":"BH62","v":"vide"},{"$f":"BH63","v":"vide"},{"$f":"BH64","v":"vide"},{"$f":"BH65","v":"vide"}]
[{"$nulls":30},"CB",{"$f":"trame_planning_machine!$C$6","v":"ve 1"},{"$f":"IF(D2=$AE$35,$D$1,\"\")","v":""},{"$f":"IF(E2=$AE$35,$E$1,\"\")","v":""},{"$f":"IF(F2=$AE$35,$F$1,\"\")","v":""},{"$f":"IF(G2=$AE$35,$G$1,\"\")","v":""},{"$f":"IF(H2=$AE$35,$H$1,\"\")","v":""},{"$f":"IF(I2=$AE$35,$I$1,\"\")","v":""},{"$f":"IF(J2=$AE$35,$J$1,\"\")","v":""},{"$f":"IF(K2=$AE$35,$K$1,\"\")","v":""},{"$f":"IF(L2=$AE$35,$L$1,\"\")","v":""},{"$f":"IF(M2=$AE$35,$M$1,\"\")","v":""},{"$f":"IF(N2=$AE$35,$N$1,\"\")","v":""},{"$f":"IF(O2=$AE$35,$O$1,\"\")","v":""},{"$f":"IF(P2=$AE$35,$P$1,\"\")","v":""},{"$f":"IF(Q2=$AE$35,$Q$1,\"\")","v":""},{"$f":"IF(R2=$AE$35,$R$1,\"\")","v":""},{"$f":"IF(S2=$AE$35,$S$1,\"\")","v":""},{"$f":"IF(T2=$AE$35,$T$1,\"\")","v":""},{"$f":"IF(U2=$AE$35,$U$1,\"\")","v":""},{"$f":"IF(V2=$AE$35,$V$1,\"\")","v":""},{"$f":"IF(W2=$AE$35,$W$1,\"\")","v":""},{"$f":"IF(X2=$AE$35,$X$1,\"\")","v":""},{"$f":"IF(Y2=$AE$35,$Y$1,\"\")","v":""},{"$f":"IF(Z2=$AE$35,$Z$1,\"\")","v":""},{"$f":"IF(AA2=$AE$35,$AA$1,\"\")","v":""},{"$f":"IF(ISERROR(SEARCH(\"CB*\",$AB$2)),\"\",$AB$1)","v":""},{"$f":"IF(ISERROR(SEARCH(\"CB*\",$AC$2)),\"\",$AC$1)","v":""},{"$f":"IF(BI35>1,\"DOUB\",\"\")","v":""},{"$f":"IF(ISNA(LOOKUP(2.1,1/(AG35:BG35<>\"\"),AG35:BG35)),\"vide\",LOOKUP(2.1,1/(AG35:BG35<>\"\"),AG35:BG35))","v":"vide"},{"$f":"SUMPRODUCT((AG35:BF35<>\"\")*1)","v":0}]
[{"$nulls":31},{"$f":"trame_planning_machine!$C$7","v":"sa 2"},{"$f":"IF(D3=$AE$35,$D$1,\"\")","v":""},{"$f":"IF(E3=$AE$35,$E$1,\"\")","v":""},{"$f":"IF(F3=$AE$35,$F$1,\"\")","v":""},{"$f":"IF(G3=$AE$35,$G$1,\"\")","v":""},{"$f":"IF(H3=$AE$35,$H$1,\"\")","v":""},{"$f":"IF(I3=$AE$35,$I$1,\"\")","v":""},{"$f":"IF(J3=$AE$35,$J$1,\"\")","v":""},{"$f":"IF(K3=$AE$35,$K$1,\"\")","v":""},{"$f":"IF(L3=$AE$35,$L$1,\"\")","v":""},{"$f":"IF(M3=$AE$35,$M$1,\"\")","v":""},{"$f":"IF(N3=$AE$35,$N$1,\"\")","v":""},{"$f":"IF(O3=$AE$35,$O$1,\"\")","v":""},{"$f":"IF(P3=$AE$35,$P$1,\"\")","v":""},{"$f":"IF(Q3=$AE$35,$Q$1,\"\")","v":""},{"$f":"IF(R3=$AE$35,$R$1,\"\")","v":""},{"$f":"IF(S3=$AE$35,$S$1,\"\")","v":""},{"$f":"IF(T3=$AE$35,$T$1,\"\")","v":""},{"$f":"IF(U3=$AE$35,$U$1,\"\")","v":""},{"$f":"IF(V3=$AE$35,$V$1,\"\")","v":""},{"$f":"IF(W3=$AE$35,$W$1,\"\")","v":""},{"$f":"IF(X3=$AE$35,$X$1,\"\")","v":""},{"$f":"IF(Y3=$AE$35,$Y$1,\"\")","v":""},{"$f":"IF(Z3=$AE$35,$Z$1,\"\")","v":""},{"$f":"IF(AA3=$AE$35,$AA$1,\"\")","v":""},{"$f":"IF(ISERROR(SEARCH(\"CB*\",$AB$2)),\"\",$AB$1)","v":""},{"$f":"IF(ISERROR(SEARCH(\"CB*\",$AC$2)),\"\",$AC$1)","v":""},{"$f":"IF(BI36>1,\"DOUB\",\"\")","v":""},{"$f":"IF(ISNA(LOOKUP(2.1,1/(AG36:BG36<>\"\"),AG36:BG36)),\"vide\",LOOKUP(2.1,1/(AG36:BG36<>\"\"),AG36:BG36))","v":"vide"},{"$f":"SUMPRODUCT((AG36:BF36<>\"\")*1)","v":0}]
[{"$nulls":31},{"$f":"trame_planning_machine!$C$8","v":"di 3"},"","","","","","","","","","","","","","","","","","","","","","","","","","","","vide",0]
[{"$nulls":31},{"$f":"trame_planning_machine!$C$9","v":"lu 4"},"","","","","","","","","","","","","","","","","","","","","","","","","","","","vide",0]
[{"$nulls":31},{"$f":"trame_planning_machine!$C$10","v":"ma 5"},"","","","","","","","","","","","","","","","","","","","","","","","","","","","vide",0]
[{"$nulls":31},{"$f":"trame_planning_machine!$C$11","v":"me 6"},"","","","","","","","","","","","","","","","","","","","","","","","","","","","vide",0]
[{"$nulls":31},{"$f":"trame_planning_machine!$C$12","v":"je 7"},"","","","","","","","","","","","","","","","","","","","","","","","","","","","vide",0]
[{"$nulls":31},{"$f":"trame_planning_machine!$C$13","v":"ve 8"},"","","","","","","","","","","","","","","","","","","","","","","","","","","","vide",0]
[{"$nulls":31},{"$f":"trame_planning_machine!$C$14","v":"sa 9"},"","","","","","","","","","","","","","","","","","","","","","","","","","","","vide",0]
[{"$nulls":31},{"$f":"trame_planning_machine!$C$15","v":"di 10"},"","","","","","","","","","","","","","","","","","","","","","","","","","","","vide",0]
[{"$nulls":31},{"$f":"trame_planning_machine!$C$16","v":"lu 11"},"","","","","","","","","","","","","","","","","","","","","","","","","","","","vide",0]
[{"$nulls":31},{"$f":"trame_planning_machine!$C$17","v":"ma 12"},"","","","","","","","","","","","","","","","","","","","","","","","","","","","vide",0]
[{"$nulls":31},{"$f":"trame_planning_machine!$C$18","v":"me 13"},"","","","","","","","","","","","","","","","","","","","","","","","","","","","vide",0]
[{"$nulls":31},{"$f":"trame_planning_machine!$C$19","v":"je 14"},"","","","","","","","","","","","","","","","","","","","","","","","","","","","vide",0]
[{"$nulls":31},{"$f":"trame_planning_machine!$C$20","v":"ve 15"},"","","","","","","","","","","","","","","","","","","","","","","","","","","","vide",0]
[{"$nulls":31},{"$f":"trame_planning_machine!$C$21","v":"sa 16"},"","","","","","","","","","","","","","","","","","","","","","","","","","","","vide",0]
[{"$nulls":31},{"$f":"trame_planning_machine!$C$22","v":"di 17"},"","","","","","","","","","","","","","","","","","","","","","","","","","","","vide",0]
[{"$nulls":31},{"$f":"trame_planning_machine!$C$23","v":"lu 18"},"","","","","","","","","","","","","","","","","","","","","","","","","","","","vide",0]
[{"$nulls":31},{"$f":"trame_planning_machine!$C$24","v":"ma 19"},"","","","","","","","","","","","","","","","","","","","","","","","","","","","vide",0]
[{"$nulls":31},{"$f":"trame_planning_machine!$C$25","v":"me 20"},"","","","","","","","","","","","","","","","","","","","","","","","","","","","vide",0]
[{"$nulls":31},{"$f":"trame_planning_machine!$C$26","v":"je 21"},"","","","","","","","","","","","","","","","","","","","","","","","","","","","vide",0]
[{"$nulls":31},{"$f":"trame_planning_machine!$C$27","v":"ve 22"},"","","","","","","","","","","","","","","","","","","","","","","","","","","","vide",0]
[{"$nulls":31},{"$f":"trame_planning_machine!$C$28","v":"sa 23"},"","","","","","","","","","","","","","","","","","","","","","","","","","","","vide",0]
[{"$nulls":31},{"$f":"trame_planning_machine!$C$29","v":"di 24"},"","","","","","","","","","","","","","","","","","","","","","","","","","","","vide",0]
[{"$nulls":31},{"$f":"trame_planning_machine!$C$30","v":"lu 25"},"","","","","","","","","","","","","","","","","","","","","","","","","","","","vide",0]
[{"$nulls":31},{"$f":"trame_planning_machine!$C$31","v":"ma 26"},"","","","","","","","","","","","","","","","","","","","","","","","","","","","vide",0]
[{"$nulls":31},{"$f":"trame_planning_machine!$C$32","v":"me 27"},"","","","","","","","","","","","","","","","","","","","","","","","","","","","vide",0]
[{"$nulls":31},{"$f":"trame_planning_machine!$C$33","v":"je 28"},"","","","","","","","","","","","","","","","","","","","","","","","","","","","vide",0]
[{"$nulls":31},{"$f":"trame_planning_machine!$C$34","v":"ve 29"},"","","","","","","","","","","","","","","","","","","","","","","","","","","","vide",0]
[{"$nulls":31},{"$f":"trame_planning_machine!$C$35","v":"sa 30"},"","","","","","","","","","","","","","","","","","","","","","","","","","","","vide",0]
[{"$nulls":31},{"$f":"trame_planning_machine!$C$36","v":"di 31"},"","","","","","","","","","","","","","","","","","","","","","","","","","","","vide",0]
[]
[{"$nulls":60},{"$f":"BH68","v":"vide"},{"$f":"BH69","v":"vide"},{"$f":"BH70","v":"vide"},{"$f":"BH71","v":"vide"},{"$f":"BH72","v":"vide"},{"$f":"BH73","v":"vide"},{"$f":"BH74","v":"vide"},{"$f":"BH75","v":"vide"},{"$f":"BH76","v":"vide"},{"$f":"BH77","v":"vide"},{"$f":"BH78","v":"vide"},{"$f":"BH79","v":"vide"},{"$f":"BH80","v":"vide"},{"$f":"BH81","v":"vide"},{"$f":"BH82","v":"vide"},{"$f":"BH83","v":"vide"},{"$f":"BH84","v":"vide"},{"$f":"BH85","v":"vide"},{"$f":"BH86","v":"vide"},{"$f":"BH87","v":"vide"},{"$f":"BH88","v":"vide"},{"$f":"BH89","v":"vide"},{"$f":"BH90","v":"vide"},{"$f":"BH91","v":"vide"},{"$f":"BH92","v":"vide"},{"$f":"BH93","v":"vide"},{"$f":"BH94","v":"vide"},{"$f":"BH95","v":"vide"},{"$f":"BH96","v":"vide"},{"$f":"BH97","v":"vide"},{"$f":"BH98","v":"vide"}]
[{"$nulls":30},"CC",{"$f":"trame_planning_machine!$C$6","v":"ve 1"},{"$f":"IF(D2=$AE$68,D$1,\"\")","v":""},{"$f":"IF(E2=$AE$68,E$1,\"\")","v":""},"","","","","","","","","","","","","","","","","","","","","","",{"$f":"IF(ISERROR(SEARCH(\"CC*\",$AB$2)),\"\",$AB$1)","v":""},{"$f":"IF(ISERROR(SEARCH(\"CC*\",$AC$2)),\"\",$AC$1)","v":""},{"$f":"IF(BI68>1,\"DOUB\",\"\")","v":""},{"$f":"IF(ISNA(LOOKUP(2.1,1/(AG68:BG68<>\"\"),AG68:BG68)),\"vide\",LOOKUP(2.1,1/(AG68:BG68<>\"\"),AG68:BG68))","v":"vide"},{"$f":"SUMPRODUCT((AG68:BF68<>\"\")*1)","v":0}]
[{"$nulls":31},{"$f":"trame_planning_machine!$C$7","v":"sa 2"},{"$f":"IF(D3=$AE$68,D$1,\"\")","v":""},{"$f":"IF(E3=$AE$68,E$1,\"\")","v":""},{"$f":"IF(F3=$AE$68,F$1,\"\")","v":""},{"$f":"IF(G3=$AE$68,G$1,\"\")","v":""},{"$f":"IF(H3=$AE$68,H$1,\"\")","v":""},{"$f":"IF(I3=$AE$68,I$1,\"\")","v":""},{"$f":"IF(J3=$AE$68,J$1,\"\")","v":""},{"$f":"IF(K3=$AE$68,K$1,\"\")","v":""},{"$f":"IF(L3=$AE$68,L$1,\"\")","v":""},{"$f":"IF(M3=$AE$68,M$1,\"\")","v":""},{"$f":"IF(N3=$AE$68,N$1,\"\")","v":""},{"$f":"IF(O3=$AE$68,O$1,\"\")","v":""},{"$f":"IF(P3=$AE$68,P$1,\"\")","v":""},{"$f":"IF(Q3=$AE$68,Q$1,\"\")","v":""},{"$f":"IF(R3=$AE$68,R$1,\"\")","v":""},{"$f":"IF(S3=$AE$68,S$1,\"\")","v":""},{"$f":"IF(T3=$AE$68,T$1,\"\")","v":""},{"$f":"IF(U3=$AE$68,U$1,\"\")","v":""},{"$f":"IF(V3=$AE$68,V$1,\"\")","v":""},{"$f":"IF(W3=$AE$68,W$1,\"\")","v":""},{"$f":"IF(X3=$AE$68,X$1,\"\")","v":""},{"$f":"IF(Y3=$AE$68,Y$1,\"\")","v":""},{"$f":"IF(Z3=$AE$68,Z$1,\"\")","v":""},{"$f":"IF(AA3=$AE$68,AA$1,\"\")","v":""},{"$f":"IF(ISERROR(SEARCH(\"CC*\",$AB$2)),\"\",$AB$1)","v":""},{"$f":"IF(ISERROR(SEARCH(\"CC*\",$AC$2)),\"\",$AC$1)","v":""},{"$f":"IF(BI69>1,\"DOUB\",\"\")","v":""},{"$f":"IF(ISNA(LOOKUP(2.1,1/(AG69:BG69<>\"\"),AG69:BG69)),\"vide\",LOOKUP(2.1,1/(AG69:BG69<>\"\"),AG69:BG69))","v":"vide"},{"$f":"SUMPRODUCT((AG69:BF69<>\"\")*1)","v":0}]
[{"$nulls":31},{"$f":"trame_planning_machine!$C$8","v":"di 3"},"","","","","","","","","","","","","","","","","","","","","","","","","","","","vide",0]
[{"$nulls":31},{"$f":"trame_planning_machine!$C$9","v":"lu 4"},"","","","","","","","","","","","","","","","","","","","","","","","","","","","vide",0]
[{"$nulls":31},{"$f":"trame_planning_machine!$C$10","v":"ma 5"},"","","","","","","","","","","","","","","","","","","","","","","","","","","","vide",0]
[{"$nulls":31},{"$f":"trame_planning_machine!$C$11","v":"me 6"},"","","","","","","","","","","","","","","","","","","","","","","","","","","","vide",0]
[{"$nulls":31},{"$f":"trame_planning_machine!$C$12","v":"je 7"},"","","","","","","","","","","","","","","","","","","","","","","","","","","","vide",0]
[{"$nulls":31},{"$f":"trame_planning_machine!$C$13","v":"ve 8"},"","","","","","","","","","","","","","","","","","","","","","","","","","","","vide",0]
[{"$nulls":31},{"$f":"trame_planning_machine!$C$14","v":"sa 9"},"","","","","","","","","","","","","","","","","","","","","","","","","","","","vide",0]
[{"$nulls":31},{"$f":"trame_planning_machine!$C$15","v":"di 10"},"","","","","","","","","","","","","","","","","","","","","","","","","","","","vide",0]
[{"$nulls":31},{"$f":"trame_planning_machine!$C$16","v":"lu 11"},"","","","","","","","","","","","","","","","","","","","","","","","","","","","vide",0]
[{"$nulls":31},{"$f":"trame_planning_machine!$C$17","v":"ma 12"},"","","","","","","","","","","","","","","","","","","","","","","","","","","","vide",0]
[{"$nulls":31},{"$f":"trame_planning_machine!$C$18","v":"me 13"},"","","","","","","","","","","","","","","","","","","","","","","","","","","","vide",0]
[{"$nulls":31},{"$f":"trame_planning_machine!$C$19","v":"je 14"},"","","","","","","","","","","","","","","","","","","","","","","","","","","","vide",0]
[{"$nulls":31},{"$f":"trame_planning_machine!$C$20","v":"ve 15"},"","","","","","","","","","","","","","","","","","","","","","","","","","","","vide",0]
[{"$nulls":31},{"$f":"trame_planning_machine!$C$21","v":"sa 16"},"","","","","","","","","","","","","","","","","","","","","","","","","","","","vide",0]
[{"$nulls":31},{"$f":"trame_planning_machine!$C$22","v":"di 17"},"","","","","","","","","","","","","","","","","","","","","","","","","","","","vide",0]
[{"$nulls":31},{"$f":"trame_planning_machine!$C$23","v":"lu 18"},"","","","","","","","","","","","","","","","","","","","","","","","","","","","vide",0]
[{"$nulls":31},{"$f":"trame_planning_machine!$C$24","v":"ma 19"},"","","","","","","","","","","","","","","","","","","","","","","","","","","","vide",0]
[{"$nulls":31},{"$f":"trame_planning_machine!$C$25","v":"me 20"},"","","","","","","","","","","","","","","","","","","","","","","","","","","","vide",0]
[{"$nulls":31},{"$f":"trame_planning_machine!$C$26","v":"je 21"},"","","","","","","","","","","","","","","","","","","","","","","","","","","","vide",0]
[{"$nulls":31},{"$f":"trame_planning_machine!$C$27","v":"ve 22"},"","","","","","","","","","","","","","","","","","","","","","","","","","","","vide",0]
[{"$nulls":31},{"$f":"trame_planning_machine!$C$28","v":"sa 23"},"","","","","","","","","","","","","","","","","","","","","","","","","","","","vide",0]
[{"$nulls":31},{"$f":"trame_planning_machine!$C$29","v":"di 24"},"","","","","","","","","","","","","","","","","","","","","","","","","","","","vide",0]
[{"$nulls":31},{"$f":"trame_planning_machine!$C$30","v":"lu 25"},"","","","","","","","","","","","","","","","","","","","","","","","","","","","vide",0]
[{"$nulls":31},{"$f":"trame_planning_machine!$C$31","v":"ma 26"},"","","","","","","","","","","","","","","","","","","","","","","","","","","","vide",0]
[{"$nulls":31},{"$f":"trame_planning_machine!$C$32","v":"me 27"},"","","","","","","","","","","","","","","","","","","","","","","","","","","","vide",0]
[{"$nulls":31},{"$f":"trame_planning_machine!$C$33","v":"je 28"},"","","","","","","","","","","","","","","","","","","","","","","","","","","","vide",0]
[{"$nulls":31},{"$f":"trame_planning_machine!$C$34","v":"ve 29"},"","","","","","","","","","","","","","","","","","","","","","","","","","","","vide",0]
[{"$nulls":31},{"$f":"trame_planning_machine!$C$35","v":"sa 30"},"","","","","","","","","","","","","","","","","","","","","","","","","","","","vide",0]
[{"$nulls":31},{"$f":"trame_planning_machine!$C$36","v":"di 31"},"","","","","","","","","","","","","","","","","","","","","","","","","","","","vide",0]
[]
[{"$nulls":60},{"$f":"BH101","v":"vide"},{"$f":"BH102","v":"vide"},{"$f":"BH103","v":"vide"},{"$f":"BH104","v":"vide"},{"$f":"BH105","v":"vide"},{"$f":"BH106","v":"vide"},{"$f":"BH107","v":"vide"},{"$f":"BH108","v":"vide"},{"$f":"BH109","v":"vide"},{"$f":"BH110","v":"vide"},{"$f":"BH111","v":"vide"},{"$f":"BH112","v":"vide"},{"$f":"BH113","v":"vide"},{"$f":"BH114","v":"vide"},{"$f":"BH115","v":"vide"},{"$f":"BH116","v":"vide"},{"$f":"BH117","v":"vide"},{"$f":"BH118","v":"vide"},{"$f":"BH119","v":"vide"},{"$f":"BH120","v":"vide"},{"$f":"BH121","v":"vide"},{"$f":"BH122","v":"vide"},{"$f":"BH123","v":"vide"},{"$f":"BH124","v":"vide"},{"$f":"BH125","v":"vide"},{"$f":"BH126","v":"vide"},{"$f":"BH127","v":"vide"},{"$f":"BH128","v":"vide"},{"$f":"BH129","v":"vide"},{"$f":"BH130","v":"vide"},{"$f":"BH131","v":"vide"}]
[{"$nulls":30},"CG",{"$f":"trame_planning_machine!$C$6","v":"ve 1"},{"$f":"IF(D2=$AE$101,D$1,\"\")","v":""},{"$f":"IF(E2=$AE$101,E$1,\"\")","v":""},"","","","","","","","","","","","","","","","","","","","","","",{"$f":"IF(ISERROR(SEARCH(\"CG*\",$AB$2)),\"\",$AB$1)","v":""},{"$f":"IF(ISERROR(SEARCH(\"CG*\",$AC$2)),\"\",$AC$1)","v":""},{"$f":"IF(BI101>1,\"DOUB\",\"\")","v":""},{"$f":"IF(ISNA(LOOKUP(2.1,1/(AG101:BG101<>\"\"),AG101:BG101)),\"vide\",LOOKUP(2.1,1/(AG101:BG101<>\"\"),AG101:BG101))","v":"vide"},{"$f":"SUMPRODUCT((AG101:BF101<>\"\")*1)","v":0}]
[{"$nulls":31},{"$f":"trame_planning_machine!$C$7","v":"sa 2"},{"$f":"IF(D3=$AE$101,D$1,\"\")","v":""},{"$f":"IF(E3=$AE$101,E$1,\"\")","v":""},{"$f":"IF(F3=$AE$101,F$1,\"\")","v":""},{"$f":"IF(G3=$AE$101,G$1,\"\")","v":""},{"$f":"IF(H3=$AE$101,H$1,\"\")","v":""},{"$f":"IF(I3=$AE$101,I$1,\"\")","v":""},{"$f":"IF(J3=$AE$101,J$1,\"\")","v":""},{"$f":"IF(K3=$AE$101,K$1,\"\")","v":""},{"$f":"IF(L3=$AE$101,L$1,\"\")","v":""},{"$f":"IF(M3=$AE$101,M$1,\"\")","v":""},{"$f":"IF(N3=$AE$101,N$1,\"\")","v":""},{"$f":"IF(O3=$AE$101,O$1,\"\")","v":""},{"$f":"IF(P3=$AE$101,P$1,\"\")","v":""},{"$f":"IF(Q3=$AE$101,Q$1,\"\")","v":""},{"$f":"IF(R3=$AE$101,R$1,\"\")","v":""},{"$f":"IF(S3=$AE$101,S$1,\"\")","v":""},{"$f":"IF(T3=$AE$101,T$1,\"\")","v":""},{"$f":"IF(U3=$AE$101,U$1,\"\")","v":""},{"$f":"IF(V3=$AE$101,V$1,\"\")","v":""},{"$f":"IF(W3=$AE$101,W$1,\"\")","v":""},{"$f":"IF(X3=$AE$101,X$1,\"\")","v":""},{"$f":"IF(Y3=$AE$101,Y$1,\"\")","v":""},{"$f":"IF(Z3=$AE$101,Z$1,\"\")","v":""},{"$f":"IF(AA3=$AE$101,AA$1,\"\")","v":""},{"$f":"IF(ISERROR(SEARCH(\"CG*\",$AB$2)),\"\",$AB$1)","v":""},{"$f":"IF(ISERROR(SEARCH(\"CG*\",$AC$2)),\"\",$AC$1)","v":""},{"$f":"IF(BI102>1,\"DOUB\",\"\")","v":""},{"$f":"IF(ISNA(LOOKUP(2.1,1/(AG102:BG102<>\"\"),AG102:BG102)),\"vide\",LOOKUP(2.1,1/(AG102:BG102<>\"\"),AG102:BG102))","v":"vide"},{"$f":"SUMPRODUCT((AG102:BF102<>\"\")*1)","v":0}]
[{"$nulls":31},{"$f":"trame_planning_machine!$C$8","v":"di 3"},"","","","","","","","","","","","","","","","","","","","","","","","","","","","vide",0]
[{"$nulls":31},{"$f":"trame_planning_machine!$C$9","v":"lu 4"},"","","","","","","","","","","","","","","","","","","","","","","","","","","","vide",0]
[{"$nulls":31},{"$f":"trame_planning_machine!$C$10","v":"ma 5"},"","","","","","","","","","","","","","","","","","","","","","","","","","","","vide",0]
[{"$nulls":31},{"$f":"trame_planning_machine!$C$11","v":"me 6"},"","","","","","","","","","","","","","","","","","","","","","","","","","","","vide",0]
[{"$nulls":31},{"$f":"trame_planning_machine!$C$12","v":"je 7"},"","","","","","","","","","","","","","","","","","","","","","","","","","","","vide",0]
[{"$nulls":31},{"$f":"trame_planning_machine!$C$13","v":"ve 8"},"","","","","","","","","","","","","","","","","","","","","","","","","","","","vide",0]
[{"$nulls":31},{"$f":"trame_planning_machine!$C$14","v":"sa 9"},"","","","","","","","","","","","","","","","","","","","","","","","","","","","vide",0]
[{"$nulls":31},{"$f":"trame_planning_machine!$C$15","v":"di 10"},"","","","","","","","","","","","","","","","","","","","","","","","","","","","vide",0]
[{"$nulls":31},{"$f":"trame_planning_machine!$C$16","v":"lu 11"},"","","","","","","","","","","","","","","","","","","","","","","","","","","","vide",0]
[{"$nulls":31},{"$f":"trame_planning_machine!$C$17","v":"ma 12"},"","","","","","","","","","","","","","","","","","","","","","","","","","","","vide",0]
[{"$nulls":31},{"$f":"trame_planning_machine!$C$18","v":"me 13"},"","","","","","","","","","","","","","","","","","","","","","","","","","","","vide",0]
[{"$nulls":31},{"$f":"trame_planning_machine!$C$19","v":"je 14"},"","","","","","","","","","","","","","","","","","","","","","","","","","","","vide",0]
[{"$nulls":31},{"$f":"trame_planning_machine!$C$20","v":"ve 15"},"","","","","","","","","","","","","","","","","","","","","","","","","","","","vide",0]
[{"$nulls":31},{"$f":"trame_planning_machine!$C$21","v":"sa 16"},"","","","","","","","","","","","","","","","","","","","","","","","","","","","vide",0]
[{"$nulls":31},{"$f":"trame_planning_machine!$C$22","v":"di 17"},"","","","","","","","","","","","","","","","","","","","","","","","","","","","vide",0]
[{"$nulls":31},{"$f":"trame_planning_machine!$C$23","v":"lu 18"},"","","","","","","","","","","","","","","","","","","","","","","","","","","","vide",0]
[{"$nulls":31},{"$f":"trame_planning_machine!$C$24","v":"ma 19"},"","","","","","","","","","","","","","","","","","","","","","","","","","","","vide",0]
[{"$nulls":31},{"$f":"trame_planning_machine!$C$25","v":"me 20"},"","","","","","","","","","","","","","","","","","","","","","","","","","","","vide",0]
[{"$nulls":31},{"$f":"trame_planning_machine!$C$26","v":"je 21"},"","","","","","","","","","","","","","","","","","","","","","","","","","","","vide",0]
[{"$nulls":31},{"$f":"trame_planning_machine!$C$27","v":"ve 22"},"","","","","","","","","","","","","","","","","","","","","","","","","","","","vide",0]
[{"$nulls":31},{"$f":"trame_planning_machine!$C$28","v":"sa 23"},"","","","","","","","","","","","","","","","","","","","","","","","","","","","vide",0]
[{"$nulls":31},{"$f":"trame_planning_machine!$C$29","v":"di 24"},"","","","","","","","","","","","","","","","","","","","","","","","","","","","vide",0]
[{"$nulls":31},{"$f":"trame_planning_machine!$C$30","v":"lu 25"},"","","","","","","","","","","","","","","","","","","","","","","","","","","","vide",0]
[{"$nulls":31},{"$f":"trame_planning_machine!$C$31","v":"ma 26"},"","","","","","","","","","","","","","","","","","","","","","","","","","","","vide",0]
[{"$nulls":31},{"$f":"trame_planning_machine!$C$32","v":"me 27"},"","","","","","","","","","","","","","","","","","","","","","","","","","","","vide",0]
[{"$nulls":31},{"$f":"trame_planning_machine!$C$33","v":"je 28"},"","","","","","","","","","","","","","","","","","","","","","","","","","","","vide",0]
[{"$nulls":31},{"$f":"trame_planning_machine!$C$34","v":"ve 29"},"","","","","","","","","","","","","","","","","","","","","","","","","","","","vide",0]
[{"$nulls":31},{"$f":"trame_planning_machine!$C$35","v":"sa 30"},"","","","","","","","","","","","","","","","","","","","","","","","","","","","vide",0]
[{"$nulls":31},{"$f":"trame_planning_machine!$C$36","v":"di 31"},"","","","","","","","","","","","","","","","","","","","","","","","","","","","vide",0]
[]
[{"$nulls":60},{"$f":"BH134","v":"vide"},{"$f":"BH135","v":"vide"},{"$f":"BH136","v":"vide"},{"$f":"BH137","v":"vide"},{"$f":"BH138","v":"vide"},{"$f":"BH139","v":"vide"},{"$f":"BH140","v":"vide"},{"$f":"BH141","v":"vide"},{"$f":"BH142","v":"vide"},{"$f":"BH143","v":"vide"},{"$f":"BH144","v":"vide"},{"$f":"BH145","v":"vide"},{"$f":"BH146","v":"vide"},{"$f":"BH147","v":"vide"},{"$f":"BH148","v":"vide"},{"$f":"BH149","v":"vide"},{"$f":"BH150","v":"vide"},{"$f":"BH151","v":"vide"},{"$f":"BH152","v":"vide"},{"$f":"BH153","v":"vide"},{"$f":"BH154","v":"vide"},{"$f":"BH155","v":"vide"},{"$f":"BH156","v":"vide"},{"$f":"BH157","v":"vide"},{"$f":"BH158","v":"vide"},{"$f":"BH159","v":"vide"},{"$f":"BH160","v":"vide"},{"$f":"BH161","v":"vide"},{"$f":"BH162","v":"vide"},{"$f":"BH163","v":"vide"},{"$f":"BH164","v":"vide"}]
[{"$nulls":30},"HV",{"$f":"trame_planning_machine!$C$6","v":"ve 1"},{"$f":"IF(D2=$AE$134,D$1,\"\")","v":""},{"$f":"IF(E2=$AE$134,E$1,\"\")","v":""},"","","","","","","","","","","","","","","","","","","","","","",{"$f":"IF(ISERROR(SEARCH(\"HV*\",$AB$2)),\"\",$AB$1)","v":""},{"$f":"IF(ISERROR(SEARCH(\"HV*\",$AC$2)),\"\",$AC$1)","v":""},{"$f":"IF(BI134>1,\"DOUB\",\"\")","v":""},{"$f":"IF(ISNA(LOOKUP(2.1,1/(AG134:BG134<>\"\"),AG134:BG134)),\"vide\",LOOKUP(2.1,1/(AG134:BG134<>\"\"),AG134:BG134))","v":"vide"},{"$f":"SUMPRODUCT((AG134:BF134<>\"\")*1)","v":0}]
[{"$nulls":31},{"$f":"trame_planning_machine!$C$7","v":"sa 2"},{"$f":"IF(D3=$AE$134,D$1,\"\")","v":""},{"$f":"IF(E3=$AE$134,E$1,\"\")","v":""},{"$f":"IF(F3=$AE$134,F$1,\"\")","v":""},{"$f":"IF(G3=$AE$134,G$1,\"\")","v":""},{"$f":"IF(H3=$AE$134,H$1,\"\")","v":""},{"$f":"IF(I3=$AE$134,I$1,\"\")","v":""},{"$f":"IF(J3=$AE$134,J$1,\"\")","v":""},{"$f":"IF(K3=$AE$134,K$1,\"\")","v":""},{"$f":"IF(L3=$AE$134,L$1,\"\")","v":""},{"$f":"IF(M3=$AE$134,M$1,\"\")","v":""},{"$f":"IF(N3=$AE$134,N$1,\"\")","v":""},{"$f":"IF(O3=$AE$134,O$1,\"\")","v":""},{"$f":"IF(P3=$AE$134,P$1,\"\")","v":""},{"$f":"IF(Q3=$AE$134,Q$1,\"\")","v":""},{"$f":"IF(R3=$AE$134,R$1,\"\")","v":""},{"$f":"IF(S3=$AE$134,S$1,\"\")","v":""},{"$f":"IF(T3=$AE$134,T$1,\"\")","v":""},{"$f":"IF(U3=$AE$134,U$1,\"\")","v":""},{"$f":"IF(V3=$AE$134,V$1,\"\")","v":""},{"$f":"IF(W3=$AE$134,W$1,\"\")","v":""},{"$f":"IF(X3=$AE$134,X$1,\"\")","v":""},{"$f":"IF(Y3=$AE$134,Y$1,\"\")","v":""},{"$f":"IF(Z3=$AE$134,Z$1,\"\")","v":""},{"$f":"IF(AA3=$AE$134,AA$1,\"\")","v":""},{"$f":"IF(ISERROR(SEARCH(\"HV*\",$AB$2)),\"\",$AB$1)","v":""},{"$f":"IF(ISERROR(SEARCH(\"HV*\",$AC$2)),\"\",$AC$1)","v":""},{"$f":"IF(BI135>1,\"DOUB\",\"\")","v":""},{"$f":"IF(ISNA(LOOKUP(2.1,1/(AG135:BG135<>\"\"),AG135:BG135)),\"vide\",LOOKUP(2.1,1/(AG135:BG135<>\"\"),AG135:BG135))","v":"vide"},{"$f":"SUMPRODUCT((AG135:BF135<>\"\")*1)","v":0}]
[{"$nulls":31},{"$f":"trame_planning_machine!$C$8","v":"di 3"},"","","","","","","","","","","","","","","","","","","","","","","","","","","","vide",0]
[{"$nulls":31},{"$f":"trame_planning_machine!$C$9","v":"lu 4"},"","","","","","","","","","","","","","","","","","","","","","","","","","","","vide",0]
[{"$nulls":31},{"$f":"trame_planning_machine!$C$10","v":"ma 5"},"","","","","","","","","","","","","","","","","","","","","","","","","","","","vide",0]
[{"$nulls":31},{"$f":"trame_planning_machine!$C$11","v":"me 6"},"","","","","","","","","","","","","","","","","","","","","","","","","","","","vide",0]
[{"$nulls":31},{"$f":"trame_planning_machine!$C$12","v":"je 7"},"","","","","","","","","","","","","","","","","","","","","","","","","","","","vide",0]
[{"$nulls":31},{"$f":"trame_planning_machine!$C$13","v":"ve 8"},"","","","","","","","","","","","","","","","","","","","","","","","","","","","vide",0]
[{"$nulls":31},{"$f":"trame_planning_machine!$C$14","v":"sa 9"},"","","","","","","","","","","","","","","","","","","","","","","","","","","","vide",0]
[{"$nulls":31},{"$f":"trame_planning_machine!$C$15","v":"di 10"},"","","","","","","","","","","","","","","","","","","","","","","","","","","","vide",0]
[{"$nulls":31},{"$f":"trame_planning_machine!$C$16","v":"lu 11"},"","","","","","","","","","","","","","","","","","","","","","","","","","","","vide",0]
[{"$nulls":31},{"$f":"trame_planning_machine!$C$17","v":"ma 12"},"","","","","","","","","","","","","","","","","","","","","","","","","","","","vide",0]
[{"$nulls":31},{"$f":"trame_planning_machine!$C$18","v":"me 13"},"","","","","","","","","","","","","","","","","","","","","","","","","","","","vide",0]
[{"$nulls":31},{"$f":"trame_planning_machine!$C$19","v":"je 14"},"","","","","","","","","","","","","","","","","","","","","","","","","","","","vide",0]
[{"$nulls":31},{"$f":"trame_planning_machine!$C$20","v":"ve 15"},"","","","","","","","","","","","","","","","","","","","","","","","","","","","vide",0]
[{"$nulls":31},{"$f":"trame_planning_machine!$C$21","v":"sa 16"},"","","","","","","","","","","","","","","","","","","","","","","","","","","","vide",0]
[{"$nulls":31},{"$f":"trame_planning_machine!$C$22","v":"di 17"},"","","","","","","","","","","","","","","","","","","","","","","","","","","","vide",0]
[{"$nulls":31},{"$f":"trame_planning_machine!$C$23","v":"lu 18"},"","","","","","","","","","","","","","","","","","","","","","","","","","","","vide",0]
[{"$nulls":31},{"$f":"trame_planning_machine!$C$24","v":"ma 19"},"","","","","","","","","","","","","","","","","","","","","","","","","","","","vide",0]
[{"$nulls":31},{"$f":"trame_planning_machine!$C$25","v":"me 20"},"","","","","","","","","","","","","","","","","","","","","","","","","","","","vide",0]
[{"$nulls":31},{"$f":"trame_planning_machine!$C$26","v":"je 21"},"","","","","","","","","","","","","","","","","","","","","","","","","","","","vide",0]
[{"$nulls":31},{"$f":"trame_planning_machine!$C$27","v":"ve 22"},"","","","","","","","","","","","","","","","","","","","","","","","","","","","vide",0]
[{"$nulls":31},{"$f":"trame_planning_machine!$C$28","v":"sa 23"},"","","","","","","","","","","","","","","","","","","","","","","","","","","","vide",0]
[{"$nulls":31},{"$f":"trame_planning_machine!$C$29","v":"di 24"},"","","","","","","","","","","","","","","","","","","","","","","","","","","","vide",0]
[{"$nulls":31},{"$f":"trame_planning_machine!$C$30","v":"lu 25"},"","","","","","","","","","","","","","","","","","","","","","","","","","","","vide",0]
[{"$nulls":31},{"$f":"trame_planning_machine!$C$31","v":"ma 26"},"","","","","","","","","","","","","","","","","","","","","","","","","","","","vide",0]
[{"$nulls":31},{"$f":"trame_planning_machine!$C$32","v":"me 27"},"","","","","","","","","","","","","","","","","","","","","","","","","","","","vide",0]
[{"$nulls":31},{"$f":"trame_planning_machine!$C$33","v":"je 28"},"","","","","","","","","","","","","","","","","","","","","","","","","","","","vide",0]
[{"$nulls":31},{"$f":"trame_planning_machine!$C$34","v":"ve 29"},"","","","","","","","","","","","","","","","","","","","","","","","","","","","vide",0]
[{"$nulls":31},{"$f":"trame_planning_machine!$C$35","v":"sa 30"},"","","","","","","","","","","","","","","","","","","","","","","","","","","","vide",0]
[{"$nulls":31},{"$f":"trame_planning_machine!$C$36","v":"di 31"},"","","","","","","","","","","","","","","","","","","","","","","","","","","","vide",0]
[]
[{"$nulls":60},{"$f":"BH167","v":"vide"},{"$f":"BH168","v":"vide"},{"$f":"BH169","v":"vide"},{"$f":"BH170","v":"vide"},{"$f":"BH171","v":"vide"},{"$f":"BH172","v":"vide"},{"$f":"BH173","v":"vide"},{"$f":"BH174","v":"vide"},{"$f":"BH175","v":"vide"},{"$f":"BH176","v":"vide"},{"$f":"BH177","v":"vide"},{"$f":"BH178","v":"vide"},{"$f":"BH179","v":"vide"},{"$f":"BH180","v":"vide"},{"$f":"BH181","v":"vide"},{"$f":"BH182","v":"vide"},{"$f":"BH183","v":"vide"},{"$f":"BH184","v":"vide"},{"$f":"BH185","v":"vide"},{"$f":"BH186","v":"vide"},{"$f":"BH187","v":"vide"},{"$f":"BH188","v":"vide"},{"$f":"BH189","v":"vide"},{"$f":"BH190","v":"vide"},{"$f":"BH191","v":"vide"},{"$f":"BH192","v":"vide"},{"$f":"BH193","v":"vide"},{"$f":"BH194","v":"vide"},{"$f":"BH195","v":"vide"},{"$f":"BH196","v":"vide"},{"$f":"BH197","v":"vide"}]
[{"$nulls":30},"IP",{"$f":"trame_planning_machine!$C$6","v":"ve 1"},{"$f":"IF(D2=$AE$167,D$1,\"\")","v":""},{"$f":"IF(E2=$AE$167,E$1,\"\")","v":""},"","","","","","","","","","","","","","","","","","","","","","",{"$f":"IF(ISERROR(SEARCH(\"IP*\",$AB$2)),\"\",$AB$1)","v":""},{"$f":"IF(ISERROR(SEARCH(\"IP*\",$AC$2)),\"\",$AC$1)","v":""},{"$f":"IF(BI167>1,\"DOUB\",\"\")","v":""},{"$f":"IF(ISNA(LOOKUP(2.1,1/(AG167:BG167<>\"\"),AG167:BG167)),\"vide\",LOOKUP(2.1,1/(AG167:BG167<>\"\"),AG167:BG167))","v":"vide"},{"$f":"SUMPRODUCT((AG167:BF167<>\"\")*1)","v":0}]
[{"$nulls":31},{"$f":"trame_planning_machine!$C$7","v":"sa 2"},{"$f":"IF(D3=$AE$167,D$1,\"\")","v":""},{"$f":"IF(E3=$AE$167,E$1,\"\")","v":""},{"$f":"IF(F3=$AE$167,F$1,\"\")","v":""},{"$f":"IF(G3=$AE$167,G$1,\"\")","v":""},{"$f":"IF(H3=$AE$167,H$1,\"\")","v":""},{"$f":"IF(I3=$AE$167,I$1,\"\")","v":""},{"$f":"IF(J3=$AE$167,J$1,\"\")","v":""},{"$f":"IF(K3=$AE$167,K$1,\"\")","v":""},{"$f":"IF(L3=$AE$167,L$1,\"\")","v":""},{"$f":"IF(M3=$AE$167,M$1,\"\")","v":""},{"$f":"IF(N3=$AE$167,N$1,\"\")","v":""},{"$f":"IF(O3=$AE$167,O$1,\"\")","v":""},{"$f":"IF(P3=$AE$167,P$1,\"\")","v":""},{"$f":"IF(Q3=$AE$167,Q$1,\"\")","v":""},{"$f":"IF(R3=$AE$167,R$1,\"\")","v":""},{"$f":"IF(S3=$AE$167,S$1,\"\")","v":""},{"$f":"IF(T3=$AE$167,T$1,\"\")","v":""},{"$f":"IF(U3=$AE$167,U$1,\"\")","v":""},{"$f":"IF(V3=$AE$167,V$1,\"\")","v":""},{"$f":"IF(W3=$AE$167,W$1,\"\")","v":""},{"$f":"IF(X3=$AE$167,X$1,\"\")","v":""},{"$f":"IF(Y3=$AE$167,Y$1,\"\")","v":""},{"$f":"IF(Z3=$AE$167,Z$1,\"\")","v":""},{"$f":"IF(AA3=$AE$167,AA$1,\"\")","v":""},{"$f":"IF(ISERROR(SEARCH(\"IP*\",$AB$2)),\"\",$AB$1)","v":""},{"$f":"IF(ISERROR(SEARCH(\"IP*\",$AC$2)),\"\",$AC$1)","v":""},{"$f":"IF(BI168>1,\"DOUB\",\"\")","v":""},{"$f":"IF(ISNA(LOOKUP(2.1,1/(AG168:BG168<>\"\"),AG168:BG168)),\"vide\",LOOKUP(2.1,1/(AG168:BG168<>\"\"),AG168:BG168))","v":"vide"},{"$f":"SUMPRODUCT((AG168:BF168<>\"\")*1)","v":0}]
[{"$nulls":31},{"$f":"trame_planning_machine!$C$8","v":"di 3"},"","","","","","","","","","","","","","","","","","","","","","","","","","","","vide",0]
[{"$nulls":31},{"$f":"trame_planning_machine!$C$9","v":"lu 4"},"","","","","","","","","","","","","","","","","","","","","","","","","","","","vide",0]
[{"$nulls":31},{"$f":"trame_planning_machine!$C$10","v":"ma 5"},"","","","","","","","","","","","","","","","","","","","","","","","","","","","vide",0]
[{"$nulls":31},{"$f":"trame_planning_machine!$C$11","v":"me 6"},"","","","","","","","","","","","","","","","","","","","","","","","","","","","vide",0]
[{"$nulls":31},{"$f":"trame_planning_machine!$C$12","v":"je 7"},"","","","","","","","","","","","","","","","","","","","","","","","","","","","vide",0]
[{"$nulls":31},{"$f":"trame_planning_machine!$C$13","v":"ve 8"},"","","","","","","","","","","","","","","","","","","","","","","","","","","","vide",0]
[{"$nulls":31},{"$f":"trame_planning_machine!$C$14","v":"sa 9"},"","","","","","","","","","","","","","","","","","","","","","","","","","","","vide",0]
[{"$nulls":31},{"$f":"trame_planning_machine!$C$15","v":"di 10"},"","","","","","","","","","","","","","","","","","","","","","","","","","","","vide",0]
[{"$nulls":31},{"$f":"trame_planning_machine!$C$16","v":"lu 11"},"","","","","","","","","","","","","","","","","","","","","","","","","","","","vide",0]
[{"$nulls":31},{"$f":"trame_planning_machine!$C$17","v":"ma 12"},"","","","","","","","","","","","","","","","","","","","","","","","","","","","vide",0]
[{"$nulls":31},{"$f":"trame_planning_machine!$C$18","v":"me 13"},"","","","","","","","","","","","","","","","","","","","","","","","","","","","vide",0]
[{"$nulls":31},{"$f":"trame_planning_machine!$C$19","v":"je 14"},"","","","","","","","","","","","","","","","","","","","","","","","","","","","vide",0]
[{"$nulls":31},{"$f":"trame_planning_machine!$C$20","v":"ve 15"},"","","","","","","","","","","","","","","","","","","","","","","","","","","","vide",0]
[{"$nulls":31},{"$f":"trame_planning_machine!$C$21","v":"sa 16"},"","","","","","","","","","","","","","","","","","","","","","","","","","","","vide",0]
[{"$nulls":31},{"$f":"trame_planning_machine!$C$22","v":"di 17"},"","","","","","","","","","","","","","","","","","","","","","","","","","","","vide",0]
[{"$nulls":31},{"$f":"trame_planning_machine!$C$23","v":"lu 18"},"","","","","","","","","","","","","","","","","","","","","","","","","","","","vide",0]
[{"$nulls":31},{"$f":"trame_planning_machine!$C$24","v":"ma 19"},"","","","","","","","","","","","","","","","","","","","","","","","","","","","vide",0]
[{"$nulls":31},{"$f":"trame_planning_machine!$C$25","v":"me 20"},"","","","","","","","","","","","","","","","","","","","","","","","","","","","vide",0]
[{"$nulls":31},{"$f":"trame_planning_machine!$C$26","v":"je 21"},"","","","","","","","","","","","","","","","","","","","","","","","","","","","vide",0]
[{"$nulls":31},{"$f":"trame_planning_machine!$C$27","v":"ve 22"},"","","","","","","","","","","","","","","","","","","","","","","","","","","","vide",0]
[{"$nulls":31},{"$f":"trame_planning_machine!$C$28","v":"sa 23"},"","","","","","","","","","","","","","","","","","","","","","","","","","","","vide",0]
[{"$nulls":31},{"$f":"trame_planning_machine!$C$29","v":"di 24"},"","","","","","","","","","","","","","","","","","","","","","","","","","","","vide",0]
[{"$nulls":31},{"$f":"trame_planning_machine!$C$30","v":"lu 25"},"","","","","","","","","","","","","","","","","","","","","","","","","","","","vide",0]
[{"$nulls":31},{"$f":"trame_planning_machine!$C$31","v":"ma 26"},"","","","","","","","","","","","","","","","","","","","","","","","","","","","vide",0]
[{"$nulls":31},{"$f":"trame_planning_machine!$C$32","v":"me 27"},"","","","","","","","","","","","","","","","","","","","","","","","","","","","vide",0]
[{"$nulls":31},{"$f":"trame_planning_machine!$C$33","v":"je 28"},"","","","","","","","","","","","","","","","","","","","","","","","","","","","vide",0]
[{"$nulls":31},{"$f":"trame_planning_machine!$C$34","v":"ve 29"},"","","","","","","","","","","","","","","","","","","","","","","","","","","","vide",0]
[{"$nulls":31},{"$f":"trame_planning_machine!$C$35","v":"sa 30"},"","","","","","","","","","","","","","","","","","","","","","","","","","","","vide",0]
[{"$nulls":31},{"$f":"trame_planning_machine!$C$36","v":"di 31"},"","","","","","","","","","","","","","","","","","","","","","","","","","","","vide",0]
[]
[{"$nulls":60},{"$f":"BH200","v":"vide"},{"$f":"BH201","v":"vide"},{"$f":"BH202","v":"vide"},{"$f":"BH203","v":"vide"},{"$f":"BH204","v":"vide"},{"$f":"BH205","v":"vide"},{"$f":"BH206","v":"vide"},{"$f":"BH207","v":"vide"},{"$f":"BH208","v":"vide"},{"$f":"BH209","v":"vide"},{"$f":"BH210","v":"vide"},{"$f":"BH211","v":"vide"},{"$f":"BH212","v":"vide"},{"$f":"BH213","v":"vide"},{"$f":"BH214","v":"vide"},{"$f":"BH215","v":"vide"},{"$f":"BH216","v":"vide"},{"$f":"BH217","v":"vide"},{"$f":"BH218","v":"vide"},{"$f":"BH219","v":"vide"},{"$f":"BH220","v":"vide"},{"$f":"BH221","v":"vide"},{"$f":"BH222","v":"vide"},{"$f":"BH223","v":"vide"},{"$f":"BH224","v":"vide"},{"$f":"BH225","v":"vide"},{"$f":"BH226","v":"vide"},{"$f":"BH227","v":"vide"},{"$f":"BH228","v":"vide"},{"$f":"BH229","v":"vide"},{"$f":"BH230","v":"vide"}]
[{"$nulls":30},"MG",{"$f":"trame_planning_machine!$C$6","v":"ve 1"},{"$f":"IF(D2=$AE$200,D$1,\"\")","v":""},{"$f":"IF(E2=$AE$200,E$1,\"\")","v":""},"","","","","","","","","","","","","","","","","","","","","","",{"$f":"IF(ISERROR(SEARCH(\"MG*\",$AB$2)),\"\",$AB$1)","v":""},{"$f":"IF(ISERROR(SEARCH(\"MG*\",$AC$2)),\"\",$AC$1)","v":""},{"$f":"IF(BI200>1,\"DOUB\",\"\")","v":""},{"$f":"IF(ISNA(LOOKUP(2.1,1/(AG200:BG200<>\"\"),AG200:BG200)),\"vide\",LOOKUP(2.1,1/(AG200:BG200<>\"\"),AG200:BG200))","v":"vide"},{"$f":"SUMPRODUCT((AG200:BF200<>\"\")*1)","v":0}]
[{"$nulls":31},{"$f":"trame_planning_machine!$C$7","v":"sa 2"},{"$f":"IF(D3=$AE$200,D$1,\"\")","v":""},{"$f":"IF(E3=$AE$200,E$1,\"\")","v":""},{"$f":"IF(F3=$AE$200,F$1,\"\")","v":""},{"$f":"IF(G3=$AE$200,G$1,\"\")","v":""},{"$f":"IF(H3=$AE$200,H$1,\"\")","v":""},{"$f":"IF(I3=$AE$200,I$1,\"\")","v":""},{"$f":"IF(J3=$AE$200,J$1,\"\")","v":""},{"$f":"IF(K3=$AE$200,K$1,\"\")","v":""},{"$f":"IF(L3=$AE$200,L$1,\"\")","v":""},{"$f":"IF(M3=$AE$200,M$1,\"\")","v":""},{"$f":"IF(N3=$AE$200,N$1,\"\")","v":""},{"$f":"IF(O3=$AE$200,O$1,\"\")","v":""},{"$f":"IF(P3=$AE$200,P$1,\"\")","v":""},{"$f":"IF(Q3=$AE$200,Q$1,\"\")","v":""},{"$f":"IF(R3=$AE$200,R$1,\"\")","v":""},{"$f":"IF(S3=$AE$200,S$1,\"\")","v":""},{"$f":"IF(T3=$AE$200,T$1,\"\")","v":""},{"$f":"IF(U3=$AE$200,U$1,\"\")","v":""},{"$f":"IF(V3=$AE$200,V$1,\"\")","v":""},{"$f":"IF(W3=$AE$200,W$1,\"\")","v":""},{"$f":"IF(X3=$AE$200,X$1,\"\")","v":""},{"$f":"IF(Y3=$AE$200,Y$1,\"\")","v":""},{"$f":"IF(Z3=$AE$200,Z$1,\"\")","v":""},{"$f":"IF(AA3=$AE$200,AA$1,\"\")","v":""},{"$f":"IF(ISERROR(SEARCH(\"MG*\",$AB$2)),\"\",$AB$1)","v":""},{"$f":"IF(ISERROR(SEARCH(\"MG*\",$AC$2)),\"\",$AC$1)","v":""},{"$f":"IF(BI201>1,\"DOUB\",\"\")","v":""},{"$f":"IF(ISNA(LOOKUP(2.1,1/(AG201:BG201<>\"\"),AG201:BG201)),\"vide\",LOOKUP(2.1,1/(AG201:BG201<>\"\"),AG201:BG201))","v":"vide"},{"$f":"SUMPRODUCT((AG201:BF201<>\"\")*1)","v":0}]
[{"$nulls":31},{"$f":"trame_planning_machine!$C$8","v":"di 3"},"","","","","","","","","","","","","","","","","","","","","","","","","","","","vide",0]
[{"$nulls":31},{"$f":"trame_planning_machine!$C$9","v":"lu 4"},"","","","","","","","","","","","","","","","","","","","","","","","","","","","vide",0]
[{"$nulls":31},{"$f":"trame_planning_machine!$C$10","v":"ma 5"},"","","","","","","","","","","","","","","","","","","","","","","","","","","","vide",0]
[{"$nulls":31},{"$f":"trame_planning_machine!$C$11","v":"me 6"},"","","","","","","","","","","","","","","","","","","","","","","","","","","","vide",0]
[{"$nulls":31},{"$f":"trame_planning_machine!$C$12","v":"je 7"},"","","","","","","","","","","","","","","","","","","","","","","","","","","","vide",0]
[{"$nulls":31},{"$f":"trame_planning_machine!$C$13","v":"ve 8"},"","","","","","","","","","","","","","","","","","","","","","","","","","","","vide",0]
[{"$nulls":31},{"$f":"trame_planning_machine!$C$14","v":"sa 9"},"","","","","","","","","","","","","","","","","","","","","","","","","","","","vide",0]
[{"$nulls":31},{"$f":"trame_planning_machine!$C$15","v":"di 10"},"","","","","","","","","","","","","","","","","","","","","","","","","","","","vide",0]
[{"$nulls":31},{"$f":"trame_planning_machine!$C$16","v":"lu 11"},"","","","","","","","","","","","","","","","","","","","","","","","","","","","vide",0]
[{"$nulls":31},{"$f":"trame_planning_machine!$C$17","v":"ma 12"},"","","","","","","","","","","","","","","","","","","","","","","","","","","","vide",0]
[{"$nulls":31},{"$f":"trame_planning_machine!$C$18","v":"me 13"},"","","","","","","","","","","","","","","","","","","","","","","","","","","","vide",0]
[{"$nulls":31},{"$f":"trame_planning_machine!$C$19","v":"je 14"},"","","","","","","","","","","","","","","","","","","","","","","","","","","","vide",0]
[{"$nulls":31},{"$f":"trame_planning_machine!$C$20","v":"ve 15"},"","","","","","","","","","","","","","","","","","","","","","","","","","","","vide",0]
[{"$nulls":31},{"$f":"trame_planning_machine!$C$21","v":"sa 16"},"","","","","","","","","","","","","","","","","","","","","","","","","","","","vide",0]
[{"$nulls":31},{"$f":"trame_planning_machine!$C$22","v":"di 17"},"","","","","","","","","","","","","","","","","","","","","","","","","","","","vide",0]
[{"$nulls":31},{"$f":"trame_planning_machine!$C$23","v":"lu 18"},"","","","","","","","","","","","","","","","","","","","","","","","","","","","vide",0]
[{"$nulls":31},{"$f":"trame_planning_machine!$C$24","v":"ma 19"},"","","","","","","","","","","","","","","","","","","","","","","","","","","","vide",0]
[{"$nulls":31},{"$f":"trame_planning_machine!$C$25","v":"me 20"},"","","","","","","","","","","","","","","","","","","","","","","","","","","","vide",0]
[{"$nulls":31},{"$f":"trame_planning_machine!$C$26","v":"je 21"},"","","","","","","","","","","","","","","","","","","","","","","","","","","","vide",0]
[{"$nulls":31},{"$f":"trame_planning_machine!$C$27","v":"ve 22"},"","","","","","","","","","","","","","","","","","","","","","","","","","","","vide",0]
[{"$nulls":31},{"$f":"trame_planning_machine!$C$28","v":"sa 23"},"","","","","","","","","","","","","","","","","","","","","","","","","","","","vide",0]
[{"$nulls":31},{"$f":"trame_planning_machine!$C$29","v":"di 24"},"","","","","","","","","","","","","","","","","","","","","","","","","","","","vide",0]
[{"$nulls":31},{"$f":"trame_planning_machine!$C$30","v":"lu 25"},"","","","","","","","","","","","","","","","","","","","","","","","","","","","vide",0]
[{"$nulls":31},{"$f":"trame_planning_machine!$C$31","v":"ma 26"},"","","","","","","","","","","","","","","","","","","","","","","","","","","","vide",0]
[{"$nulls":31},{"$f":"trame_planning_machine!$C$32","v":"me 27"},"","","","","","","","","","","","","","","","","","","","","","","","","","","","vide",0]
[{"$nulls":31},{"$f":"trame_planning_machine!$C$33","v":"je 28"},"","","","","","","","","","","","","","","","","","","","","","","","","","","","vide",0]
[{"$nulls":31},{"$f":"trame_planning_machine!$C$34","v":"ve 29"},"","","","","","","","","","","","","","","","","","","","","","","","","","","","vide",0]
[{"$nulls":31},{"$f":"trame_planning_machine!$C$35","v":"sa 30"},"","","","","","","","","","","","","","","","","","","","","","","","","","","","vide",0]
[{"$nulls":31},{"$f":"trame_planning_machine!$C$36","v":"di 31"},"","","","","","","","","","","","","","","","","","","","","","","","","","","","vide",0]
[]
[{"$nulls":60},{"$f":"BH233","v":"vide"},{"$f":"BH234","v":"vide"},{"$f":"BH235","v":"vide"},{"$f":"BH236","v":"vide"},{"$f":"BH237","v":"vide"},{"$f":"BH238","v":"vide"},{"$f":"BH239","v":"vide"},{"$f":"BH240","v":"vide"},{"$f":"BH241","v":"vide"},{"$f":"BH242","v":"vide"},{"$f":"BH243","v":"vide"},{"$f":"BH244","v":"vide"},{"$f":"BH245","v":"vide"},{"$f":"BH246","v":"vide"},{"$f":"BH247","v":"vide"},{"$f":"BH248","v":"vide"},{"$f":"BH249","v":"vide"},{"$f":"BH250","v":"vide"},{"$f":"BH251","v":"vide"},{"$f":"BH252","v":"vide"},{"$f":"BH253","v":"vide"},{"$f":"BH254","v":"vide"},{"$f":"BH255","v":"vide"},{"$f":"BH256","v":"vide"},{"$f":"BH257","v":"vide"},{"$f":"BH258","v":"vide"},{"$f":"BH259","v":"vide"},{"$f":"BH260","v":"vide"},{"$f":"BH261","v":"vide"},{"$f":"BH262","v":"vide"},{"$f":"BH263","v":"vide"}]
[{"$nulls":30},"ML",{"$f":"trame_planning_machine!$C$6","v":"ve 1"},{"$f":"IF(D2=$AE$233,D$1,\"\")","v":""},{"$f":"IF(E2=$AE$233,E$1,\"\")","v":""},"","","","","","","","","","","","","","","","","","","","","","",{"$f":"IF(ISERROR(SEARCH(\"ML*\",$AB$2)),\"\",$AB$1)","v":""},{"$f":"IF(ISERROR(SEARCH(\"ML*\",$AC$2)),\"\",$AC$1)","v":""},{"$f":"IF(BI233>1,\"DOUB\",\"\")","v":""},{"$f":"IF(ISNA(LOOKUP(2.1,1/(AG233:BG233<>\"\"),AG233:BG233)),\"vide\",LOOKUP(2.1,1/(AG233:BG233<>\"\"),AG233:BG233))","v":"vide"},{"$f":"SUMPRODUCT((AG233:BF233<>\"\")*1)","v":0}]
[{"$nulls":31},{"$f":"trame_planning_machine!$C$7","v":"sa 2"},{"$f":"IF(D3=$AE$233,D$1,\"\")","v":""},{"$f":"IF(E3=$AE$233,E$1,\"\")","v":""},{"$f":"IF(F3=$AE$233,F$1,\"\")","v":""},{"$f":"IF(G3=$AE$233,G$1,\"\")","v":""},{"$f":"IF(H3=$AE$233,H$1,\"\")","v":""},{"$f":"IF(I3=$AE$233,I$1,\"\")","v":""},{"$f":"IF(J3=$AE$233,J$1,\"\")","v":""},{"$f":"IF(K3=$AE$233,K$1,\"\")","v":""},{"$f":"IF(L3=$AE$233,L$1,\"\")","v":""},{"$f":"IF(M3=$AE$233,M$1,\"\")","v":""},{"$f":"IF(N3=$AE$233,N$1,\"\")","v":""},{"$f":"IF(O3=$AE$233,O$1,\"\")","v":""},{"$f":"IF(P3=$AE$233,P$1,\"\")","v":""},{"$f":"IF(Q3=$AE$233,Q$1,\"\")","v":""},{"$f":"IF(R3=$AE$233,R$1,\"\")","v":""},{"$f":"IF(S3=$AE$233,S$1,\"\")","v":""},{"$f":"IF(T3=$AE$233,T$1,\"\")","v":""},{"$f":"IF(U3=$AE$233,U$1,\"\")","v":""},{"$f":"IF(V3=$AE$233,V$1,\"\")","v":""},{"$f":"IF(W3=$AE$233,W$1,\"\")","v":""},{"$f":"IF(X3=$AE$233,X$1,\"\")","v":""},{"$f":"IF(Y3=$AE$233,Y$1,\"\")","v":""},{"$f":"IF(Z3=$AE$233,Z$1,\"\")","v":""},{"$f":"IF(AA3=$AE$233,AA$1,\"\")","v":""},{"$f":"IF(ISERROR(SEARCH(\"ML*\",$AB$2)),\"\",$AB$1)","v":""},{"$f":"IF(ISERROR(SEARCH(\"ML*\",$AC$2)),\"\",$AC$1)","v":""},{"$f":"IF(BI234>1,\"DOUB\",\"\")","v":""},{"$f":"IF(ISNA(LOOKUP(2.1,1/(AG234:BG234<>\"\"),AG234:BG234)),\"vide\",LOOKUP(2.1,1/(AG234:BG234<>\"\"),AG234:BG234))","v":"vide"},{"$f":"SUMPRODUCT((AG234:BF234<>\"\")*1)","v":0}]
[{"$nulls":31},{"$f":"trame_planning_machine!$C$8","v":"di 3"},"","","","","","","","","","","","","","","","","","","","","","","","","","","","vide",0]
[{"$nulls":31},{"$f":"trame_planning_machine!$C$9","v":"lu 4"},"","","","","","","","","","","","","","","","","","","","","","","","","","","","vide",0]
[{"$nulls":31},{"$f":"trame_planning_machine!$C$10","v":"ma 5"},"","","","","","","","","","","","","","","","","","","","","","","","","","","","vide",0]
[{"$nulls":31},{"$f":"trame_planning_machine!$C$11","v":"me 6"},"","","","","","","","","","","","","","","","","","","","","","","","","","","","vide",0]
[{"$nulls":31},{"$f":"trame_planning_machine!$C$12","v":"je 7"},"","","","","","","","","","","","","","","","","","","","","","","","","","","","vide",0]
[{"$nulls":31},{"$f":"trame_planning_machine!$C$13","v":"ve 8"},"","","","","","","","","","","","","","","","","","","","","","","","","","","","vide",0]
[{"$nulls":31},{"$f":"trame_planning_machine!$C$14","v":"sa 9"},"","","","","","","","","","","","","","","","","","","","","","","","","","","","vide",0]
[{"$nulls":31},{"$f":"trame_planning_machine!$C$15","v":"di 10"},"","","","","","","","","","","","","","","","","","","","","","","","","","","","vide",0]
[{"$nulls":31},{"$f":"trame_planning_machine!$C$16","v":"lu 11"},"","","","","","","","","","","","","","","","","","","","","","","","","","","","vide",0]
[{"$nulls":31},{"$f":"trame_planning_machine!$C$17","v":"ma 12"},"","","","","","","","","","","","","","","","","","","","","","","","","","","","vide",0]
[{"$nulls":31},{"$f":"trame_planning_machine!$C$18","v":"me 13"},"","","","","","","","","","","","","","","","","","","","","","","","","","","","vide",0]
[{"$nulls":31},{"$f":"trame_planning_machine!$C$19","v":"je 14"},"","","","","","","","","","","","","","","","","","","","","","","","","","","","vide",0]
[{"$nulls":31},{"$f":"trame_planning_machine!$C$20","v":"ve 15"},"","","","","","","","","","","","","","","","","","","","","","","","","","","","vide",0]
[{"$nulls":31},{"$f":"trame_planning_machine!$C$21","v":"sa 16"},"","","","","","","","","","","","","","","","","","","","","","","","","","","","vide",0]
[{"$nulls":31},{"$f":"trame_planning_machine!$C$22","v":"di 17"},"","","","","","","","","","","","","","","","","","","","","","","","","","","","vide",0]
[{"$nulls":31},{"$f":"trame_planning_machine!$C$23","v":"lu 18"},"","","","","","","","","","","","","","","","","","","","","","","","","","","","vide",0]
[{"$nulls":31},{"$f":"trame_planning_machine!$C$24","v":"ma 19"},"","","","","","","","","","","","","","","","","","","","","","","","","","","","vide",0]
[{"$nulls":31},{"$f":"trame_planning_machine!$C$25","v":"me 20"},"","","","","","","","","","","","","","","","","","","","","","","","","","","","vide",0]
[{"$nulls":31},{"$f":"trame_planning_machine!$C$26","v":"je 21"},"","","","","","","","","","","","","","","","","","","","","","","","","","","","vide",0]
[{"$nulls":31},{"$f":"trame_planning_machine!$C$27","v":"ve 22"},"","","","","","","","","","","","","","","","","","","","","","","","","","","","vide",0]
[{"$nulls":31},{"$f":"trame_planning_machine!$C$28","v":"sa 23"},"","","","","","","","","","","","","","","","","","","","","","","","","","","","vide",0]
[{"$nulls":31},{"$f":"trame_planning_machine!$C$29","v":"di 24"},"","","","","","","","","","","","","","","","","","","","","","","","","","","","vide",0]
[{"$nulls":31},{"$f":"trame_planning_machine!$C$30","v":"lu 25"},"","","","","","","","","","","","","","","","","","","","","","","","","","","","vide",0]
[{"$nulls":31},{"$f":"trame_planning_machine!$C$31","v":"ma 26"},"","","","","","","","","","","","","","","","","","","","","","","","","","","","vide",0]
[{"$nulls":31},{"$f":"trame_planning_machine!$C$32","v":"me 27"},"","","","","","","","","","","","","","","","","","","","","","","","","","","","vide",0]
[{"$nulls":31},{"$f":"trame_planning_machine!$C$33","v":"je 28"},"","","","","","","","","","","","","","","","","","","","","","","","","","","","vide",0]
[{"$nulls":31},{"$f":"trame_planning_machine!$C$34","v":"ve 29"},"","","","","","","","","","","","","","","","","","","","","","","","","","","","vide",0]
[{"$nulls":31},{"$f":"trame_planning_machine!$C$35","v":"sa 30"},"","","","","","","","","","","","","","","","","","","","","","","","","","","","vide",0]
[{"$nulls":31},{"$f":"trame_planning_machine!$C$36","v":"di 31"},"","","","","","","","","","","","","","","","","","","","","","","","","","","","vide",0]
[]
[{"$nulls":60},{"$f":"BH266","v":"vide"},{"$f":"BH267","v":"vide"},{"$f":"BH268","v":"vide"},{"$f":"BH269","v":"vide"},{"$f":"BH270","v":"vide"},{"$f":"BH271","v":"vide"},{"$f":"BH272","v":"vide"},{"$f":"BH273","v":"vide"},{"$f":"BH274","v":"vide"},{"$f":"BH275","v":"vide"},{"$f":"BH276","v":"vide"},{"$f":"BH277","v":"vide"},{"$f":"BH278","v":"vide"},{"$f":"BH279","v":"vide"},{"$f":"BH280","v":"vide"},{"$f":"BH281","v":"vide"},{"$f":"BH282","v":"vide"},{"$f":"BH283","v":"vide"},{"$f":"BH284","v":"vide"},{"$f":"BH285","v":"vide"},{"$f":"BH286","v":"vide"},{"$f":"BH287","v":"vide"},{"$f":"BH288","v":"vide"},{"$f":"BH289","v":"vide"},{"$f":"BH290","v":"vide"},{"$f":"BH291","v":"vide"},{"$f":"BH292","v":"vide"},{"$f":"BH293","v":"vide"},{"$f":"BH294","v":"vide"},{"$f":"BH295","v":"vide"},{"$f":"BH296","v":"vide"}]
[{"$nulls":30},"MOM",{"$f":"trame_planning_machine!$C$6","v":"ve 1"},{"$f":"IF(D2=$AE$266,D$1,\"\")","v":""},{"$f":"IF(E2=$AE$266,E$1,\"\")","v":""},"","","","","","","","","","","","","","","","","","","","","","",{"$f":"IF(ISERROR(SEARCH(\"MOM*\",$AB$2)),\"\",$AB$1)","v":""},{"$f":"IF(ISERROR(SEARCH(\"MOM*\",$AC$2)),\"\",$AC$1)","v":""},{"$f":"IF(BI266>1,\"DOUB\",\"\")","v":""},{"$f":"IF(ISNA(LOOKUP(2.1,1/(AG266:BG266<>\"\"),AG266:BG266)),\"vide\",LOOKUP(2.1,1/(AG266:BG266<>\"\"),AG266:BG266))","v":"vide"},{"$f":"SUMPRODUCT((AG266:BF266<>\"\")*1)","v":0}]
[{"$nulls":31},{"$f":"trame_planning_machine!$C$7","v":"sa 2"},{"$f":"IF(D3=$AE$266,D$1,\"\")","v":""},{"$f":"IF(E3=$AE$266,E$1,\"\")","v":""},{"$f":"IF(F3=$AE$266,F$1,\"\")","v":""},{"$f":"IF(G3=$AE$266,G$1,\"\")","v":""},{"$f":"IF(H3=$AE$266,H$1,\"\")","v":""},{"$f":"IF(I3=$AE$266,I$1,\"\")","v":""},{"$f":"IF(J3=$AE$266,J$1,\"\")","v":""},{"$f":"IF(K3=$AE$266,K$1,\"\")","v":""},{"$f":"IF(L3=$AE$266,L$1,\"\")","v":""},{"$f":"IF(M3=$AE$266,M$1,\"\")","v":""},{"$f":"IF(N3=$AE$266,N$1,\"\")","v":""},{"$f":"IF(O3=$AE$266,O$1,\"\")","v":""},{"$f":"IF(P3=$AE$266,P$1,\"\")","v":""},{"$f":"IF(Q3=$AE$266,Q$1,\"\")","v":""},{"$f":"IF(R3=$AE$266,R$1,\"\")","v":""},{"$f":"IF(S3=$AE$266,S$1,\"\")","v":""},{"$f":"IF(T3=$AE$266,T$1,\"\")","v":""},{"$f":"IF(U3=$AE$266,U$1,\"\")","v":""},{"$f":"IF(V3=$AE$266,V$1,\"\")","v":""},{"$f":"IF(W3=$AE$266,W$1,\"\")","v":""},{"$f":"IF(X3=$AE$266,X$1,\"\")","v":""},{"$f":"IF(Y3=$AE$266,Y$1,\"\")","v":""},{"$f":"IF(Z3=$AE$266,Z$1,\"\")","v":""},{"$f":"IF(AA3=$AE$266,AA$1,\"\")","v":""},{"$f":"IF(ISERROR(SEARCH(\"MOM*\",$AB$2)),\"\",$AB$1)","v":""},{"$f":"IF(ISERROR(SEARCH(\"MOM*\",$AC$2)),\"\",$AC$1)","v":""},{"$f":"IF(BI267>1,\"DOUB\",\"\")","v":""},{"$f":"IF(ISNA(LOOKUP(2.1,1/(AG267:BG267<>\"\"),AG267:BG267)),\"vide\",LOOKUP(2.1,1/(AG267:BG267<>\"\"),AG267:BG267))","v":"vide"},{"$f":"SUMPRODUCT((AG267:BF267<>\"\")*1)","v":0}]
[{"$nulls":31},{"$f":"trame_planning_machine!$C$8","v":"di 3"},"","","","","","","","","","","","","","","","","","","","","","","","","","","","vide",0]
[{"$nulls":31},{"$f":"trame_planning_machine!$C$9","v":"lu 4"},"","","","","","","","","","","","","","","","","","","","","","","","","","","","vide",0]
[{"$nulls":31},{"$f":"trame_planning_machine!$C$10","v":"ma 5"},"","","","","","","","","","","","","","","","","","","","","","","","","","","","vide",0]
[{"$nulls":31},{"$f":"trame_planning_machine!$C$11","v":"me 6"},"","","","","","","","","","","","","","","","","","","","","","","","","","","","vide",0]
[{"$nulls":31},{"$f":"trame_planning_machine!$C$12","v":"je 7"},"","","","","","","","","","","","","","","","","","","","","","","","","","","","vide",0]
[{"$nulls":31},{"$f":"trame_planning_machine!$C$13","v":"ve 8"},"","","","","","","","","","","","","","","","","","","","","","","","","","","","vide",0]
[{"$nulls":31},{"$f":"trame_planning_machine!$C$14","v":"sa 9"},"","","","","","","","","","","","","","","","","","","","","","","","","","","","vide",0]
[{"$nulls":31},{"$f":"trame_planning_machine!$C$15","v":"di 10"},"","","","","","","","","","","","","","","","","","","","","","","","","","","","vide",0]
[{"$nulls":31},{"$f":"trame_planning_machine!$C$16","v":"lu 11"},"","","","","","","","","","","","","","","","","","","","","","","","","","","","vide",0]
[{"$nulls":31},{"$f":"trame_planning_machine!$C$17","v":"ma 12"},"","","","","","","","","","","","","","","","","","","","","","","","","","","","vide",0]
[{"$nulls":31},{"$f":"trame_planning_machine!$C$18","v":"me 13"},"","","","","","","","","","","","","","","","","","","","","","","","","","","","vide",0]
[{"$nulls":31},{"$f":"trame_planning_machine!$C$19","v":"je 14"},"","","","","","","","","","","","","","","","","","","","","","","","","","","","vide",0]
[{"$nulls":31},{"$f":"trame_planning_machine!$C$20","v":"ve 15"},"","","","","","","","","","","","","","","","","","","","","","","","","","","","vide",0]
[{"$nulls":31},{"$f":"trame_planning_machine!$C$21","v":"sa 16"},"","","","","","","","","","","","","","","","","","","","","","","","","","","","vide",0]
[{"$nulls":31},{"$f":"trame_planning_machine!$C$22","v":"di 17"},"","","","","","","","","","","","","","","","","","","","","","","","","","","","vide",0]
[{"$nulls":31},{"$f":"trame_planning_machine!$C$23","v":"lu 18"},"","","","","","","","","","","","","","","","","","","","","","","","","","","","vide",0]
[{"$nulls":31},{"$f":"trame_planning_machine!$C$24","v":"ma 19"},"","","","","","","","","","","","","","","","","","","","","","","","","","","","vide",0]
[{"$nulls":31},{"$f":"trame_planning_machine!$C$25","v":"me 20"},"","","","","","","","","","","","","","","","","","","","","","","","","","","","vide",0]
[{"$nulls":31},{"$f":"trame_planning_machine!$C$26","v":"je 21"},"","","","","","","","","","","","","","","","","","","","","","","","","","","","vide",0]
[{"$nulls":31},{"$f":"trame_planning_machine!$C$27","v":"ve 22"},"","","","","","","","","","","","","","","","","","","","","","","","","","","","vide",0]
[{"$nulls":31},{"$f":"trame_planning_machine!$C$28","v":"sa 23"},"","","","","","","","","","","","","","","","","","","","","","","","","","","","vide",0]
[{"$nulls":31},{"$f":"trame_planning_machine!$C$29","v":"di 24"},"","","","","","","","","","","","","","","","","","","","","","","","","","","","vide",0]
[{"$nulls":31},{"$f":"trame_planning_machine!$C$30","v":"lu 25"},"","","","","","","","","","","","","","","","","","","","","","","","","","","","vide",0]
[{"$nulls":31},{"$f":"trame_planning_machine!$C$31","v":"ma 26"},"","","","","","","","","","","","","","","","","","","","","","","","","","","","vide",0]
[{"$nulls":31},{"$f":"trame_planning_machine!$C$32","v":"me 27"},"","","","","","","","","","","","","","","","","","","","","","","","","","","","vide",0]
[{"$nulls":31},{"$f":"trame_planning_machine!$C$33","v":"je 28"},"","","","","","","","","","","","","","","","","","","","","","","","","","","","vide",0]
[{"$nulls":31},{"$f":"trame_planning_machine!$C$34","v":"ve 29"},"","","","","","","","","","","","","","","","","","","","","","","","","","","","vide",0]
[{"$nulls":31},{"$f":"trame_planning_machine!$C$35","v":"sa 30"},"","","","","","","","","","","","","","","","","","","","","","","","","","","","vide",0]
[{"$nulls":31},{"$f":"trame_planning_machine!$C$36","v":"di 31"},"","","","","","","","","","","","","","","","","","","","","","","","","","","","vide",0]
[]
[{"$nulls":60},{"$f":"BH299","v":"vide"},{"$f":"BH300","v":"vide"},{"$f":"BH301","v":"vide"},{"$f":"BH302","v":"vide"},{"$f":"BH303","v":"vide"},{"$f":"BH304","v":"vide"},{"$f":"BH305","v":"vide"},{"$f":"BH306","v":"vide"},{"$f":"BH307","v":"vide"},{"$f":"BH308","v":"vide"},{"$f":"BH309","v":"vide"},{"$f":"BH310","v":"vide"},{"$f":"BH311","v":"vide"},{"$f":"BH312","v":"vide"},{"$f":"BH313","v":"vide"},{"$f":"BH314","v":"vide"},{"$f":"BH315","v":"vide"},{"$f":"BH316","v":"vide"},{"$f":"BH317","v":"vide"},{"$f":"BH318","v":"vide"},{"$f":"BH319","v":"vide"},{"$f":"BH320","v":"vide"},{"$f":"BH321","v":"vide"},{"$f":"BH322","v":"vide"},{"$f":"BH323","v":"vide"},{"$f":"BH324","v":"vide"},{"$f":"BH325","v":"vide"},{"$f":"BH326","v":"vide"},{"$f":"BH327","v":"vide"},{"$f":"BH328","v":"vide"},{"$f":"BH329","v":"vide"}]
[{"$nulls":30},"MP",{"$f":"trame_planning_machine!$C$6","v":"ve 1"},{"$f":"IF(D2=$AE$299,D$1,\"\")","v":""},{"$f":"IF(E2=$AE$299,E$1,\"\")","v":""},"","","","","","","","","","","","","","","","","","","","","","",{"$f":"IF(ISERROR(SEARCH(\"MP*\",$AB$2)),\"\",$AB$1)","v":""},{"$f":"IF(ISERROR(SEARCH(\"MP*\",$AC$2)),\"\",$AC$1)","v":""},{"$f":"IF(BI299>1,\"DOUB\",\"\")","v":""},{"$f":"IF(ISNA(LOOKUP(2.1,1/(AG299:BG299<>\"\"),AG299:BG299)),\"vide\",LOOKUP(2.1,1/(AG299:BG299<>\"\"),AG299:BG299))","v":"vide"},{"$f":"SUMPRODUCT((AG299:BF299<>\"\")*1)","v":0}]
[{"$nulls":31},{"$f":"trame_planning_machine!$C$7","v":"sa 2"},{"$f":"IF(D3=$AE$299,D$1,\"\")","v":""},{"$f":"IF(E3=$AE$299,E$1,\"\")","v":""},{"$f":"IF(F3=$AE$299,F$1,\"\")","v":""},{"$f":"IF(G3=$AE$299,G$1,\"\")","v":""},{"$f":"IF(H3=$AE$299,H$1,\"\")","v":""},{"$f":"IF(I3=$AE$299,I$1,\"\")","v":""},{"$f":"IF(J3=$AE$299,J$1,\"\")","v":""},{"$f":"IF(K3=$AE$299,K$1,\"\")","v":""},{"$f":"IF(L3=$AE$299,L$1,\"\")","v":""},{"$f":"IF(M3=$AE$299,M$1,\"\")","v":""},{"$f":"IF(N3=$AE$299,N$1,\"\")","v":""},{"$f":"IF(O3=$AE$299,O$1,\"\")","v":""},{"$f":"IF(P3=$AE$299,P$1,\"\")","v":""},{"$f":"IF(Q3=$AE$299,Q$1,\"\")","v":""},{"$f":"IF(R3=$AE$299,R$1,\"\")","v":""},{"$f":"IF(S3=$AE$299,S$1,\"\")","v":""},{"$f":"IF(T3=$AE$299,T$1,\"\")","v":""},{"$f":"IF(U3=$AE$299,U$1,\"\")","v":""},{"$f":"IF(V3=$AE$299,V$1,\"\")","v":""},{"$f":"IF(W3=$AE$299,W$1,\"\")","v":""},{"$f":"IF(X3=$AE$299,X$1,\"\")","v":""},{"$f":"IF(Y3=$AE$299,Y$1,\"\")","v":""},{"$f":"IF(Z3=$AE$299,Z$1,\"\")","v":""},{"$f":"IF(AA3=$AE$299,AA$1,\"\")","v":""},{"$f":"IF(ISERROR(SEARCH(\"MP*\",$AB$2)),\"\",$AB$1)","v":""},{"$f":"IF(ISERROR(SEARCH(\"MP*\",$AC$2)),\"\",$AC$1)","v":""},{"$f":"IF(BI300>1,\"DOUB\",\"\")","v":""},{"$f":"IF(ISNA(LOOKUP(2.1,1/(AG300:BG300<>\"\"),AG300:BG300)),\"vide\",LOOKUP(2.1,1/(AG300:BG300<>\"\"),AG300:BG300))","v":"vide"},{"$f":"SUMPRODUCT((AG300:BF300<>\"\")*1)","v":0}]
[{"$nulls":31},{"$f":"trame_planning_machine!$C$8","v":"di 3"},"","","","","","","","","","","","","","","","","","","","","","","","","","","","vide",0]
[{"$nulls":31},{"$f":"trame_planning_machine!$C$9","v":"lu 4"},"","","","","","","","","","","","","","","","","","","","","","","","","","","","vide",0]
[{"$nulls":31},{"$f":"trame_planning_machine!$C$10","v":"ma 5"},"","","","","","","","","","","","","","","","","","","","","","","","","","","","vide",0]
[{"$nulls":31},{"$f":"trame_planning_machine!$C$11","v":"me 6"},"","","","","","","","","","","","","","","","","","","","","","","","","","","","vide",0]
[{"$nulls":31},{"$f":"trame_planning_machine!$C$12","v":"je 7"},"","","","","","","","","","","","","","","","","","","","","","","","","","","","vide",0]
[{"$nulls":31},{"$f":"trame_planning_machine!$C$13","v":"ve 8"},"","","","","","","","","","","","","","","","","","","","","","","","","","","","vide",0]
[{"$nulls":31},{"$f":"trame_planning_machine!$C$14","v":"sa 9"},"","","","","","","","","","","","","","","","","","","","","","","","","","","","vide",0]
[{"$nulls":31},{"$f":"trame_planning_machine!$C$15","v":"di 10"},"","","","","","","","","","","","","","","","","","","","","","","","","","","","vide",0]
[{"$nulls":31},{"$f":"trame_planning_machine!$C$16","v":"lu 11"},"","","","","","","","","","","","","","","","","","","","","","","","","","","","vide",0]
[{"$nulls":31},{"$f":"trame_planning_machine!$C$17","v":"ma 12"},"","","","","","","","","","","","","","","","","","","","","","","","","","","","vide",0]
[{"$nulls":31},{"$f":"trame_planning_machine!$C$18","v":"me 13"},"","","","","","","","","","","","","","","","","","","","","","","","","","","","vide",0]
[{"$nulls":31},{"$f":"trame_planning_machine!$C$19","v":"je 14"},"","","","","","","","","","","","","","","","","","","","","","","","","","","","vide",0]
[{"$nulls":31},{"$f":"trame_planning_machine!$C$20","v":"ve 15"},"","","","","","","","","","","","","","","","","","","","","","","","","","","","vide",0]
[{"$nulls":31},{"$f":"trame_planning_machine!$C$21","v":"sa 16"},"","","","","","","","","","","","","","","","","","","","","","","","","","","","vide",0]
[{"$nulls":31},{"$f":"trame_planning_machine!$C$22","v":"di 17"},"","","","","","","","","","","","","","","","","","","","","","","","","","","","vide",0]
[{"$nulls":31},{"$f":"trame_planning_machine!$C$23","v":"lu 18"},"","","","","","","","","","","","","","","","","","","","","","","","","","","","vide",0]
[{"$nulls":31},{"$f":"trame_planning_machine!$C$24","v":"ma 19"},"","","","","","","","","","","","","","","","","","","","","","","","","","","","vide",0]
[{"$nulls":31},{"$f":"trame_planning_machine!$C$25","v":"me 20"},"","","","","","","","","","","","","","","","","","","","","","","","","","","","vide",0]
[{"$nulls":31},{"$f":"trame_planning_machine!$C$26","v":"je 21"},"","","","","","","","","","","","","","","","","","","","","","","","","","","","vide",0]
[{"$nulls":31},{"$f":"trame_planning_machine!$C$27","v":"ve 22"},"","","","","","","","","","","","","","","","","","","","","","","","","","","","vide",0]
[{"$nulls":31},{"$f":"trame_planning_machine!$C$28","v":"sa 23"},"","","","","","","","","","","","","","","","","","","","","","","","","","","","vide",0]
[{"$nulls":31},{"$f":"trame_planning_machine!$C$29","v":"di 24"},"","","","","","","","","","","","","","","","","","","","","","","","","","","","vide",0]
[{"$nulls":31},{"$f":"trame_planning_machine!$C$30","v":"lu 25"},"","","","","","","","","","","","","","","","","","","","","","","","","","","","vide",0]
[{"$nulls":31},{"$f":"trame_planning_machine!$C$31","v":"ma 26"},"","","","","","","","","","","","","","","","","","","","","","","","","","","","vide",0]
[{"$nulls":31},{"$f":"trame_planning_machine!$C$32","v":"me 27"},"","","","","","","","","","","","","","","","","","","","","","","","","","","","vide",0]
[{"$nulls":31},{"$f":"trame_planning_machine!$C$33","v":"je 28"},"","","","","","","","","","","","","","","","","","","","","","","","","","","","vide",0]
[{"$nulls":31},{"$f":"trame_planning_machine!$C$34","v":"ve 29"},"","","","","","","","","","","","","","","","","","","","","","","","","","","","vide",0]
[{"$nulls":31},{"$f":"trame_planning_machine!$C$35","v":"sa 30"},"","","","","","","","","","","","","","","","","","","","","","","","","","","","vide",0]
[{"$nulls":31},{"$f":"trame_planning_machine!$C$36","v":"di 31"},"","","","","","","","","","","","","","","","","","","","","","","","","","","","vide",0]
[]
[{"$nulls":60},{"$f":"BH332","v":"vide"},{"$f":"BH333","v":"vide"},{"$f":"BH334","v":"vide"},{"$f":"BH335","v":"vide"},{"$f":"BH336","v":"vide"},{"$f":"BH337","v":"vide"},{"$f":"BH338","v":"vide"},{"$f":"BH339","v":"vide"},{"$f":"BH340","v":"vide"},{"$f":"BH341","v":"vide"},{"$f":"BH342","v":"vide"},{"$f":"BH343","v":"vide"},{"$f":"BH344","v":"vide"},{"$f":"BH345","v":"vide"},{"$f":"BH346","v":"vide"},{"$f":"BH347","v":"vide"},{"$f":"BH348","v":"vide"},{"$f":"BH349","v":"vide"},{"$f":"BH350","v":"vide"},{"$f":"BH351","v":"vide"},{"$f":"BH352","v":"vide"},{"$f":"BH353","v":"vide"},{"$f":"BH354","v":"vide"},{"$f":"BH355","v":"vide"},{"$f":"BH356","v":"vide"},{"$f":"BH357","v":"vide"},{"$f":"BH358","v":"vide"},{"$f":"BH359","v":"vide"},{"$f":"BH360","v":"vide"},{"$f":"BH361","v":"vide"},{"$f":"BH362","v":"vide"}]
[{"$nulls":30},"OC",{"$f":"trame_planning_machine!$C$6","v":"ve 1"},{"$f":"IF(D2=$AE$332,D$1,\"\")","v":""},{"$f":"IF(E2=$AE$332,E$1,\"\")","v":""},"","","","","","","","","","","","","","","","","","","","","","",{"$f":"IF(ISERROR(SEARCH(\"OC*\",$AB$2)),\"\",$AB$1)","v":""},{"$f":"IF(ISERROR(SEARCH(\"OC*\",$AC$2)),\"\",$AC$1)","v":""},{"$f":"IF(BI332>1,\"DOUB\",\"\")","v":""},{"$f":"IF(ISNA(LOOKUP(2.1,1/(AG332:BG332<>\"\"),AG332:BG332)),\"vide\",LOOKUP(2.1,1/(AG332:BG332<>\"\"),AG332:BG332))","v":"vide"},{"$f":"SUMPRODUCT((AG332:BF332<>\"\")*1)","v":0}]
[{"$nulls":31},{"$f":"trame_planning_machine!$C$7","v":"sa 2"},{"$f":"IF(D3=$AE$332,D$1,\"\")","v":""},{"$f":"IF(E3=$AE$332,E$1,\"\")","v":""},{"$f":"IF(F3=$AE$332,F$1,\"\")","v":""},{"$f":"IF(G3=$AE$332,G$1,\"\")","v":""},{"$f":"IF(H3=$AE$332,H$1,\"\")","v":""},{"$f":"IF(I3=$AE$332,I$1,\"\")","v":""},{"$f":"IF(J3=$AE$332,J$1,\"\")","v":""},{"$f":"IF(K3=$AE$332,K$1,\"\")","v":""},{"$f":"IF(L3=$AE$332,L$1,\"\")","v":""},{"$f":"IF(M3=$AE$332,M$1,\"\")","v":""},{"$f":"IF(N3=$AE$332,N$1,\"\")","v":""},{"$f":"IF(O3=$AE$332,O$1,\"\")","v":""},{"$f":"IF(P3=$AE$332,P$1,\"\")","v":""},{"$f":"IF(Q3=$AE$332,Q$1,\"\")","v":""},{"$f":"IF(R3=$AE$332,R$1,\"\")","v":""},{"$f":"IF(S3=$AE$332,S$1,\"\")","v":""},{"$f":"IF(T3=$AE$332,T$1,\"\")","v":""},{"$f":"IF(U3=$AE$332,U$1,\"\")","v":""},{"$f":"IF(V3=$AE$332,V$1,\"\")","v":""},{"$f":"IF(W3=$AE$332,W$1,\"\")","v":""},{"$f":"IF(X3=$AE$332,X$1,\"\")","v":""},{"$f":"IF(Y3=$AE$332,Y$1,\"\")","v":""},{"$f":"IF(Z3=$AE$332,Z$1,\"\")","v":""},{"$f":"IF(AA3=$AE$332,AA$1,\"\")","v":""},{"$f":"IF(ISERROR(SEARCH(\"OC*\",$AB$2)),\"\",$AB$1)","v":""},{"$f":"IF(ISERROR(SEARCH(\"OC*\",$AC$2)),\"\",$AC$1)","v":""},{"$f":"IF(BI333>1,\"DOUB\",\"\")","v":""},{"$f":"IF(ISNA(LOOKUP(2.1,1/(AG333:BG333<>\"\"),AG333:BG333)),\"vide\",LOOKUP(2.1,1/(AG333:BG333<>\"\"),AG333:BG333))","v":"vide"},{"$f":"SUMPRODUCT((AG333:BF333<>\"\")*1)","v":0}]
[{"$nulls":31},{"$f":"trame_planning_machine!$C$8","v":"di 3"},"","","","","","","","","","","","","","","","","","","","","","","","","","","","vide",0]
[{"$nulls":31},{"$f":"trame_planning_machine!$C$9","v":"lu 4"},"","","","","","","","","","","","","","","","","","","","","","","","","","","","vide",0]
[{"$nulls":31},{"$f":"trame_planning_machine!$C$10","v":"ma 5"},"","","","","","","","","","","","","","","","","","","","","","","","","","","","vide",0]
[{"$nulls":31},{"$f":"trame_planning_machine!$C$11","v":"me 6"},"","","","","","","","","","","","","","","","","","","","","","","","","","","","vide",0]
[{"$nulls":31},{"$f":"trame_planning_machine!$C$12","v":"je 7"},"","","","","","","","","","","","","","","","","","","","","","","","","","","","vide",0]
[{"$nulls":31},{"$f":"trame_planning_machine!$C$13","v":"ve 8"},"","","","","","","","","","","","","","","","","","","","","","","","","","","","vide",0]
[{"$nulls":31},{"$f":"trame_planning_machine!$C$14","v":"sa 9"},"","","","","","","","","","","","","","","","","","","","","","","","","","","","vide",0]
[{"$nulls":31},{"$f":"trame_planning_machine!$C$15","v":"di 10"},"","","","","","","","","","","","","","","","","","","","","","","","","","","","vide",0]
[{"$nulls":31},{"$f":"trame_planning_machine!$C$16","v":"lu 11"},"","","","","","","","","","","","","","","","","","","","","","","","","","","","vide",0]
[{"$nulls":31},{"$f":"trame_planning_machine!$C$17","v":"ma 12"},"","","","","","","","","","","","","","","","","","","","","","","","","","","","vide",0]
[{"$nulls":31},{"$f":"trame_planning_machine!$C$18","v":"me 13"},"","","","","","","","","","","","","","","","","","","","","","","","","","","","vide",0]
[{"$nulls":31},{"$f":"trame_planning_machine!$C$19","v":"je 14"},"","","","","","","","","","","","","","","","","","","","","","","","","","","","vide",0]
[{"$nulls":31},{"$f":"trame_planning_machine!$C$20","v":"ve 15"},"","","","","","","","","","","","","","","","","","","","","","","","","","","","vide",0]
[{"$nulls":31},{"$f":"trame_planning_machine!$C$21","v":"sa 16"},"","","","","","","","","","","","","","","","","","","","","","","","","","","","vide",0]
[{"$nulls":31},{"$f":"trame_planning_machine!$C$22","v":"di 17"},"","","","","","","","","","","","","","","","","","","","","","","","","","","","vide",0]
[{"$nulls":31},{"$f":"trame_planning_machine!$C$23","v":"lu 18"},"","","","","","","","","","","","","","","","","","","","","","","","","","","","vide",0]
[{"$nulls":31},{"$f":"trame_planning_machine!$C$24","v":"ma 19"},"","","","","","","","","","","","","","","","","","","","","","","","","","","","vide",0]
[{"$nulls":31},{"$f":"trame_planning_machine!$C$25","v":"me 20"},"","","","","","","","","","","","","","","","","","","","","","","","","","","","vide",0]
[{"$nulls":31},{"$f":"trame_planning_machine!$C$26","v":"je 21"},"","","","","","","","","","","","","","","","","","","","","","","","","","","","vide",0]
[{"$nulls":31},{"$f":"trame_planning_machine!$C$27","v":"ve 22"},"","","","","","","","","","","","","","","","","","","","","","","","","","","","vide",0]
[{"$nulls":31},{"$f":"trame_planning_machine!$C$28","v":"sa 23"},"","","","","","","","","","","","","","","","","","","","","","","","","","","","vide",0]
[{"$nulls":31},{"$f":"trame_planning_machine!$C$29","v":"di 24"},"","","","","","","","","","","","","","","","","","","","","","","","","","","","vide",0]
[{"$nulls":31},{"$f":"trame_planning_machine!$C$30","v":"lu 25"},"","","","","","","","","","","","","","","","","","","","","","","","","","","","vide",0]
[{"$nulls":31},{"$f":"trame_planning_machine!$C$31","v":"ma 26"},"","","","","","","","","","","","","","","","","","","","","","","","","","","","vide",0]
[{"$nulls":31},{"$f":"trame_planning_machine!$C$32","v":"me 27"},"","","","","","","","","","","","","","","","","","","","","","","","","","","","vide",0]
[{"$nulls":31},{"$f":"trame_planning_machine!$C$33","v":"je 28"},"","","","","","","","","","","","","","","","","","","","","","","","","","","","vide",0]
[{"$nulls":31},{"$f":"trame_planning_machine!$C$34","v":"ve 29"},"","","","","","","","","","","","","","","","","","","","","","","","","","","","vide",0]
[{"$nulls":31},{"$f":"trame_planning_machine!$C$35","v":"sa 30"},"","","","","","","","","","","","","","","","","","","","","","","","","","","","vide",0]
[{"$nulls":31},{"$f":"trame_planning_machine!$C$36","v":"di 31"},"","","","","","","","","","","","","","","","","","","","","","","","","","","","vide",0]
[]
[{"$nulls":60},{"$f":"BH365","v":"vide"},{"$f":"BH366","v":"vide"},{"$f":"BH367","v":"vide"},{"$f":"BH368","v":"vide"},{"$f":"BH369","v":"vide"},{"$f":"BH370","v":"vide"},{"$f":"BH371","v":"vide"},{"$f":"BH372","v":"vide"},{"$f":"BH373","v":"vide"},{"$f":"BH374","v":"vide"},{"$f":"BH375","v":"vide"},{"$f":"BH376","v":"vide"},{"$f":"BH377","v":"vide"},{"$f":"BH378","v":"vide"},{"$f":"BH379","v":"vide"},{"$f":"BH380","v":"vide"},{"$f":"BH381","v":"vide"},{"$f":"BH382","v":"vide"},{"$f":"BH383","v":"vide"},{"$f":"BH384","v":"vide"},{"$f":"BH385","v":"vide"},{"$f":"BH386","v":"vide"},{"$f":"BH387","v":"vide"},{"$f":"BH388","v":"vide"},{"$f":"BH389","v":"vide"},{"$f":"BH390","v":"vide"},{"$f":"BH391","v":"vide"},{"$f":"BH392","v":"vide"},{"$f":"BH393","v":"vide"},{"$f":"BH394","v":"vide"},{"$f":"BH395","v":"vide"}]
[{"$nulls":30},"PW",{"$f":"trame_planning_machine!$C$6","v":"ve 1"},{"$f":"IF(D2=$AE$365,D$1,\"\")","v":""},{"$f":"IF(E2=$AE$365,E$1,\"\")","v":""},"","","","","","","","","","","","","","","","","","","","","","",{"$f":"IF(ISERROR(SEARCH(\"PW*\",$AB$2)),\"\",$AB$1)","v":""},{"$f":"IF(ISERROR(SEARCH(\"PW*\",$AC$2)),\"\",$AC$1)","v":""},{"$f":"IF(BI365>1,\"DOUB\",\"\")","v":""},{"$f":"IF(ISNA(LOOKUP(2.1,1/(AG365:BG365<>\"\"),AG365:BG365)),\"vide\",LOOKUP(2.1,1/(AG365:BG365<>\"\"),AG365:BG365))","v":"vide"},{"$f":"SUMPRODUCT((AG365:BF365<>\"\")*1)","v":0}]
[{"$nulls":31},{"$f":"trame_planning_machine!$C$7","v":"sa 2"},{"$f":"IF(D3=$AE$365,D$1,\"\")","v":""},{"$f":"IF(E3=$AE$365,E$1,\"\")","v":""},{"$f":"IF(F3=$AE$365,F$1,\"\")","v":""},{"$f":"IF(G3=$AE$365,G$1,\"\")","v":""},{"$f":"IF(H3=$AE$365,H$1,\"\")","v":""},{"$f":"IF(I3=$AE$365,I$1,\"\")","v":""},{"$f":"IF(J3=$AE$365,J$1,\"\")","v":""},{"$f":"IF(K3=$AE$365,K$1,\"\")","v":""},{"$f":"IF(L3=$AE$365,L$1,\"\")","v":""},{"$f":"IF(M3=$AE$365,M$1,\"\")","v":""},{"$f":"IF(N3=$AE$365,N$1,\"\")","v":""},{"$f":"IF(O3=$AE$365,O$1,\"\")","v":""},{"$f":"IF(P3=$AE$365,P$1,\"\")","v":""},{"$f":"IF(Q3=$AE$365,Q$1,\"\")","v":""},{"$f":"IF(R3=$AE$365,R$1,\"\")","v":""},{"$f":"IF(S3=$AE$365,S$1,\"\")","v":""},{"$f":"IF(T3=$AE$365,T$1,\"\")","v":""},{"$f":"IF(U3=$AE$365,U$1,\"\")","v":""},{"$f":"IF(V3=$AE$365,V$1,\"\")","v":""},{"$f":"IF(W3=$AE$365,W$1,\"\")","v":""},{"$f":"IF(X3=$AE$365,X$1,\"\")","v":""},{"$f":"IF(Y3=$AE$365,Y$1,\"\")","v":""},{"$f":"IF(Z3=$AE$365,Z$1,\"\")","v":""},{"$f":"IF(AA3=$AE$365,AA$1,\"\")","v":""},{"$f":"IF(ISERROR(SEARCH(\"PW*\",$AB$2)),\"\",$AB$1)","v":""},{"$f":"IF(ISERROR(SEARCH(\"PW*\",$AC$2)),\"\",$AC$1)","v":""},{"$f":"IF(BI366>1,\"DOUB\",\"\")","v":""},{"$f":"IF(ISNA(LOOKUP(2.1,1/(AG366:BG366<>\"\"),AG366:BG366)),\"vide\",LOOKUP(2.1,1/(AG366:BG366<>\"\"),AG366:BG366))","v":"vide"},{"$f":"SUMPRODUCT((AG366:BF366<>\"\")*1)","v":0}]
[{"$nulls":31},{"$f":"trame_planning_machine!$C$8","v":"di 3"},"","","","","","","","","","","","","","","","","","","","","","","","","","","","vide",0]
[{"$nulls":31},{"$f":"trame_planning_machine!$C$9","v":"lu 4"},"","","","","","","","","","","","","","","","","","","","","","","","","","","","vide",0]
[{"$nulls":31},{"$f":"trame_planning_machine!$C$10","v":"ma 5"},"","","","","","","","","","","","","","","","","","","","","","","","","","","","vide",0]
[{"$nulls":31},{"$f":"trame_planning_machine!$C$11","v":"me 6"},"","","","","","","","","","","","","","","","","","","","","","","","","","","","vide",0]
[{"$nulls":31},{"$f":"trame_planning_machine!$C$12","v":"je 7"},"","","","","","","","","","","","","","","","","","","","","","","","","","","","vide",0]
[{"$nulls":31},{"$f":"trame_planning_machine!$C$13","v":"ve 8"},"","","","","","","","","","","","","","","","","","","","","","","","","","","","vide",0]
[{"$nulls":31},{"$f":"trame_planning_machine!$C$14","v":"sa 9"},"","","","","","","","","","","","","","","","","","","","","","","","","","","","vide",0]
[{"$nulls":31},{"$f":"trame_planning_machine!$C$15","v":"di 10"},"","","","","","","","","","","","","","","","","","","","","","","","","","","","vide",0]
[{"$nulls":31},{"$f":"trame_planning_machine!$C$16","v":"lu 11"},"","","","","","","","","","","","","","","","","","","","","","","","","","","","vide",0]
[{"$nulls":31},{"$f":"trame_planning_machine!$C$17","v":"ma 12"},"","","","","","","","","","","","","","","","","","","","","","","","","","","","vide",0]
[{"$nulls":31},{"$f":"trame_planning_machine!$C$18","v":"me 13"},"","","","","","","","","","","","","","","","","","","","","","","","","","","","vide",0]
[{"$nulls":31},{"$f":"trame_planning_machine!$C$19","v":"je 14"},"","","","","","","","","","","","","","","","","","","","","","","","","","","","vide",0]
[{"$nulls":31},{"$f":"trame_planning_machine!$C$20","v":"ve 15"},"","","","","","","","","","","","","","","","","","","","","","","","","","","","vide",0]
[{"$nulls":31},{"$f":"trame_planning_machine!$C$21","v":"sa 16"},"","","","","","","","","","","","","","","","","","","","","","","","","","","","vide",0]
[{"$nulls":31},{"$f":"trame_planning_machine!$C$22","v":"di 17"},"","","","","","","","","","","","","","","","","","","","","","","","","","","","vide",0]
[{"$nulls":31},{"$f":"trame_planning_machine!$C$23","v":"lu 18"},"","","","","","","","","","","","","","","","","","","","","","","","","","","","vide",0]
[{"$nulls":31},{"$f":"trame_planning_machine!$C$24","v":"ma 19"},"","","","","","","","","","","","","","","","","","","","","","","","","","","","vide",0]
[{"$nulls":31},{"$f":"trame_planning_machine!$C$25","v":"me 20"},"","","","","","","","","","","","","","","","","","","","","","","","","","","","vide",0]
[{"$nulls":31},{"$f":"trame_planning_machine!$C$26","v":"je 21"},"","","","","","","","","","","","","","","","","","","","","","","","","","","","vide",0]
[{"$nulls":31},{"$f":"trame_planning_machine!$C$27","v":"ve 22"},"","","","","","","","","","","","","","","","","","","","","","","","","","","","vide",0]
[{"$nulls":31},{"$f":"trame_planning_machine!$C$28","v":"sa 23"},"","","","","","","","","","","","","","","","","","","","","","","","","","","","vide",0]
[{"$nulls":31},{"$f":"trame_planning_machine!$C$29","v":"di 24"},"","","","","","","","","","","","","","","","","","","","","","","","","","","","vide",0]
[{"$nulls":31},{"$f":"trame_planning_machine!$C$30","v":"lu 25"},"","","","","","","","","","","","","","","","","","","","","","","","","","","","vide",0]
[{"$nulls":31},{"$f":"trame_planning_machine!$C$31","v":"ma 26"},"","","","","","","","","","","","","","","","","","","","","","","","","","","","vide",0]
[{"$nulls":31},{"$f":"trame_planning_machine!$C$32","v":"me 27"},"","","","","","","","","","","","","","","","","","","","","","","","","","","","vide",0]
[{"$nulls":31},{"$f":"trame_planning_machine!$C$33","v":"je 28"},"","","","","","","","","","","","","","","","","","","","","","","","","","","","vide",0]
[{"$nulls":31},{"$f":"trame_planning_machine!$C$34","v":"ve 29"},"","","","","","","","","","","","","","","","","","","","","","","","","","","","vide",0]
[{"$nulls":31},{"$f":"trame_planning_machine!$C$35","v":"sa 30"},"","","","","","","","","","","","","","","","","","","","","","","","","","","","vide",0]
[{"$nulls":31},{"$f":"trame_planning_machine!$C$36","v":"di 31"},"","","","","","","","","","","","","","","","","","","","","","","","","","","","vide",0]
[]
[{"$nulls":60},{"$f":"BH398","v":"vide"},{"$f":"BH399","v":"vide"},{"$f":"BH400","v":"vide"},{"$f":"BH401","v":"vide"},{"$f":"BH402","v":"vide"},{"$f":"BH403","v":"vide"},{"$f":"BH404","v":"vide"},{"$f":"BH405","v":"vide"},{"$f":"BH406","v":"vide"},{"$f":"BH407","v":"vide"},{"$f":"BH408","v":"vide"},{"$f":"BH409","v":"vide"},{"$f":"BH410","v":"vide"},{"$f":"BH411","v":"vide"},{"$f":"BH412","v":"vide"},{"$f":"BH413","v":"vide"},{"$f":"BH414","v":"vide"},{"$f":"BH415","v":"vide"},{"$f":"BH416","v":"vide"},{"$f":"BH417","v":"vide"},{"$f":"BH418","v":"vide"},{"$f":"BH419","v":"vide"},{"$f":"BH420","v":"vide"},{"$f":"BH421","v":"vide"},{"$f":"BH422","v":"vide"},{"$f":"BH423","v":"vide"},{"$f":"BH424","v":"vide"},{"$f":"BH425","v":"vide"},{"$f":"BH426","v":"vide"},{"$f":"BH427","v":"vide"},{"$f":"BH428","v":"vide"}]
[{"$nulls":30},"RN",{"$f":"trame_planning_machine!$C$6","v":"ve 1"},{"$f":"IF(D2=$AE$398,D$1,\"\")","v":""},{"$f":"IF(E2=$AE$398,E$1,\"\")","v":""},"","","","","","","","","","","","","","","","","","","","","","",{"$f":"IF(ISERROR(SEARCH(\"RN*\",$AB$2)),\"\",$AB$1)","v":""},{"$f":"IF(ISERROR(SEARCH(\"RN*\",$AC$2)),\"\",$AC$1)","v":""},{"$f":"IF(BI398>1,\"DOUB\",\"\")","v":""},{"$f":"IF(ISNA(LOOKUP(2.1,1/(AG398:BG398<>\"\"),AG398:BG398)),\"vide\",LOOKUP(2.1,1/(AG398:BG398<>\"\"),AG398:BG398))","v":"vide"},{"$f":"SUMPRODUCT((AG398:BF398<>\"\")*1)","v":0}]
[{"$nulls":31},{"$f":"trame_planning_machine!$C$7","v":"sa 2"},{"$f":"IF(D3=$AE$398,D$1,\"\")","v":""},{"$f":"IF(E3=$AE$398,E$1,\"\")","v":""},{"$f":"IF(F3=$AE$398,F$1,\"\")","v":""},{"$f":"IF(G3=$AE$398,G$1,\"\")","v":""},{"$f":"IF(H3=$AE$398,H$1,\"\")","v":""},{"$f":"IF(I3=$AE$398,I$1,\"\")","v":""},{"$f":"IF(J3=$AE$398,J$1,\"\")","v":""},{"$f":"IF(K3=$AE$398,K$1,\"\")","v":""},{"$f":"IF(L3=$AE$398,L$1,\"\")","v":""},{"$f":"IF(M3=$AE$398,M$1,\"\")","v":""},{"$f":"IF(N3=$AE$398,N$1,\"\")","v":""},{"$f":"IF(O3=$AE$398,O$1,\"\")","v":""},{"$f":"IF(P3=$AE$398,P$1,\"\")","v":""},{"$f":"IF(Q3=$AE$398,Q$1,\"\")","v":""},{"$f":"IF(R3=$AE$398,R$1,\"\")","v":""},{"$f":"IF(S3=$AE$398,S$1,\"\")","v":""},{"$f":"IF(T3=$AE$398,T$1,\"\")","v":""},{"$f":"IF(U3=$AE$398,U$1,\"\")","v":""},{"$f":"IF(V3=$AE$398,V$1,\"\")","v":""},{"$f":"IF(W3=$AE$398,W$1,\"\")","v":""},{"$f":"IF(X3=$AE$398,X$1,\"\")","v":""},{"$f":"IF(Y3=$AE$398,Y$1,\"\")","v":""},{"$f":"IF(Z3=$AE$398,Z$1,\"\")","v":""},{"$f":"IF(AA3=$AE$398,AA$1,\"\")","v":""},{"$f":"IF(ISERROR(SEARCH(\"RN*\",$AB$2)),\"\",$AB$1)","v":""},{"$f":"IF(ISERROR(SEARCH(\"RN*\",$AC$2)),\"\",$AC$1)","v":""},{"$f":"IF(BI399>1,\"DOUB\",\"\")","v":""},{"$f":"IF(ISNA(LOOKUP(2.1,1/(AG399:BG399<>\"\"),AG399:BG399)),\"vide\",LOOKUP(2.1,1/(AG399:BG399<>\"\"),AG399:BG399))","v":"vide"},{"$f":"SUMPRODUCT((AG399:BF399<>\"\")*1)","v":0}]
[{"$nulls":31},{"$f":"trame_planning_machine!$C$8","v":"di 3"},"","","","","","","","","","","","","","","","","","","","","","","","","","","","vide",0]
[{"$nulls":31},{"$f":"trame_planning_machine!$C$9","v":"lu 4"},"","","","","","","","","","","","","","","","","","","","","","","","","","","","vide",0]
[{"$nulls":31},{"$f":"trame_planning_machine!$C$10","v":"ma 5"},"","","","","","","","","","","","","","","","","","","","","","","","","","","","vide",0]
[{"$nulls":31},{"$f":"trame_planning_machine!$C$11","v":"me 6"},"","","","","","","","","","","","","","","","","","","","","","","","","","","","vide",0]
[{"$nulls":31},{"$f":"trame_planning_machine!$C$12","v":"je 7"},"","","","","","","","","","","","","","","","","","","","","","","","","","","","vide",0]
[{"$nulls":31},{"$f":"trame_planning_machine!$C$13","v":"ve 8"},"","","","","","","","","","","","","","","","","","","","","","","","","","","","vide",0]
[{"$nulls":31},{"$f":"trame_planning_machine!$C$14","v":"sa 9"},"","","","","","","","","","","","","","","","","","","","","","","","","","","","vide",0]
[{"$nulls":31},{"$f":"trame_planning_machine!$C$15","v":"di 10"},"","","","","","","","","","","","","","","","","","","","","","","","","","","","vide",0]
[{"$nulls":31},{"$f":"trame_planning_machine!$C$16","v":"lu 11"},"","","","","","","","","","","","","","","","","","","","","","","","","","","","vide",0]
[{"$nulls":31},{"$f":"trame_planning_machine!$C$17","v":"ma 12"},"","","","","","","","","","","","","","","","","","","","","","","","","","","","vide",0]
[{"$nulls":31},{"$f":"trame_planning_machine!$C$18","v":"me 13"},"","","","","","","","","","","","","","","","","","","","","","","","","","","","vide",0]
[{"$nulls":31},{"$f":"trame_planning_machine!$C$19","v":"je 14"},"","","","","","","","","","","","","","","","","","","","","","","","","","","","vide",0]
[{"$nulls":31},{"$f":"trame_planning_machine!$C$20","v":"ve 15"},"","","","","","","","","","","","","","","","","","","","","","","","","","","","vide",0]
[{"$nulls":31},{"$f":"trame_planning_machine!$C$21","v":"sa 16"},"","","","","","","","","","","","","","","","","","","","","","","","","","","","vide",0]
[{"$nulls":31},{"$f":"trame_planning_machine!$C$22","v":"di 17"},"","","","","","","","","","","","","","","","","","","","","","","","","","","","vide",0]
[{"$nulls":31},{"$f":"trame_planning_machine!$C$23","v":"lu 18"},"","","","","","","","","","","","","","","","","","","","","","","","","","","","vide",0]
[{"$nulls":31},{"$f":"trame_planning_machine!$C$24","v":"ma 19"},"","","","","","","","","","","","","","","","","","","","","","","","","","","","vide",0]
[{"$nulls":31},{"$f":"trame_planning_machine!$C$25","v":"me 20"},"","","","","","","","","","","","","","","","","","","","","","","","","","","","vide",0]
[{"$nulls":31},{"$f":"trame_planning_machine!$C$26","v":"je 21"},"","","","","","","","","","","","","","","","","","","","","","","","","","","","vide",0]
[{"$nulls":31},{"$f":"trame_planning_machine!$C$27","v":"ve 22"},"","","","","","","","","","","","","","","","","","","","","","","","","","","","vide",0]
[{"$nulls":31},{"$f":"trame_planning_machine!$C$28","v":"sa 23"},"","","","","","","","","","","","","","","","","","","","","","","","","","","","vide",0]
[{"$nulls":31},{"$f":"trame_planning_machine!$C$29","v":"di 24"},"","","","","","","","","","","","","","","","","","","","","","","","","","","","vide",0]
[{"$nulls":31},{"$f":"trame_planning_machine!$C$30","v":"lu 25"},"","","","","","","","","","","","","","","","","","","","","","","","","","","","vide",0]
[{"$nulls":31},{"$f":"trame_planning_machine!$C$31","v":"ma 26"},"","","","","","","","","","","","","","","","","","","","","","","","","","","","vide",0]
[{"$nulls":31},{"$f":"trame_planning_machine!$C$32","v":"me 27"},"","","","","","","","","","","","","","","","","","","","","","","","","","","","vide",0]
[{"$nulls":31},{"$f":"trame_planning_machine!$C$33","v":"je 28"},"","","","","","","","","","","","","","","","","","","","","","","","","","","","vide",0]
[{"$nulls":31},{"$f":"trame_planning_machine!$C$34","v":"ve 29"},"","","","","","","","","","","","","","","","","","","","","","","","","","","","vide",0]
[{"$nulls":31},{"$f":"trame_planning_machine!$C$35","v":"sa 30"},"","","","","","","","","","","","","","","","","","","","","","","","","","","","vide",0]
[{"$nulls":31},{"$f":"trame_planning_machine!$C$36","v":"di 31"},"","","","","","","","","","","","","","","","","","","","","","","","","","","","vide",0]
[]
[{"$nulls":60},{"$f":"BH431","v":"vide"},{"$f":"BH432","v":"vide"},{"$f":"BH433","v":"vide"},{"$f":"BH434","v":"vide"},{"$f":"BH435","v":"vide"},{"$f":"BH436","v":"vide"},{"$f":"BH437","v":"vide"},{"$f":"BH438","v":"vide"},{"$f":"BH439","v":"vide"},{"$f":"BH440","v":"vide"},{"$f":"BH441","v":"vide"},{"$f":"BH442","v":"vide"},{"$f":"BH443","v":"vide"},{"$f":"BH444","v":"vide"},{"$f":"BH445","v":"vide"},{"$f":"BH446","v":"vide"},{"$f":"BH447","v":"vide"},{"$f":"BH448","v":"vide"},{"$f":"BH449","v":"vide"},{"$f":"BH450","v":"vide"},{"$f":"BH451","v":"vide"},{"$f":"BH452","v":"vide"},{"$f":"BH453","v":"vide"},{"$f":"BH454","v":"vide"},{"$f":"BH455","v":"vide"},{"$f":"BH456","v":"vide"},{"$f":"BH457","v":"vide"},{"$f":"BH458","v":"vide"},{"$f":"BH459","v":"vide"},{"$f":"BH460","v":"vide"},{"$f":"BH461","v":"vide"}]
[{"$nulls":30},"SR",{"$f":"trame_planning_machine!$C$6","v":"ve 1"},{"$f":"IF(D2=$AE$431,D$1,\"\")","v":""},{"$f":"IF(E2=$AE$431,E$1,\"\")","v":""},"","","","","","","","","","","","","","","","","","","","","","",{"$f":"IF(ISERROR(SEARCH(\"SR*\",$AB$2)),\"\",$AB$1)","v":""},{"$f":"IF(ISERROR(SEARCH(\"SR*\",$AC$2)),\"\",$AC$1)","v":""},{"$f":"IF(BI431>1,\"DOUB\",\"\")","v":""},{"$f":"IF(ISNA(LOOKUP(2.1,1/(AG431:BG431<>\"\"),AG431:BG431)),\"vide\",LOOKUP(2.1,1/(AG431:BG431<>\"\"),AG431:BG431))","v":"vide"},{"$f":"SUMPRODUCT((AG431:BF431<>\"\")*1)","v":0}]
[{"$nulls":31},{"$f":"trame_planning_machine!$C$7","v":"sa 2"},{"$f":"IF(D3=$AE$431,D$1,\"\")","v":""},{"$f":"IF(E3=$AE$431,E$1,\"\")","v":""},{"$f":"IF(F3=$AE$431,F$1,\"\")","v":""},{"$f":"IF(G3=$AE$431,G$1,\"\")","v":""},{"$f":"IF(H3=$AE$431,H$1,\"\")","v":""},{"$f":"IF(I3=$AE$431,I$1,\"\")","v":""},{"$f":"IF(J3=$AE$431,J$1,\"\")","v":""},{"$f":"IF(K3=$AE$431,K$1,\"\")","v":""},{"$f":"IF(L3=$AE$431,L$1,\"\")","v":""},{"$f":"IF(M3=$AE$431,M$1,\"\")","v":""},{"$f":"IF(N3=$AE$431,N$1,\"\")","v":""},{"$f":"IF(O3=$AE$431,O$1,\"\")","v":""},{"$f":"IF(P3=$AE$431,P$1,\"\")","v":""},{"$f":"IF(Q3=$AE$431,Q$1,\"\")","v":""},{"$f":"IF(R3=$AE$431,R$1,\"\")","v":""},{"$f":"IF(S3=$AE$431,S$1,\"\")","v":""},{"$f":"IF(T3=$AE$431,T$1,\"\")","v":""},{"$f":"IF(U3=$AE$431,U$1,\"\")","v":""},{"$f":"IF(V3=$AE$431,V$1,\"\")","v":""},{"$f":"IF(W3=$AE$431,W$1,\"\")","v":""},{"$f":"IF(X3=$AE$431,X$1,\"\")","v":""},{"$f":"IF(Y3=$AE$431,Y$1,\"\")","v":""},{"$f":"IF(Z3=$AE$431,Z$1,\"\")","v":""},{"$f":"IF(AA3=$AE$431,AA$1,\"\")","v":""},{"$f":"IF(ISERROR(SEARCH(\"SR*\",$AB$2)),\"\",$AB$1)","v":""},{"$f":"IF(ISERROR(SEARCH(\"SR*\",$AC$2)),\"\",$AC$1)","v":""},{"$f":"IF(BI432>1,\"DOUB\",\"\")","v":""},{"$f":"IF(ISNA(LOOKUP(2.1,1/(AG432:BG432<>\"\"),AG432:BG432)),\"vide\",LOOKUP(2.1,1/(AG432:BG432<>\"\"),AG432:BG432))","v":"vide"},{"$f":"SUMPRODUCT((AG432:BF432<>\"\")*1)","v":0}]
[{"$nulls":31},{"$f":"trame_planning_machine!$C$8","v":"di 3"},"","","","","","","","","","","","","","","","","","","","","","","","","","","","vide",0]
[{"$nulls":31},{"$f":"trame_planning_machine!$C$9","v":"lu 4"},"","","","","","","","","","","","","","","","","","","","","","","","","","","","vide",0]
[{"$nulls":31},{"$f":"trame_planning_machine!$C$10","v":"ma 5"},"","","","","","","","","","","","","","","","","","","","","","","","","","","","vide",0]
[{"$nulls":31},{"$f":"trame_planning_machine!$C$11","v":"me 6"},"","","","","","","","","","","","","","","","","","","","","","","","","","","","vide",0]
[{"$nulls":31},{"$f":"trame_planning_machine!$C$12","v":"je 7"},"","","","","","","","","","","","","","","","","","","","","","","","","","","","vide",0]
[{"$nulls":31},{"$f":"trame_planning_machine!$C$13","v":"ve 8"},"","","","","","","","","","","","","","","","","","","","","","","","","","","","vide",0]
[{"$nulls":31},{"$f":"trame_planning_machine!$C$14","v":"sa 9"},"","","","","","","","","","","","","","","","","","","","","","","","","","","","vide",0]
[{"$nulls":31},{"$f":"trame_planning_machine!$C$15","v":"di 10"},"","","","","","","","","","","","","","","","","","","","","","","","","","","","vide",0]
[{"$nulls":31},{"$f":"trame_planning_machine!$C$16","v":"lu 11"},"","","","","","","","","","","","","","","","","","","","","","","","","","","","vide",0]
[{"$nulls":31},{"$f":"trame_planning_machine!$C$17","v":"ma 12"},"","","","","","","","","","","","","","","","","","","","","","","","","","","","vide",0]
[{"$nulls":31},{"$f":"trame_planning_machine!$C$18","v":"me 13"},"","","","","","","","","","","","","","","","","","","","","","","","","","","","vide",0]
[{"$nulls":31},{"$f":"trame_planning_machine!$C$19","v":"je 14"},"","","","","","","","","","","","","","","","","","","","","","","","","","","","vide",0]
[{"$nulls":31},{"$f":"trame_planning_machine!$C$20","v":"ve 15"},"","","","","","","","","","","","","","","","","","","","","","","","","","","","vide",0]
[{"$nulls":31},{"$f":"trame_planning_machine!$C$21","v":"sa 16"},"","","","","","","","","","","","","","","","","","","","","","","","","","","","vide",0]
[{"$nulls":31},{"$f":"trame_planning_machine!$C$22","v":"di 17"},"","","","","","","","","","","","","","","","","","","","","","","","","","","","vide",0]
[{"$nulls":31},{"$f":"trame_planning_machine!$C$23","v":"lu 18"},"","","","","","","","","","","","","","","","","","","","","","","","","","","","vide",0]
[{"$nulls":31},{"$f":"trame_planning_machine!$C$24","v":"ma 19"},"","","","","","","","","","","","","","","","","","","","","","","","","","","","vide",0]
[{"$nulls":31},{"$f":"trame_planning_machine!$C$25","v":"me 20"},"","","","","","","","","","","","","","","","","","","","","","","","","","","","vide",0]
[{"$nulls":31},{"$f":"trame_planning_machine!$C$26","v":"je 21"},"","","","","","","","","","","","","","","","","","","","","","","","","","","","vide",0]
[{"$nulls":31},{"$f":"trame_planning_machine!$C$27","v":"ve 22"},"","","","","","","","","","","","","","","","","","","","","","","","","","","","vide",0]
[{"$nulls":31},{"$f":"trame_planning_machine!$C$28","v":"sa 23"},"","","","","","","","","","","","","","","","","","","","","","","","","","","","vide",0]
[{"$nulls":31},{"$f":"trame_planning_machine!$C$29","v":"di 24"},"","","","","","","","","","","","","","","","","","","","","","","","","","","","vide",0]
[{"$nulls":31},{"$f":"trame_planning_machine!$C$30","v":"lu 25"},"","","","","","","","","","","","","","","","","","","","","","","","","","","","vide",0]
[{"$nulls":31},{"$f":"trame_planning_machine!$C$31","v":"ma 26"},"","","","","","","","","","","","","","","","","","","","","","","","","","","","vide",0]
[{"$nulls":31},{"$f":"trame_planning_machine!$C$32","v":"me 27"},"","","","","","","","","","","","","","","","","","","","","","","","","","","","vide",0]
[{"$nulls":31},{"$f":"trame_planning_machine!$C$33","v":"je 28"},"","","","","","","","","","","","","","","","","","","","","","","","","","","","vide",0]
[{"$nulls":31},{"$f":"trame_planning_machine!$C$34","v":"ve 29"},"","","","","","","","","","","","","","","","","","","","","","","","","","","","vide",0]
[{"$nulls":31},{"$f":"trame_planning_machine!$C$35","v":"sa 30"},"","","","","","","","","","","","","","","","","","","","","","","","","","","","vide",0]
[{"$nulls":31},{"$f":"trame_planning_machine!$C$36","v":"di 31"},"","","","","","","","","","","","","","","","","","","","","","","","","","","","vide",0]
[]
[{"$nulls":60},{"$f":"BH464","v":"vide"},{"$f":"BH465","v":"vide"},{"$f":"BH466","v":"vide"},{"$f":"BH467","v":"vide"},{"$f":"BH468","v":"vide"},{"$f":"BH469","v":"vide"},{"$f":"BH470","v":"vide"},{"$f":"BH471","v":"vide"},{"$f":"BH472","v":"vide"},{"$f":"BH473","v":"vide"},{"$f":"BH474","v":"vide"},{"$f":"BH475","v":"vide"},{"$f":"BH476","v":"vide"},{"$f":"BH477","v":"vide"},{"$f":"BH478","v":"vide"},{"$f":"BH479","v":"vide"},{"$f":"BH480","v":"vide"},{"$f":"BH481","v":"vide"},{"$f":"BH482","v":"vide"},{"$f":"BH483","v":"vide"},{"$f":"BH484","v":"vide"},{"$f":"BH485","v":"vide"},{"$f":"BH486","v":"vide"},{"$f":"BH487","v":"vide"},{"$f":"BH488","v":"vide"},{"$f":"BH489","v":"vide"},{"$f":"BH490","v":"vide"},{"$f":"BH491","v":"vide"},{"$f":"BH492","v":"vide"},{"$f":"BH493","v":"vide"},{"$f":"BH494","v":"vide"}]
[{"$nulls":30},"TS",{"$f":"trame_planning_machine!$C$6","v":"ve 1"},{"$f":"IF(D2=$AE$464,D$1,\"\")","v":""},{"$f":"IF(E2=$AE$464,E$1,\"\")","v":""},"","","","","","","","","","","","","","","","","","","","","","",{"$f":"IF(ISERROR(SEARCH(\"TS*\",$AB$2)),\"\",$AB$1)","v":""},{"$f":"IF(ISERROR(SEARCH(\"TS*\",$AC$2)),\"\",$AC$1)","v":""},{"$f":"IF(BI464>1,\"DOUB\",\"\")","v":""},{"$f":"IF(ISNA(LOOKUP(2.1,1/(AG464:BG464<>\"\"),AG464:BG464)),\"vide\",LOOKUP(2.1,1/(AG464:BG464<>\"\"),AG464:BG464))","v":"vide"},{"$f":"SUMPRODUCT((AG464:BF464<>\"\")*1)","v":0}]
[{"$nulls":31},{"$f":"trame_planning_machine!$C$7","v":"sa 2"},{"$f":"IF(D3=$AE$464,D$1,\"\")","v":""},{"$f":"IF(E3=$AE$464,E$1,\"\")","v":""},{"$f":"IF(F3=$AE$464,F$1,\"\")","v":""},{"$f":"IF(G3=$AE$464,G$1,\"\")","v":""},{"$f":"IF(H3=$AE$464,H$1,\"\")","v":""},{"$f":"IF(I3=$AE$464,I$1,\"\")","v":""},{"$f":"IF(J3=$AE$464,J$1,\"\")","v":""},{"$f":"IF(K3=$AE$464,K$1,\"\")","v":""},{"$f":"IF(L3=$AE$464,L$1,\"\")","v":""},{"$f":"IF(M3=$AE$464,M$1,\"\")","v":""},{"$f":"IF(N3=$AE$464,N$1,\"\")","v":""},{"$f":"IF(O3=$AE$464,O$1,\"\")","v":""},{"$f":"IF(P3=$AE$464,P$1,\"\")","v":""},{"$f":"IF(Q3=$AE$464,Q$1,\"\")","v":""},{"$f":"IF(R3=$AE$464,R$1,\"\")","v":""},{"$f":"IF(S3=$AE$464,S$1,\"\")","v":""},{"$f":"IF(T3=$AE$464,T$1,\"\")","v":""},{"$f":"IF(U3=$AE$464,U$1,\"\")","v":""},{"$f":"IF(V3=$AE$464,V$1,\"\")","v":""},{"$f":"IF(W3=$AE$464,W$1,\"\")","v":""},{"$f":"IF(X3=$AE$464,X$1,\"\")","v":""},{"$f":"IF(Y3=$AE$464,Y$1,\"\")","v":""},{"$f":"IF(Z3=$AE$464,Z$1,\"\")","v":""},{"$f":"IF(AA3=$AE$464,AA$1,\"\")","v":""},{"$f":"IF(ISERROR(SEARCH(\"TS*\",$AB$2)),\"\",$AB$1)","v":""},{"$f":"IF(ISERROR(SEARCH(\"TS*\",$AC$2)),\"\",$AC$1)","v":""},{"$f":"IF(BI465>1,\"DOUB\",\"\")","v":""},{"$f":"IF(ISNA(LOOKUP(2.1,1/(AG465:BG465<>\"\"),AG465:BG465)),\"vide\",LOOKUP(2.1,1/(AG465:BG465<>\"\"),AG465:BG465))","v":"vide"},{"$f":"SUMPRODUCT((AG465:BF465<>\"\")*1)","v":0}]
[{"$nulls":31},{"$f":"trame_planning_machine!$C$8","v":"di 3"},"","","","","","","","","","","","","","","","","","","","","","","","","","","","vide",0]
[{"$nulls":31},{"$f":"trame_planning_machine!$C$9","v":"lu 4"},"","","","","","","","","","","","","","","","","","","","","","","","","","","","vide",0]
[{"$nulls":31},{"$f":"trame_planning_machine!$C$10","v":"ma 5"},"","","","","","","","","","","","","","","","","","","","","","","","","","","","vide",0]
[{"$nulls":31},{"$f":"trame_planning_machine!$C$11","v":"me 6"},"","","","","","","","","","","","","","","","","","","","","","","","","","","","vide",0]
[{"$nulls":31},{"$f":"trame_planning_machine!$C$12","v":"je 7"},"","","","","","","","","","","","","","","","","","","","","","","","","","","","vide",0]
[{"$nulls":31},{"$f":"trame_planning_machine!$C$13","v":"ve 8"},"","","","","","","","","","","","","","","","","","","","","","","","","","","","vide",0]
[{"$nulls":31},{"$f":"trame_planning_machine!$C$14","v":"sa 9"},"","","","","","","","","","","","","","","","","","","","","","","","","","","","vide",0]
[{"$nulls":31},{"$f":"trame_planning_machine!$C$15","v":"di 10"},"","","","","","","","","","","","","","","","","","","","","","","","","","","","vide",0]
[{"$nulls":31},{"$f":"trame_planning_machine!$C$16","v":"lu 11"},"","","","","","","","","","","","","","","","","","","","","","","","","","","","vide",0]
[{"$nulls":31},{"$f":"trame_planning_machine!$C$17","v":"ma 12"},"","","","","","","","","","","","","","","","","","","","","","","","","","","","vide",0]
[{"$nulls":31},{"$f":"trame_planning_machine!$C$18","v":"me 13"},"","","","","","","","","","","","","","","","","","","","","","","","","","","","vide",0]
[{"$nulls":31},{"$f":"trame_planning_machine!$C$19","v":"je 14"},"","","","","","","","","","","","","","","","","","","","","","","","","","","","vide",0]
[{"$nulls":31},{"$f":"trame_planning_machine!$C$20","v":"ve 15"},"","","","","","","","","","","","","","","","","","","","","","","","","","","","vide",0]
[{"$nulls":31},{"$f":"trame_planning_machine!$C$21","v":"sa 16"},"","","","","","","","","","","","","","","","","","","","","","","","","","","","vide",0]
[{"$nulls":31},{"$f":"trame_planning_machine!$C$22","v":"di 17"},"","","","","","","","","","","","","","","","","","","","","","","","","","","","vide",0]
[{"$nulls":31},{"$f":"trame_planning_machine!$C$23","v":"lu 18"},"","","","","","","","","","","","","","","","","","","","","","","","","","","","vide",0]
[{"$nulls":31},{"$f":"trame_planning_machine!$C$24","v":"ma 19"},"","","","","","","","","","","","","","","","","","","","","","","","","","","","vide",0]
[{"$nulls":31},{"$f":"trame_planning_machine!$C$25","v":"me 20"},"","","","","","","","","","","","","","","","","","","","","","","","","","","","vide",0]
[{"$nulls":31},{"$f":"trame_planning_machine!$C$26","v":"je 21"},"","","","","","","","","","","","","","","","","","","","","","","","","","","","vide",0]
[{"$nulls":31},{"$f":"trame_planning_machine!$C$27","v":"ve 22"},"","","","","","","","","","","","","","","","","","","","","","","","","","","","vide",0]
[{"$nulls":31},{"$f":"trame_planning_machine!$C$28","v":"sa 23"},"","","","","","","","","","","","","","","","","","","","","","","","","","","","vide",0]
[{"$nulls":31},{"$f":"trame_planning_machine!$C$29","v":"di 24"},"","","","","","","","","","","","","","","","","","","","","","","","","","","","vide",0]
[{"$nulls":31},{"$f":"trame_planning_machine!$C$30","v":"lu 25"},"","","","","","","","","","","","","","","","","","","","","","","","","","","","vide",0]
[{"$nulls":31},{"$f":"trame_planning_machine!$C$31","v":"ma 26"},"","","","","","","","","","","","","","","","","","","","","","","","","","","","vide",0]
[{"$nulls":31},{"$f":"trame_planning_machine!$C$32","v":"me 27"},"","","","","","","","","","","","","","","","","","","","","","","","","","","","vide",0]
[{"$nulls":31},{"$f":"trame_planning_machine!$C$33","v":"je 28"},"","","","","","","","","","","","","","","","","","","","","","","","","","","","vide",0]
[{"$nulls":31},{"$f":"trame_planning_machine!$C$34","v":"ve 29"},"","","","","","","","","","","","","","","","","","","","","","","","","","","","vide",0]
[{"$nulls":31},{"$f":"trame_planning_machine!$C$35","v":"sa 30"},"","","","","","","","","","","","","","","","","","","","","","","","","","","","vide",0]
[{"$nulls":31},{"$f":"trame_planning_machine!$C$36","v":"di 31"},"","","","","","","","","","","","","","","","","","","","","","","","","","","","vide",0]
[]
[{"$nulls":60},{"$f":"BH497","v":"vide"},{"$f":"BH498","v":"vide"},{"$f":"BH499","v":"vide"},{"$f":"BH500","v":"vide"},{"$f":"BH501","v":"vide"},{"$f":"BH502","v":"vide"},{"$f":"BH503","v":"vide"},{"$f":"BH504","v":"vide"},{"$f":"BH505","v":"vide"},{"$f":"BH506","v":"vide"},{"$f":"BH507","v":"vide"},{"$f":"BH508","v":"vide"},{"$f":"BH509","v":"vide"},{"$f":"BH510","v":"vide"},{"$f":"BH511","v":"vide"},{"$f":"BH512","v":"vide"},{"$f":"BH513","v":"vide"},{"$f":"BH514","v":"vide"},{"$f":"BH515","v":"vide"},{"$f":"BH516","v":"vide"},{"$f":"BH517","v":"vide"},{"$f":"BH518","v":"vide"},{"$f":"BH519","v":"vide"},{"$f":"BH520","v":"vide"},{"$f":"BH521","v":"vide"},{"$f":"BH522","v":"vide"},{"$f":"BH523","v":"vide"},{"$f":"BH524","v":"vide"},{"$f":"BH525","v":"vide"},{"$f":"BH526","v":"vide"},{"$f":"BH527","v":"vide"}]
[{"$nulls":30},"VC",{"$f":"trame_planning_machine!$C$6","v":"ve 1"},{"$f":"IF(D2=$AE$497,D$1,\"\")","v":""},{"$f":"IF(E2=$AE$497,E$1,\"\")","v":""},"","","","","","","","","","","","","","","","","","","","","","",{"$f":"IF(ISERROR(SEARCH(\"VC*\",$AB$2)),\"\",$AB$1)","v":""},{"$f":"IF(ISERROR(SEARCH(\"VC*\",$AC$2)),\"\",$AC$1)","v":""},{"$f":"IF(BI497>1,\"DOUB\",\"\")","v":""},{"$f":"IF(ISNA(LOOKUP(2.1,1/(AG497:BG497<>\"\"),AG497:BG497)),\"vide\",LOOKUP(2.1,1/(AG497:BG497<>\"\"),AG497:BG497))","v":"vide"},{"$f":"SUMPRODUCT((AG497:BF497<>\"\")*1)","v":0}]
[{"$nulls":31},{"$f":"trame_planning_machine!$C$7","v":"sa 2"},{"$f":"IF(D3=$AE$497,D$1,\"\")","v":""},{"$f":"IF(E3=$AE$497,E$1,\"\")","v":""},{"$f":"IF(F3=$AE$497,F$1,\"\")","v":""},{"$f":"IF(G3=$AE$497,G$1,\"\")","v":""},{"$f":"IF(H3=$AE$497,H$1,\"\")","v":""},{"$f":"IF(I3=$AE$497,I$1,\"\")","v":""},{"$f":"IF(J3=$AE$497,J$1,\"\")","v":""},{"$f":"IF(K3=$AE$497,K$1,\"\")","v":""},{"$f":"IF(L3=$AE$497,L$1,\"\")","v":""},{"$f":"IF(M3=$AE$497,M$1,\"\")","v":""},{"$f":"IF(N3=$AE$497,N$1,\"\")","v":""},{"$f":"IF(O3=$AE$497,O$1,\"\")","v":""},{"$f":"IF(P3=$AE$497,P$1,\"\")","v":""},{"$f":"IF(Q3=$AE$497,Q$1,\"\")","v":""},{"$f":"IF(R3=$AE$497,R$1,\"\")","v":""},{"$f":"IF(S3=$AE$497,S$1,\"\")","v":""},{"$f":"IF(T3=$AE$497,T$1,\"\")","v":""},{"$f":"IF(U3=$AE$497,U$1,\"\")","v":""},{"$f":"IF(V3=$AE$497,V$1,\"\")","v":""},{"$f":"IF(W3=$AE$497,W$1,\"\")","v":""},{"$f":"IF(X3=$AE$497,X$1,\"\")","v":""},{"$f":"IF(Y3=$AE$497,Y$1,\"\")","v":""},{"$f":"IF(Z3=$AE$497,Z$1,\"\")","v":""},{"$f":"IF(AA3=$AE$497,AA$1,\"\")","v":""},{"$f":"IF(ISERROR(SEARCH(\"VC*\",$AB$2)),\"\",$AB$1)","v":""},{"$f":"IF(ISERROR(SEARCH(\"VC*\",$AC$2)),\"\",$AC$1)","v":""},{"$f":"IF(BI498>1,\"DOUB\",\"\")","v":""},{"$f":"IF(ISNA(LOOKUP(2.1,1/(AG498:BG498<>\"\"),AG498:BG498)),\"vide\",LOOKUP(2.1,1/(AG498:BG498<>\"\"),AG498:BG498))","v":"vide"},{"$f":"SUMPRODUCT((AG498:BF498<>\"\")*1)","v":0}]
[{"$nulls":31},{"$f":"trame_planning_machine!$C$8","v":"di 3"},"","","","","","","","","","","","","","","","","","","","","","","","","","","","vide",0]
[{"$nulls":31},{"$f":"trame_planning_machine!$C$9","v":"lu 4"},"","","","","","","","","","","","","","","","","","","","","","","","","","","","vide",0]
[{"$nulls":31},{"$f":"trame_planning_machine!$C$10","v":"ma 5"},"","","","","","","","","","","","","","","","","","","","","","","","","","","","vide",0]
[{"$nulls":31},{"$f":"trame_planning_machine!$C$11","v":"me 6"},"","","","","","","","","","","","","","","","","","","","","","","","","","","","vide",0]
[{"$nulls":31},{"$f":"trame_planning_machine!$C$12","v":"je 7"},"","","","","","","","","","","","","","","","","","","","","","","","","","","","vide",0]
[{"$nulls":31},{"$f":"trame_planning_machine!$C$13","v":"ve 8"},"","","","","","","","","","","","","","","","","","","","","","","","","","","","vide",0]
[{"$nulls":31},{"$f":"trame_planning_machine!$C$14","v":"sa 9"},"","","","","","","","","","","","","","","","","","","","","","","","","","","","vide",0]
[{"$nulls":31},{"$f":"trame_planning_machine!$C$15","v":"di 10"},"","","","","","","","","","","","","","","","","","","","","","","","","","","","vide",0]
[{"$nulls":31},{"$f":"trame_planning_machine!$C$16","v":"lu 11"},"","","","","","","","","","","","","","","","","","","","","","","","","","","","vide",0]
[{"$nulls":31},{"$f":"trame_planning_machine!$C$17","v":"ma 12"},"","","","","","","","","","","","","","","","","","","","","","","","","","","","vide",0]
[{"$nulls":31},{"$f":"trame_planning_machine!$C$18","v":"me 13"},"","","","","","","","","","","","","","","","","","","","","","","","","","","","vide",0]
[{"$nulls":31},{"$f":"trame_planning_machine!$C$19","v":"je 14"},"","","","","","","","","","","","","","","","","","","","","","","","","","","","vide",0]
[{"$nulls":31},{"$f":"trame_planning_machine!$C$20","v":"ve 15"},"","","","","","","","","","","","","","","","","","","","","","","","","","","","vide",0]
[{"$nulls":31},{"$f":"trame_planning_machine!$C$21","v":"sa 16"},"","","","","","","","","","","","","","","","","","","","","","","","","","","","vide",0]
[{"$nulls":31},{"$f":"trame_planning_machine!$C$22","v":"di 17"},"","","","","","","","","","","","","","","","","","","","","","","","","","","","vide",0]
[{"$nulls":31},{"$f":"trame_planning_machine!$C$23","v":"lu 18"},"","","","","","","","","","","","","","","","","","","","","","","","","","","","vide",0]
[{"$nulls":31},{"$f":"trame_planning_machine!$C$24","v":"ma 19"},"","","","","","","","","","","","","","","","","","","","","","","","","","","","vide",0]
[{"$nulls":31},{"$f":"trame_planning_machine!$C$25","v":"me 20"},"","","","","","","","","","","","","","","","","","","","","","","","","","","","vide",0]
[{"$nulls":31},{"$f":"trame_planning_machine!$C$26","v":"je 21"},"","","","","","","","","","","","","","","","","","","","","","","","","","","","vide",0]
[{"$nulls":31},{"$f":"trame_planning_machine!$C$27","v":"ve 22"},"","","","","","","","","","","","","","","","","","","","","","","","","","","","vide",0]
[{"$nulls":31},{"$f":"trame_planning_machine!$C$28","v":"sa 23"},"","","","","","","","","","","","","","","","","","","","","","","","","","","","vide",0]
[{"$nulls":31},{"$f":"trame_planning_machine!$C$29","v":"di 24"},"","","","","","","","","","","","","","","","","","","","","","","","","","","","vide",0]
[{"$nulls":31},{"$f":"trame_planning_machine!$C$30","v":"lu 25"},"","","","","","","","","","","","","","","","","","","","","","","","","","","","vide",0]
[{"$nulls":31},{"$f":"trame_planning_machine!$C$31","v":"ma 26"},"","","","","","","","","","","","","","","","","","","","","","","","","","","","vide",0]
[{"$nulls":31},{"$f":"trame_planning_machine!$C$32","v":"me 27"},"","","","","","","","","","","","","","","","","","","","","","","","","","","","vide",0]
[{"$nulls":31},{"$f":"trame_planning_machine!$C$33","v":"je 28"},"","","","","","","","","","","","","","","","","","","","","","","","","","","","vide",0]
[{"$nulls":31},{"$f":"trame_planning_machine!$C$34","v":"ve 29"},"","","","","","","","","","","","","","","","","","","","","","","","","","","","vide",0]
[{"$nulls":31},{"$f":"trame_planning_machine!$C$35","v":"sa 30"},"","","","","","","","","","","","","","","","","","","","","","","","","","","","vide",0]
[{"$nulls":31},{"$f":"trame_planning_machine!$C$36","v":"di 31"},"","","","","","","","","","","","","","","","","","","","","","","","","","","","vide",0]

{"sheet":"plan_pers_vac","index":2,"n_rows":44,"n_cols":166,"rows_kept":44}
[null,"CP","CP","CP","CP","CP",{"$nulls":8},"du","au",{"$nulls":8},"du","au",{"$nulls":8},"du","au",{"$nulls":8},"du","au",{"$nulls":8},"du","au",{"$nulls":8},"du","au",{"$nulls":8},"du","au",{"$nulls":8},"du","au",{"$nulls":8},"du","au",{"$nulls":8},"du","au",{"$nulls":8},"du","au",{"$nulls":8},"du","au",{"$nulls":8},"du","au",{"$nulls":8},"du","au",{"$nulls":8},"du","au",{"$nulls":8},"du","au"]
[{"$f":"'calculs - masquer'!E2","v":"2016-01-01"},"AG",{"$nulls":5},"EXEMPLE","AG",{"$f":"IF($C2<>$H$2,\"\",IF($C2=$H$2,$A2))","v":""},{"$f":"IF($D2<>$H$2,\"\",IF($D2=$H$2,$A2))","v":""},{"$f":"IF($E2<>$H$2,\"\",IF($E2=$H$2,$A2))","v":""},{"$f":"IF($F2<>$H$2,\"\",IF($F2=$H$2,$A2))","v":""},"2016-01-01",{"$f":"IF(ISNA(O3),\"\",O3)","v":"2016-01-01"},{"$f":"IF(ISNA(LOOKUP(2.1,1/(N2:N32<>\"\"),N2:N32)),\"\",LOOKUP(2.1,1/(N2:N32<>\"\"),N2:N32))","v":"2016-01-29"},null,"CB",{"$f":"IF($B2<>$R$2,\"\",IF($B2=$R$2,$A2))","v":""},{"$f":"IF($C2<>$R$2,\"\",IF($C2=$R$2,$A2))","v":""},{"$f":"IF($D2<>$R$2,\"\",IF($D2=$R$2,$A2))","v":""},{"$f":"IF($E2<>$R$2,\"\",IF($E2=$R$2,$A2))","v":""},{"$f":"IF($F2<>$R$2,\"\",IF($F2=$R$2,$A2))","v":""},{"$f":"IF(ISNA(LOOKUP(2.1,1/(S2:W2<>\"\"),S2:W2)),\"\",LOOKUP(2.1,1/(S2:W2<>\"\"),S2:W2))","v":""},{"$f":"IF(ISNA(Y3),\"\",Y3)","v":"a"},{"$f":"IF(ISNA(LOOKUP(2.1,1/(X2:X32<>\"\"),X2:X32)),\"\",LOOKUP(2.1,1/(X2:X32<>\"\"),X2:X32))","v":"a"},null,"CC",{"$f":"IF($B2<>$AB$2,\"\",IF($B2=$AB$2,$A2))","v":""},{"$f":"IF($C2<>$AB$2,\"\",IF($C2=$AB$2,$A2))","v":""},{"$f":"IF($D2<>$AB$2,\"\",IF($D2=$AB$2,$A2))","v":""},{"$f":"IF($E2<>$AB$2,\"\",IF($E2=$AB$2,$A2))","v":""},{"$f":"IF($F2<>$AB$2,\"\",IF($F2=$AB$2,$A2))","v":""},{"$f":"IF(ISNA(LOOKUP(2.1,1/(AC2:AG2<>\"\"),AC2:AG2)),\"\",LOOKUP(2.1,1/(AC2:AG2<>\"\"),AC2:AG2))","v":""},{"$f":"IF(ISNA(AI3),\"\",AI3)","v":""},{"$f":"IF(ISNA(LOOKUP(2.1,1/(AH2:AH32<>\"\"),AH2:AH32)),\"\",LOOKUP(2.1,1/(AH2:AH32<>\"\"),AH2:AH32))","v":""},null,"CG",{"$f":"IF($B2<>$AL$2,\"\",IF($B2=$AL$2,$A2))","v":""},{"$f":"IF($C2<>$AL$2,\"\",IF($C2=$AL$2,$A2))","v":""},{"$f":"IF($D2<>$AL$2,\"\",IF($D2=$AL$2,$A2))","v":""},{"$f":"IF($E2<>$AL$2,\"\",IF($E2=$AL$2,$A2))","v":""},{"$f":"IF($F2<>$AL$2,\"\",IF($F2=$AL$2,$A2))","v":""},{"$f":"IF(ISNA(LOOKUP(2.1,1/(AM2:AQ2<>\"\"),AM2:AQ2)),\"\",LOOKUP(2.1,1/(AM2:AQ2<>\"\"),AM2:AQ2))","v":""},{"$f":"IF(ISNA(AS3),\"\",AS3)","v":""},{"$f":"IF(ISNA(LOOKUP(2.1,1/(AR2:AR32<>\"\"),AR2:AR32)),\"\",LOOKUP(2.1,1/(AR2:AR32<>\"\"),AR2:AR32))","v":""},null,"HV",{"$f":"IF($B$2<>$AV$2,\"\",IF($B$2=$AV$2,$A$2))","v":""},{"$f":"IF($C$2<>$AV$2,\"\",IF($C$2=$AV$2,$A$2))","v":""},{"$f":"IF($D$2<>$AV$2,\"\",IF($D$2=$AV$2,$A$2))","v":""},{"$f":"IF($E$2<>$AV$2,\"\",IF($E$2=$AV$2,$A$2))","v":""},{"$f":"IF($F$2<>$AV$2,\"\",IF($F$2=$AV$2,$A$2))","v":""},{"$f":"IF(ISNA(LOOKUP(2.1,1/(AW2:BA2<>\"\"),AW2:BA2)),\"\",LOOKUP(2.1,1/(AW2:BA2<>\"\"),AW2:BA2))","v":""},{"$f":"IF(ISNA(BC3),\"\",BC3)","v":""},{"$f":"IF(ISNA(LOOKUP(2.1,1/(BB2:BB32<>\"\"),BB2:BB32)),\"\",LOOKUP(2.1,1/(BB2:BB32<>\"\"),BB2:BB32))","v":""},null,"IP",{"$f":"IF($B$2<>$BF$2,\"\",IF($B$2=$BF$2,$A$2))","v":""},{"$f":"IF($C$2<>$BF$2,\"\",IF($C$2=$BF$2,$A$2))","v":""},{"$f":"IF($D$2<>$BF$2,\"\",IF($D$2=$BF$2,$A$2))","v":""},{"$f":"IF($E$2<>$BF$2,\"\",IF($E$2=$BF$2,$A$2))","v":""},{"$f":"IF($F$2<>$BF$2,\"\",IF($F$2=$BF$2,$A$2))","v":""},{"$f":"IF(ISNA(LOOKUP(2.1,1/(BG2:BK2<>\"\"),BG2:BK2)),\"\",LOOKUP(2.1,1/(BG2:BK2<>\"\"),BG2:BK2))","v":""},{"$f":"IF(ISNA(BM3),\"\",BM3)","v":""},{"$f":"IF(ISNA(LOOKUP(2.1,1/(BL2:BL32<>\"\"),BL2:BL32)),\"\",LOOKUP(2.1,1/(BL2:BL32<>\"\"),BL2:BL32))","v":""},null,"MG",{"$f":"IF($B$2<>$BP$2,\"\",IF($B$2=$BP$2,$A$2))","v":""},{"$f":"IF($C$2<>$BP$2,\"\",IF($C$2=$BP$2,$A$2))","v":""},{"$f":"IF($D$2<>$BP$2,\"\",IF($D$2=$BP$2,$A$2))","v":""},{"$f":"IF($E$2<>$BP$2,\"\",IF($E$2=$BP$2,$A$2))","v":""},{"$f":"IF($F$2<>$BP$2,\"\",IF($F$2=$BP$2,$A$2))","v":""},{"$f":"IF(ISNA(LOOKUP(2.1,1/(BQ2:BU2<>\"\"),BQ2:BU2)),\"\",LOOKUP(2.1,1/(BQ2:BU2<>\"\"),BQ2:BU2))","v":""},{"$f":"IF(ISNA(BW3),\"\",BW3)","v":""},{"$f":"IF(ISNA(LOOKUP(2.1,1/(BV2:BV32<>\"\"),BV2:BV32)),\"\",LOOKUP(2.1,1/(BV2:BV32<>\"\"),BV2:BV32))","v":""},null,"ML",{"$f":"IF($B$2<>$BZ$2,\"\",IF($B$2=$BZ$2,$A$2))","v":""},{"$f":"IF($C$2<>$BZ$2,\"\",IF($C$2=$BZ$2,$A$2))","v":""},{"$f":"IF($D$2<>$BZ$2,\"\",IF($D$2=$BZ$2,$A$2))","v":""},{"$f":"IF($E$2<>$BZ$2,\"\",IF($E$2=$BZ$2,$A$2))","v":""},{"$f":"IF($F$2<>$BZ$2,\"\",IF($F$2=$BZ$2,$A$2))","v":""},{"$f":"IF(ISNA(LOOKUP(2.1,1/(CA2:CE2<>\"\"),CA2:CE2)),\"\",LOOKUP(2.1,1/(CA2:CE2<>\"\"),CA2:CE2))","v":""},{"$f":"IF(ISNA(CG3),\"\",CG3)","v":""},{"$f":"IF(ISNA(LOOKUP(2.1,1/(CF2:CF32<>\"\"),CF2:CF32)),\"\",LOOKUP(2.1,1/(CF2:CF32<>\"\"),CF2:CF32))","v":""},null,"MOM",{"$f":"IF($B$2<>$CJ$2,\"\",IF($B$2=$CJ$2,$A$2))","v":""},{"$f":"IF($C$2<>$CJ$2,\"\",IF($C$2=$CJ$2,$A$2))","v":""},{"$f":"IF($D$2<>$CJ$2,\"\",IF($D$2=$CJ$2,$A$2))","v":""},{"$f":"IF($E$2<>$CJ$2,\"\",IF($E$2=$CJ$2,$A$2))","v":""},{"$f":"IF($F$2<>$CJ$2,\"\",IF($F$2=$CJ$2,$A$2))","v":""},{"$f":"IF(ISNA(LOOKUP(2.1,1/(CK2:CO2<>\"\"),CK2:CO2)),\"\",LOOKUP(2.1,1/(CK2:CO2<>\"\"),CK2:CO2))","v":""},{"$f":"IF(ISNA(CQ3),\"\",CQ3)","v":""},{"$f":"IF(ISNA(LOOKUP(2.1,1/(CP2:CP32<>\"\"),CP2:CP32)),\"\",LOOKUP(2.1,1/(CP2:CP32<>\"\"),CP2:CP32))","v":""},null,"MP",{"$f":"IF($B$2<>$CT$2,\"\",IF($B$2=$CT$2,$A$2))","v":""},{"$f":"IF($C$2<>$CT$2,\"\",IF($C$2=$CT$2,$A$2))","v":""},{"$f":"IF($D$2<>$CT$2,\"\",IF($D$2=$CT$2,$A$2))","v":""},{"$f":"IF($E$2<>$CT$2,\"\",IF($E$2=$CT$2,$A$2))","v":""},{"$f":"IF($F$2<>$CT$2,\"\",IF($F$2=$CT$2,$A$2))","v":""},{"$f":"IF(ISNA(LOOKUP(2.1,1/(CU2:CY2<>\"\"),CU2:CY2)),\"\",LOOKUP(2.1,1/(CU2:CY2<>\"\"),CU2:CY2))","v":""},{"$f":"IF(ISNA(DA3),\"\",DA3)","v":""},{"$f":"IF(ISNA(LOOKUP(2.1,1/(CZ2:CZ32<>\"\"),CZ2:CZ32)),\"\",LOOKUP(2.1,1/(CZ2:CZ32<>\"\"),CZ2:CZ32))","v":""},null,"OC",{"$f":"IF($B$2<>$DD$2,\"\",IF($B$2=$DD$2,$A$2))","v":""},{"$f":"IF($C$2<>$DD$2,\"\",IF($C$2=$DD$2,$A$2))","v":""},{"$f":"IF($D$2<>$DD$2,\"\",IF($D$2=$DD$2,$A$2))","v":""},{"$f":"IF($E$2<>$DD$2,\"\",IF($E$2=$DD$2,$A$2))","v":""},{"$f":"IF($F$2<>$DD$2,\"\",IF($F$2=$DD$2,$A$2))","v":""},{"$f":"IF(ISNA(LOOKUP(2.1,1/(DE2:DI2<>\"\"),DE2:DI2)),\"\",LOOKUP(2.1,1/(DE2:DI2<>\"\"),DE2:DI2))","v":""},{"$f":"IF(ISNA(DK3),\"\",DK3)","v":""},{"$f":"IF(ISNA(LOOKUP(2.1,1/(DJ2:DJ32<>\"\"),DJ2:DJ32)),\"\",LOOKUP(2.1,1/(DJ2:DJ32<>\"\"),DJ2:DJ32))","v":""},null,"PW",{"$f":"IF($B$2<>$DN$2,\"\",IF($B$2=$DN$2,$A$2))","v":""},{"$f":"IF($C$2<>$DN$2,\"\",IF($C$2=$DN$2,$A$2))","v":""},{"$f":"IF($D$2<>$DN$2,\"\",IF($D$2=$DN$2,$A$2))","v":""},{"$f":"IF($E$2<>$DN$2,\"\",IF($E$2=$DN$2,$A$2))","v":""},{"$f":"IF($F$2<>$DN$2,\"\",IF($F$2=$DN$2,$A$2))","v":""},{"$f":"IF(ISNA(LOOKUP(2.1,1/(DO2:DS2<>\"\"),DO2:DS2)),\"\",LOOKUP(2.1,1/(DO2:DS2<>\"\"),DO2:DS2))","v":""},{"$f":"IF(ISNA(DU3),\"\",DU3)","v":""},{"$f":"IF(ISNA(LOOKUP(2.1,1/(DT2:DT32<>\"\"),DT2:DT32)),\"\",LOOKUP(2.1,1/(DT2:DT32<>\"\"),DT2:DT32))","v":""},null,"RN",{"$f":"IF($B$2<>$DX$2,\"\",IF($B$2=$DX$2,$A$2))","v":""},{"$f":"IF($C$2<>$DX$2,\"\",IF($C$2=$DX$2,$A$2))","v":""},{"$f":"IF($D$2<>$DX$2,\"\",IF($D$2=$DX$2,$A$2))","v":""},{"$f":"IF($E$2<>$DX$2,\"\",IF($E$2=$DX$2,$A$2))","v":""},{"$f":"IF($F$2<>$DX$2,\"\",IF($F$2=$DX$2,$A$2))","v":""},{"$f":"IF(ISNA(LOOKUP(2.1,1/(DY2:EC2<>\"\"),DY2:EC2)),\"\",LOOKUP(2.1,1/(DY2:EC2<>\"\"),DY2:EC2))","v":""},{"$f":"IF(ISNA(EE3),\"\",EE3)","v":""},{"$f":"IF(ISNA(LOOKUP(2.1,1/(ED2:ED32<>\"\"),ED2:ED32)),\"\",LOOKUP(2.1,1/(ED2:ED32<>\"\"),ED2:ED32))","v":""},null,"SR",{"$f":"IF($B$2<>$EH$2,\"\",IF($B$2=$EH$2,$A$2))","v":""},{"$f":"IF($C$2<>$EH$2,\"\",IF($C$2=$EH$2,$A$2))","v":""},{"$f":"IF($D$2<>$EH$2,\"\",IF($D$2=$EH$2,$A$2))","v":""},{"$f":"IF($E$2<>$EH$2,\"\",IF($E$2=$EH$2,$A$2))","v":""},{"$f":"IF($F$2<>$EH$2,\"\",IF($F$2=$EH$2,$A$2))","v":""},{"$f":"IF(ISNA(LOOKUP(2.1,1/(EI2:EM2<>\"\"),EI2:EM2)),\"\",LOOKUP(2.1,1/(EI2:EM2<>\"\"),EI2:EM2))","v":""},{"$f":"IF(ISNA(EO3),\"\",EO3)","v":""},{"$f":"IF(ISNA(LOOKUP(2.1,1/(EN2:EN32<>\"\"),EN2:EN32)),\"\",LOOKUP(2.1,1/(EN2:EN32<>\"\"),EN2:EN32))","v":""},null,"TS",{"$f":"IF($B$2<>$ER$2,\"\",IF($B$2=$ER$2,$A$2))","v":""},{"$f":"IF($C$2<>$ER$2,\"\",IF($C$2=$ER$2,$A$2))","v":""},{"$f":"IF($D$2<>$ER$2,\"\",IF($D$2=$ER$2,$A$2))","v":""},{"$f":"IF($E$2<>$ER$2,\"\",IF($E$2=$ER$2,$A$2))","v":""},{"$f":"IF($F$2<>$ER$2,\"\",IF($F$2=$ER$2,$A$2))","v":""},{"$f":"IF(ISNA(LOOKUP(2.1,1/(ES2:EW2<>\"\"),ES2:EW2)),\"\",LOOKUP(2.1,1/(ES2:EW2<>\"\"),ES2:EW2))","v":""},{"$f":"IF(ISNA(EY3),\"\",EY3)","v":""},{"$f":"IF(ISNA(LOOKUP(2.1,1/(EX2:EX32<>\"\"),EX2:EX32)),\"\",LOOKUP(2.1,1/(EX2:EX32<>\"\"),EX2:EX32))","v":""},null,"VC",{"$f":"IF($B$2<>$FB$2,\"\",IF($B$2=$FB$2,$A$2))","v":""},{"$f":"IF($C$2<>$FB$2,\"\",IF($C$2=$FB$2,$A$2))","v":""},{"$f":"IF($D$2<>$FB$2,\"\",IF($D$2=$FB$2,$A$2))","v":""},{"$f":"IF($E$2<>$FB$2,\"\",IF($E$2=$FB$2,$A$2))","v":""},{"$f":"IF($F$2<>$FB$2,\"\",IF($F$2=$FB$2,$A$2))","v":""},{"$f":"IF(ISNA(LOOKUP(2.1,1/(FC2:FG2<>\"\"),FC2:FG2)),\"\",LOOKUP(2.1,1/(FC2:FG2<>\"\"),FC2:FG2))","v":""},{"$f":"IF(ISNA(FI3),\"\",FI3)","v":""},{"$f":"IF(ISNA(LOOKUP(2.1,1/(FH2:FH32<>\"\"),FH2:FH32)),\"\",LOOKUP(2.1,1/(FH2:FH32<>\"\"),FH2:FH32))","v":""}]
[{"$f":"'calculs - masquer'!E3","v":"2016-01-02"},"AG",{"$nulls":6},"AG",{"$f":"IF($C3<>$H$2,\"\",IF($C3=$H$2,$A3))","v":""},{"$f":"IF($D3<>$H$2,\"\",IF($D3=$H$2,$A3))","v":""},{"$f":"IF($E3<>$H$2,\"\",IF($E3=$H$2,$A3))","v":""},{"$f":"IF($F3<>$H$2,\"\",IF($F3=$H$2,$A3))","v":""},"2016-01-02",{"$f":"INDEX(N2:N32,MATCH(TRUE,N2:N32<>\"\",0))","v":42370},{"$nulls":3},{"$f":"IF($B3<>$R$2,\"\",IF($B3=$R$2,$A3))","v":""},{"$f":"IF($C3<>$R$2,\"\",IF($C3=$R$2,$A3))","v":""},{"$f":"IF($D3<>$R$2,\"\",IF($D3=$R$2,$A3))","v":""},{"$f":"IF($E3<>$R$2,\"\",IF($E3=$R$2,$A3))","v":""},{"$f":"IF($F3<>$R$2,\"\",IF($F3=$R$2,$A3))","v":""},{"$f":"IF(ISNA(LOOKUP(2.1,1/(S3:W3<>\"\"),S3:W3)),\"\",LOOKUP(2.1,1/(S3:W3<>\"\"),S3:W3))","v":""},{"$f":"INDEX(X2:X32,MATCH(TRUE,X2:X32<>\"\",0))","v":"a"},{"$nulls":3},{"$f":"IF($B3<>$AB$2,\"\",IF($B3=$AB$2,$A3))","v":""},{"$f":"IF($C3<>$AB$2,\"\",IF($C3=$AB$2,$A3))","v":""},{"$f":"IF($D3<>$AB$2,\"\",IF($D3=$AB$2,$A3))","v":""},{"$f":"IF($E3<>$AB$2,\"\",IF($E3=$AB$2,$A3))","v":""},{"$f":"IF($F3<>$AB$2,\"\",IF($F3=$AB$2,$A3))","v":""},{"$f":"IF(ISNA(LOOKUP(2.1,1/(AC3:AG3<>\"\"),AC3:AG3)),\"\",LOOKUP(2.1,1/(AC3:AG3<>\"\"),AC3:AG3))","v":""},{"$f":"INDEX(AH2:AH32,MATCH(TRUE,AH2:AH32<>\"\",0))","v":{"$error":"#N/A"}},{"$nulls":3},{"$f":"IF($B3<>$AL$2,\"\",IF($B3=$AL$2,$A3))","v":""},{"$f":"IF($C3<>$AL$2,\"\",IF($C3=$AL$2,$A3))","v":""},{"$f":"IF($D3<>$AL$2,\"\",IF($D3=$AL$2,$A3))","v":""},{"$f":"IF($E3<>$AL$2,\"\",IF($E3=$AL$2,$A3))","v":""},{"$f":"IF($F3<>$AL$2,\"\",IF($F3=$AL$2,$A3))","v":""},{"$f":"IF(ISNA(LOOKUP(2.1,1/(AM3:AQ3<>\"\"),AM3:AQ3)),\"\",LOOKUP(2.1,1/(AM3:AQ3<>\"\"),AM3:AQ3))","v":""},{"$f":"INDEX(AR2:AR32,MATCH(TRUE,AR2:AR32<>\"\",0))","v":{"$error":"#N/A"}},{"$nulls":3},{"$f":"IF($B$2<>$AV$2,\"\",IF($B$2=$AV$2,$A$2))","v":""},{"$f":"IF($C$2<>$AV$2,\"\",IF($C$2=$AV$2,$A$2))","v":""},{"$f":"IF($D$2<>$AV$2,\"\",IF($D$2=$AV$2,$A$2))","v":""},{"$f":"IF($E$2<>$AV$2,\"\",IF($E$2=$AV$2,$A$2))","v":""},{"$f":"IF($F$2<>$AV$2,\"\",IF($F$2=$AV$2,$A$2))","v":""},{"$f":"IF(ISNA(LOOKUP(2.1,1/(AW3:BA3<>\"\"),AW3:BA3)),\"\",LOOKUP(2.1,1/(AW3:BA3<>\"\"),AW3:BA3))","v":""},{"$f":"INDEX(BB2:BB32,MATCH(TRUE,BB2:BB32<>\"\",0))","v":{"$error":"#N/A"}},{"$nulls":3},{"$f":"IF($B$2<>$BF$2,\"\",IF($B$2=$BF$2,$A$2))","v":""},{"$f":"IF($C$2<>$BF$2,\"\",IF($C$2=$BF$2,$A$2))","v":""},{"$f":"IF($D$2<>$BF$2,\"\",IF($D$2=$BF$2,$A$2))","v":""},{"$f":"IF($E$2<>$BF$2,\"\",IF($E$2=$BF$2,$A$2))","v":""},{"$f":"IF($F$2<>$BF$2,\"\",IF($F$2=$BF$2,$A$2))","v":""},{"$f":"IF(ISNA(LOOKUP(2.1,1/(BG3:BK3<>\"\"),BG3:BK3)),\"\",LOOKUP(2.1,1/(BG3:BK3<>\"\"),BG3:BK3))","v":""},{"$f":"INDEX(BL2:BL32,MATCH(TRUE,BL2:BL32<>\"\",0))","v":{"$error":"#N/A"}},{"$nulls":3},{"$f":"IF($B$2<>$BP$2,\"\",IF($B$2=$BP$2,$A$2))","v":""},{"$f":"IF($C$2<>$BP$2,\"\",IF($C$2=$BP$2,$A$2))","v":""},{"$f":"IF($D$2<>$BP$2,\"\",IF($D$2=$BP$2,$A$2))","v":""},{"$f":"IF($E$2<>$BP$2,\"\",IF($E$2=$BP$2,$A$2))","v":""},{"$f":"IF($F$2<>$BP$2,\"\",IF($F$2=$BP$2,$A$2))","v":""},{"$f":"IF(ISNA(LOOKUP(2.1,1/(BQ3:BU3<>\"\"),BQ3:BU3)),\"\",LOOKUP(2.1,1/(BQ3:BU3<>\"\"),BQ3:BU3))","v":""},{"$f":"INDEX(BV2:BV32,MATCH(TRUE,BV2:BV32<>\"\",0))","v":{"$error":"#N/A"}},{"$nulls":3},{"$f":"IF($B$2<>$BZ$2,\"\",IF($B$2=$BZ$2,$A$2))","v":""},{"$f":"IF($C$2<>$BZ$2,\"\",IF($C$2=$BZ$2,$A$2))","v":""},{"$f":"IF($D$2<>$BZ$2,\"\",IF($D$2=$BZ$2,$A$2))","v":""},{"$f":"IF($E$2<>$BZ$2,\"\",IF($E$2=$BZ$2,$A$2))","v":""},{"$f":"IF($F$2<>$BZ$2,\"\",IF($F$2=$BZ$2,$A$2))","v":""},{"$f":"IF(ISNA(LOOKUP(2.1,1/(CA3:CE3<>\"\"),CA3:CE3)),\"\",LOOKUP(2.1,1/(CA3:CE3<>\"\"),CA3:CE3))","v":""},{"$f":"INDEX(CF2:CF32,MATCH(TRUE,CF2:CF32<>\"\",0))","v":{"$error":"#N/A"}},{"$nulls":3},{"$f":"IF($B$2<>$CJ$2,\"\",IF($B$2=$CJ$2,$A$2))","v":""},{"$f":"IF($C$2<>$CJ$2,\"\",IF($C$2=$CJ$2,$A$2))","v":""},{"$f":"IF($D$2<>$CJ$2,\"\",IF($D$2=$CJ$2,$A$2))","v":""},{"$f":"IF($E$2<>$CJ$2,\"\",IF($E$2=$CJ$2,$A$2))","v":""},{"$f":"IF($F$2<>$CJ$2,\"\",IF($F$2=$CJ$2,$A$2))","v":""},{"$f":"IF(ISNA(LOOKUP(2.1,1/(CK3:CO3<>\"\"),CK3:CO3)),\"\",LOOKUP(2.1,1/(CK3:CO3<>\"\"),CK3:CO3))","v":""},{"$f":"INDEX(CP2:CP32,MATCH(TRUE,CP2:CP32<>\"\",0))","v":{"$error":"#N/A"}},{"$nulls":3},{"$f":"IF($B$2<>$CT$2,\"\",IF($B$2=$CT$2,$A$2))","v":""},{"$f":"IF($C$2<>$CT$2,\"\",IF($C$2=$CT$2,$A$2))","v":""},{"$f":"IF($D$2<>$CT$2,\"\",IF($D$2=$CT$2,$A$2))","v":""},{"$f":"IF($E$2<>$CT$2,\"\",IF($E$2=$CT$2,$A$2))","v":""},{"$f":"IF($F$2<>$CT$2,\"\",IF($F$2=$CT$2,$A$2))","v":""},{"$f":"IF(ISNA(LOOKUP(2.1,1/(CU3:CY3<>\"\"),CU3:CY3)),\"\",LOOKUP(2.1,1/(CU3:CY3<>\"\"),CU3:CY3))","v":""},{"$f":"INDEX(CZ2:CZ32,MATCH(TRUE,CZ2:CZ32<>\"\",0))","v":{"$error":"#N/A"}},{"$nulls":3},{"$f":"IF($B$2<>$DD$2,\"\",IF($B$2=$DD$2,$A$2))","v":""},{"$f":"IF($C$2<>$DD$2,\"\",IF($C$2=$DD$2,$A$2))","v":""},{"$f":"IF($D$2<>$DD$2,\"\",IF($D$2=$DD$2,$A$2))","v":""},{"$f":"IF($E$2<>$DD$2,\"\",IF($E$2=$DD$2,$A$2))","v":""},{"$f":"IF($F$2<>$DD$2,\"\",IF($F$2=$DD$2,$A$2))","v":""},{"$f":"IF(ISNA(LOOKUP(2.1,1/(DE3:DI3<>\"\"),DE3:DI3)),\"\",LOOKUP(2.1,1/(DE3:DI3<>\"\"),DE3:DI3))","v":""},{"$f":"INDEX(DJ2:DJ32,MATCH(TRUE,DJ2:DJ32<>\"\",0))","v":{"$error":"#N/A"}},{"$nulls":3},{"$f":"IF($B$2<>$DN$2,\"\",IF($B$2=$DN$2,$A$2))","v":""},{"$f":"IF($C$2<>$DN$2,\"\",IF($C$2=$DN$2,$A$2))","v":""},{"$f":"IF($D$2<>$DN$2,\"\",IF($D$2=$DN$2,$A$2))","v":""},{"$f":"IF($E$2<>$DN$2,\"\",IF($E$2=$DN$2,$A$2))","v":""},{"$f":"IF($F$2<>$DN$2,\"\",IF($F$2=$DN$2,$A$2))","v":""},{"$f":"IF(ISNA(LOOKUP(2.1,1/(DO3:DS3<>\"\"),DO3:DS3)),\"\",LOOKUP(2.1,1/(DO3:DS3<>\"\"),DO3:DS3))","v":""},{"$f":"INDEX(DT2:DT32,MATCH(TRUE,DT2:DT32<>\"\",0))","v":{"$error":"#N/A"}},{"$nulls":3},{"$f":"IF($B$2<>$DX$2,\"\",IF($B$2=$DX$2,$A$2))","v":""},{"$f":"IF($C$2<>$DX$2,\"\",IF($C$2=$DX$2,$A$2))","v":""},{"$f":"IF($D$2<>$DX$2,\"\",IF($D$2=$DX$2,$A$2))","v":""},{"$f":"IF($E$2<>$DX$2,\"\",IF($E$2=$DX$2,$A$2))","v":""},{"$f":"IF($F$2<>$DX$2,\"\",IF($F$2=$DX$2,$A$2))","v":""},{"$f":"IF(ISNA(LOOKUP(2.1,1/(DY3:EC3<>\"\"),DY3:EC3)),\"\",LOOKUP(2.1,1/(DY3:EC3<>\"\"),DY3:EC3))","v":""},{"$f":"INDEX(ED2:ED32,MATCH(TRUE,ED2:ED32<>\"\",0))","v":{"$error":"#N/A"}},{"$nulls":3},{"$f":"IF($B$2<>$EH$2,\"\",IF($B$2=$EH$2,$A$2))","v":""},{"$f":"IF($C$2<>$EH$2,\"\",IF($C$2=$EH$2,$A$2))","v":""},{"$f":"IF($D$2<>$EH$2,\"\",IF($D$2=$EH$2,$A$2))","v":""},{"$f":"IF($E$2<>$EH$2,\"\",IF($E$2=$EH$2,$A$2))","v":""},{"$f":"IF($F$2<>$EH$2,\"\",IF($F$2=$EH$2,$A$2))","v":""},{"$f":"IF(ISNA(LOOKUP(2.1,1/(EI3:EM3<>\"\"),EI3:EM3)),\"\",LOOKUP(2.1,1/(EI3:EM3<>\"\"),EI3:EM3))","v":""},{"$f":"INDEX(EN2:EN32,MATCH(TRUE,EN2:EN32<>\"\",0))","v":{"$error":"#N/A"}},{"$nulls":3},{"$f":"IF($B$2<>$ER$2,\"\",IF($B$2=$ER$2,$A$2))","v":""},{"$f":"IF($C$2<>$ER$2,\"\",IF($C$2=$ER$2,$A$2))","v":""},{"$f":"IF($D$2<>$ER$2,\"\",IF($D$2=$ER$2,$A$2))","v":""},{"$f":"IF($E$2<>$ER$2,\"\",IF($E$2=$ER$2,$A$2))","v":""},{"$f":"IF($F$2<>$ER$2,\"\",IF($F$2=$ER$2,$A$2))","v":""},{"$f":"IF(ISNA(LOOKUP(2.1,1/(ES3:EW3<>\"\"),ES3:EW3)),\"\",LOOKUP(2.1,1/(ES3:EW3<>\"\"),ES3:EW3))","v":""},{"$f":"INDEX(EX2:EX32,MATCH(TRUE,EX2:EX32<>\"\",0))","v":{"$error":"#N/A"}},{"$nulls":3},{"$f":"IF($B$2<>$FB$2,\"\",IF($B$2=$FB$2,$A$2))","v":""},{"$f":"IF($C$2<>$FB$2,\"\",IF($C$2=$FB$2,$A$2))","v":""},{"$f":"IF($D$2<>$FB$2,\"\",IF($D$2=$FB$2,$A$2))","v":""},{"$f":"IF($E$2<>$FB$2,\"\",IF($E$2=$FB$2,$A$2))","v":""},{"$f":"IF($F$2<>$FB$2,\"\",IF($F$2=$FB$2,$A$2))","v":""},{"$f":"IF(ISNA(LOOKUP(2.1,1/(FC3:FG3<>\"\"),FC3:FG3)),\"\",LOOKUP(2.1,1/(FC3:FG3<>\"\"),FC3:FG3))","v":""},{"$f":"INDEX(FH2:FH32,MATCH(TRUE,FH2:FH32<>\"\",0))","v":{"$error":"#N/A"}}]
[{"$f":"'calculs - masquer'!E4","v":"2016-01-03"},"AG",{"$nulls":6},"AG","","","","","2016-01-03",{"$nulls":4},"","","","","","a",{"$nulls":4},"","","","","","",{"$nulls":4},"","","","","","",{"$nulls":4},"","","","","","",{"$nulls":4},"","","","","","",{"$nulls":4},"","","","","","",{"$nulls":4},"","","","","","",{"$nulls":4},"","","","","","",{"$nulls":4},"","","","","","",{"$nulls":4},"","","","","","",{"$nulls":4},"","","","","","",{"$nulls":4},"","","","","","",{"$nulls":4},"","","","","","",{"$nulls":4},"","","","","","",{"$nulls":4},"","","","","",""]
[{"$f":"'calculs - masquer'!E5","v":"2016-01-04"},"AG",{"$nulls":6},"AG","","","","","2016-01-04",{"$nulls":4},"","","","","","",{"$nulls":4},"","","","","","",{"$nulls":4},"","","","","","",{"$nulls":4},"","","","","","",{"$nulls":4},"","","","","","",{"$nulls":4},"","","","","","",{"$nulls":4},"","","","","","",{"$nulls":4},"","","","","","",{"$nulls":4},"","","","","","",{"$nulls":4},"","","","","","",{"$nulls":4},"","","","","","",{"$nulls":4},"","","","","","",{"$nulls":4},"","","","","","",{"$nulls":4},"","","","","","",{"$nulls":4},"","","","","",""]
[{"$f":"'calculs - masquer'!E6","v":"2016-01-05"},{"$nulls":7},"AG","","","","","2016-01-05",{"$nulls":4},"","","","","","",{"$nulls":4},"","","","","","",{"$nulls":4},"","","","","","",{"$nulls":4},"","","","","","",{"$nulls":4},"","","","","","",{"$nulls":4},"","","","","","",{"$nulls":4},"","","","","","",{"$nulls":4},"","","","","","",{"$nulls":4},"","","","","","",{"$nulls":4},"","","","","","",{"$nulls":4},"","","","","","",{"$nulls":4},"","","","","","",{"$nulls":4},"","","","","","",{"$nulls":4},"","","","","","",{"$nulls":4},"","","","","",""]
[{"$f":"'calculs - masquer'!E7","v":"2016-01-06"},{"$nulls":7},{"$f":"IF($B7<>$H$2,\"\",IF($B7=$H$2,$A7))","v":""},"","","","",{"$nulls":5},"","","","","","a",{"$nulls":4},"","","","","","",{"$nulls":4},"","","","","","",{"$nulls":4},"","","","","","",{"$nulls":4},"","","","","","",{"$nulls":4},"","","","","","",{"$nulls":4},"","","","","","",{"$nulls":4},"","","","","","",{"$nulls":4},"","","","","","",{"$nulls":4},"","","","","","",{"$nulls":4},"","","","","","",{"$nulls":4},"","","","","","",{"$nulls":4},"","","","","","",{"$nulls":4},"","","","","","",{"$nulls":4},"","","","","",""]
[{"$f":"'calculs - masquer'!E8","v":"2016-01-07"},null,"AG",{"$nulls":5},"","AG","","","","2016-01-07",{"$nulls":4},"","","","","","a",{"$nulls":4},"","","","","","",{"$nulls":4},"","","","","","",{"$nulls":4},"","","","","","",{"$nulls":4},"","","","","","",{"$nulls":4},"","","","","","",{"$nulls":4},"","","","","","",{"$nulls":4},"","","","","","",{"$nulls":4},"","","","","","",{"$nulls":4},"","","","","","",{"$nulls":4},"","","","","","",{"$nulls":4},"","","","","","",{"$nulls":4},"","","","","","",{"$nulls":4},"","","","","","",{"$nulls":4},"","","","","",""]
[{"$f":"'calculs - masquer'!E9","v":"2016-01-08"},null,"AG",{"$nulls":5},"","AG","","","","2016-01-08",{"$nulls":4},"","","","","","",{"$nulls":4},"","","","","","",{"$nulls":4},"","","","","","",{"$nulls":4},"","","","","","",{"$nulls":4},"","","","","","",{"$nulls":4},"","","","","","",{"$nulls":4},"","","","","","",{"$nulls":4},"","","","","","",{"$nulls":4},"","","","","","",{"$nulls":4},"","","","","","",{"$nulls":4},"","","","","","",{"$nulls":4},"","","","","","",{"$nulls":4},"","","","","","",{"$nulls":4},"","","","","","",{"$nulls":4},"","","","","",""]
[{"$f":"'calculs - masquer'!E10","v":"2016-01-09"},null,"AG",{"$nulls":5},"","AG","","","","2016-01-09",{"$nulls":4},"","","","","","",{"$nulls":4},"","","","","","",{"$nulls":4},"","","","","","",{"$nulls":4},"","","","","","",{"$nulls":4},"","","","","","",{"$nulls":4},"","","","","","",{"$nulls":4},"","","","","","",{"$nulls":4},"","","","","","",{"$nulls":4},"","","","","","",{"$nulls":4},"","","","","","",{"$nulls":4},"","","","","","",{"$nulls":4},"","","","","","",{"$nulls":4},"","","","","","",{"$nulls":4},"","","","","","",{"$nulls":4},"","","","","",""]
[{"$f":"'calculs - masquer'!E11","v":"2016-01-10"},null,"AG",{"$nulls":5},"","AG","","","","2016-01-10",{"$nulls":4},"","","","","","",{"$nulls":4},"","","","","","",{"$nulls":4},"","","","","","",{"$nulls":4},"","","","","","",{"$nulls":4},"","","","","","",{"$nulls":4},"","","","","","",{"$nulls":4},"","","","","","",{"$nulls":4},"","","","","","",{"$nulls":4},"","","","","","",{"$nulls":4},"","","","","","",{"$nulls":4},"","","","","","",{"$nulls":4},"","","","","","",{"$nulls":4},"","","","","","",{"$nulls":4},"","","","","","",{"$nulls":4},"","","","","",""]
[{"$f":"'calculs - masquer'!E12","v":"2016-01-11"},null,"AG",{"$nulls":5},"","AG","","","","2016-01-11",{"$nulls":4},"","","","","","",{"$nulls":4},"","","","","","",{"$nulls":4},"","","","","","",{"$nulls":4},"","","","","","",{"$nulls":4},"","","","","","",{"$nulls":4},"","","","","","",{"$nulls":4},"","","","","","",{"$nulls":4},"","","","","","",{"$nulls":4},"","","","","","",{"$nulls":4},"","","","","","",{"$nulls":4},"","","","","","",{"$nulls":4},"","","","","","",{"$nulls":4},"","","","","","",{"$nulls":4},"","","","","","",{"$nulls":4},"","","","","",""]
[{"$f":"'calculs - masquer'!E13","v":"2016-01-12"},null,"AG",{"$nulls":5},"","AG","","","","2016-01-12",{"$nulls":4},"","","","","","",{"$nulls":4},"","","","","","",{"$nulls":4},"","","","","","",{"$nulls":4},"","","","","","",{"$nulls":4},"","","","","","",{"$nulls":4},"","","","","","",{"$nulls":4},"","","","","","",{"$nulls":4},"","","","","","",{"$nulls":4},"","","","","","",{"$nulls":4},"","","","","","",{"$nulls":4},"","","","","","",{"$nulls":4},"","","","","","",{"$nulls":4},"","","","","","",{"$nulls":4},"","","","","","",{"$nulls":4},"","","","","",""]
[{"$f":"'calculs - masquer'!E14","v":"2016-01-13"},null,"AG",{"$nulls":5},"","AG","","","","2016-01-13",{"$nulls":4},"","","","","","",{"$nulls":4},"","","","","","",{"$nulls":4},"","","","","","",{"$nulls":4},"","","","","","",{"$nulls":4},"","","","","","",{"$nulls":4},"","","","","","",{"$nulls":4},"","","","","","",{"$nulls":4},"","","","","","",{"$nulls":4},"","","","","","",{"$nulls":4},"","","","","","",{"$nulls":4},"","","","","","",{"$nulls":4},"","","","","","",{"$nulls":4},"","","","","","",{"$nulls":4},"","","","","","",{"$nulls":4},"","","","","",""]
[{"$f":"'calculs - masquer'!E15","v":"2016-01-14"},{"$nulls":7},"","","","","",{"$nulls":5},"","","","","","",{"$nulls":4},"","","","","","",{"$nulls":4},"","","","","","",{"$nulls":4},"","","","","","",{"$nulls":4},"","","","","","",{"$nulls":4},"","","","","","",{"$nulls":4},"","","","","","",{"$nulls":4},"","","","","","",{"$nulls":4},"","","","","","",{"$nulls":4},"","","","","","",{"$nulls":4},"","","","","","",{"$nulls":4},"","","","","","",{"$nulls":4},"","","","","","",{"$nulls":4},"","","","","","",{"$nulls":4},"","","","","",""]
[{"$f":"'calculs - masquer'!E16","v":"2016-01-15"},{"$nulls":7},"","","","","",{"$nulls":5},"","","","","","",{"$nulls":4},"","","","","","",{"$nulls":4},"","","","","","",{"$nulls":4},"","","","","","",{"$nulls":4},"","","","","","",{"$nulls":4},"","","","","","",{"$nulls":4},"","","","","","",{"$nulls":4},"","","","","","",{"$nulls":4},"","","","","","",{"$nulls":4},"","","","","","",{"$nulls":4},"","","","","","",{"$nulls":4},"","","","","","",{"$nulls":4},"","","","","","",{"$nulls":4},"","","","","","",{"$nulls":4},"","","","","",""]
[{"$f":"'calculs - masquer'!E17","v":"2016-01-16"},{"$nulls":7},"","","","","",{"$nulls":5},"","","","","","",{"$nulls":4},"","","","","","",{"$nulls":4},"","","","","","",{"$nulls":4},"","","","","","",{"$nulls":4},"","","","","","",{"$nulls":4},"","","","","","",{"$nulls":4},"","","","","","",{"$nulls":4},"","","","","","",{"$nulls":4},"","","","","","",{"$nulls":4},"","","","","","",{"$nulls":4},"","","","","","",{"$nulls":4},"","","","","","",{"$nulls":4},"","","","","","",{"$nulls":4},"","","","","","",{"$nulls":4},"","","","","",""]
[{"$f":"'calculs - masquer'!E18","v":"2016-01-17"},{"$nulls":7},"","","","","",{"$nulls":5},"","","","","","",{"$nulls":4},"","","","","","",{"$nulls":4},"","","","","","",{"$nulls":4},"","","","","","",{"$nulls":4},"","","","","","",{"$nulls":4},"","","","","","",{"$nulls":4},"","","","","","",{"$nulls":4},"","","","","","",{"$nulls":4},"","","","","","",{"$nulls":4},"","","","","","",{"$nulls":4},"","","","","","",{"$nulls":4},"","","","","","",{"$nulls":4},"","","","","","",{"$nulls":4},"","","","","","",{"$nulls":4},"","","","","",""]
[{"$f":"'calculs - masquer'!E19","v":"2016-01-18"},"AG",{"$nulls":6},"AG","","","","","2016-01-18",{"$nulls":4},"","","","","","",{"$nulls":4},"","","","","","",{"$nulls":4},"","","","","","",{"$nulls":4},"","","","","","",{"$nulls":4},"","","","","","",{"$nulls":4},"","","","","","",{"$nulls":4},"","","","","","",{"$nulls":4},"","","","","","",{"$nulls":4},"","","","","","",{"$nulls":4},"","","","","","",{"$nulls":4},"","","","","","",{"$nulls":4},"","","","","","",{"$nulls":4},"","","","","","",{"$nulls":4},"","","","","","",{"$nulls":4},"","","","","",""]
[{"$f":"'calculs - masquer'!E20","v":"2016-01-19"},"AG",{"$nulls":6},"AG","","","","","2016-01-19",{"$nulls":4},"","","","","","",{"$nulls":4},"","","","","","",{"$nulls":4},"","","","","","",{"$nulls":4},"","","","","","",{"$nulls":4},"","","","","","",{"$nulls":4},"","","","","","",{"$nulls":4},"","","","","","",{"$nulls":4},"","","","","","",{"$nulls":4},"","","","","","",{"$nulls":4},"","","","","","",{"$nulls":4},"","","","","","",{"$nulls":4},"","","","","","",{"$nulls":4},"","","","","","",{"$nulls":4},"","","","","","",{"$nulls":4},"","","","","",""]
[{"$f":"'calculs - masquer'!E21","v":"2016-01-20"},"AG",{"$nulls":6},"AG","","","","","2016-01-20",{"$nulls":4},"","","","","","",{"$nulls":4},"","","","","","",{"$nulls":4},"","","","","","",{"$nulls":4},"","","","","","",{"$nulls":4},"","","","","","",{"$nulls":4},"","","","","","",{"$nulls":4},"","","","","","",{"$nulls":4},"","","","","","",{"$nulls":4},"","","","","","",{"$nulls":4},"","","","","","",{"$nulls":4},"","","","","","",{"$nulls":4},"","","","","","",{"$nulls":4},"","","","","","",{"$nulls":4},"","",{"$f":"IF($D$2<>$ER$2,\"\",IF($D$2=$ER$2,$A$2))","v":""},"","","",{"$nulls":4},"","","","","",""]
[{"$f":"'calculs - masquer'!E22","v":"2016-01-21"},null,"AG",{"$nulls":5},"","AG","","","","2016-01-21",{"$nulls":4},"","","","","","",{"$nulls":4},"","","","","","",{"$nulls":4},"","","","","","",{"$nulls":4},"","","","","","",{"$nulls":4},"","","","","","",{"$nulls":4},"","","","","","",{"$nulls":4},"","","","","","",{"$nulls":4},"","","","","","",{"$nulls":4},"","","","","","",{"$nulls":4},"","","","","","",{"$nulls":4},"","","","","","",{"$nulls":4},"","","","","","",{"$nulls":4},"","","","","","",{"$nulls":4},"","","","","","",{"$nulls":4},"","","","","",""]
[{"$f":"'calculs - masquer'!E23","v":"2016-01-22"},null,null,"AG",{"$nulls":4},"","","AG","","","2016-01-22",{"$nulls":4},"","","","","","",{"$nulls":4},"","","","","","",{"$nulls":4},"","","","","","",{"$nulls":4},"","","","","","",{"$nulls":4},"","","","","","",{"$nulls":4},"","","","","","",{"$nulls":4},"","","","","","",{"$nulls":4},"","","","","","",{"$nulls":4},"","","","","","",{"$nulls":4},"","","","","","",{"$nulls":4},"","","","","","",{"$nulls":4},"","","","","","",{"$nulls":4},"","","","","","",{"$nulls":4},"","","","","","",{"$nulls":4},"","","","","",""]
[{"$f":"'calculs - masquer'!E24","v":"2016-01-23"},{"$nulls":7},"","","","","",{"$nulls":5},"","","","","","",{"$nulls":4},"","","","","","",{"$nulls":4},"","","","","","",{"$nulls":4},"","","","","","",{"$nulls":4},"","","","","","",{"$nulls":4},"","","","","","",{"$nulls":4},"","","","","","",{"$nulls":4},"","","","","","",{"$nulls":4},"","","","","","",{"$nulls":4},"","","","","","",{"$nulls":4},"","","","","","",{"$nulls":4},"","","","","","",{"$nulls":4},"","","","","","",{"$nulls":4},"","","","","","",{"$nulls":4},"","","","","",""]
[{"$f":"'calculs - masquer'!E25","v":"2016-01-24"},{"$nulls":7},"","","","","",{"$nulls":5},"","","","","","",{"$nulls":4},"","","","","","",{"$nulls":4},"","","","","","",{"$nulls":4},"","","","","","",{"$nulls":4},"","","","","","",{"$nulls":4},"","","","","","",{"$nulls":4},"","","","","","",{"$nulls":4},"","","","","","",{"$nulls":4},"","","","","","",{"$nulls":4},"","","","","","",{"$nulls":4},"","","","","","",{"$nulls":4},"","","","","","",{"$nulls":4},"","","","","","",{"$nulls":4},"","","","","","",{"$nulls":4},"","","","","",""]
[{"$f":"'calculs - masquer'!E26","v":"2016-01-25"},{"$nulls":7},"","","","","",{"$nulls":5},"","","","","","",{"$nulls":4},"","","","","","",{"$nulls":4},"","","","","","",{"$nulls":4},"","","","","","",{"$nulls":4},"","","","","","",{"$nulls":4},"","","","","","",{"$nulls":4},"","","","","","",{"$nulls":4},"","","","","","",{"$nulls":4},"","","","","","",{"$nulls":4},"","","","","","",{"$nulls":4},"","","","","","",{"$nulls":4},"","","","","","",{"$nulls":4},"","","","","","",{"$nulls":4},"","","","","","",{"$nulls":4},"","","","","",""]
[{"$f":"'calculs - masquer'!E27","v":"2016-01-26"},{"$nulls":7},"","","","","",{"$nulls":5},"","","","","","",{"$nulls":4},"","","","","","",{"$nulls":4},"","","","","","",{"$nulls":4},"","","","","","",{"$nulls":4},"","","","","","",{"$nulls":4},"","","","","","",{"$nulls":4},"","","","","","",{"$nulls":4},"","","","","","",{"$nulls":4},"","","","","","",{"$nulls":4},"","","","","","",{"$nulls":4},"","","","","","",{"$nulls":4},"","","","","","",{"$nulls":4},"","","","","","",{"$nulls":4},"","","","","","",{"$nulls":4},"","","","","",""]
[{"$f":"'calculs - masquer'!E28","v":"2016-01-27"},{"$nulls":7},"","","","","",{"$nulls":5},"","","","","","",{"$nulls":4},"","","","","","",{"$nulls":4},"","","","","","",{"$nulls":4},"","","","","","",{"$nulls":4},"","","","","","",{"$nulls":4},"","","","","","",{"$nulls":4},"","","","","","",{"$nulls":4},"","","","","","",{"$nulls":4},"","","","","","",{"$nulls":4},"","","","","","",{"$nulls":4},"","","","","","",{"$nulls":4},"","","","","","",{"$nulls":4},"","","","","","",{"$nulls":4},"","","","","","",{"$nulls":4},"","","","","",""]
[{"$f":"'calculs - masquer'!E29","v":"2016-01-28"},{"$nulls":3},"AG",{"$nulls":3},"","","","AG","","2016-01-28",{"$nulls":4},"","","","","","",{"$nulls":4},"","","","","","",{"$nulls":4},"","","","","","",{"$nulls":4},"","","","","","",{"$nulls":4},"","","","","","",{"$nulls":4},"","","","","","",{"$nulls":4},"","","","","","",{"$nulls":4},"","","","","","",{"$nulls":4},"","","","","","",{"$nulls":4},"","","","","","",{"$nulls":4},"","","","","","",{"$nulls":4},"","","","","","",{"$nulls":4},"","","","","","",{"$nulls":4},"","","","","","",{"$nulls":4},"","","","","",""]
[{"$f":"'calculs - masquer'!E30","v":"2016-01-29"},{"$nulls":3},"AG",{"$nulls":3},"","","","AG","","2016-01-29",{"$nulls":4},"","","","","","",{"$nulls":4},"","","","","","",{"$nulls":4},"","","","","","",{"$nulls":4},"","","","","","",{"$nulls":4},"","","","","","",{"$nulls":4},"","","","","","",{"$nulls":4},"","","","","","",{"$nulls":4},"","","","","","",{"$nulls":4},"","","","","","",{"$nulls":4},"","","","","","",{"$nulls":4},"","","","","","",{"$nulls":4},"","","","","","",{"$nulls":4},"","","","","","",{"$nulls":4},"","","","","","",{"$nulls":4},"","","","","",""]
[{"$f":"'calculs - masquer'!E31","v":"2016-01-30"},{"$nulls":7},"","","","","",{"$nulls":5},"","","","","","",{"$nulls":4},"","","","","","",{"$nulls":4},"","","","","","",{"$nulls":4},"","","","","","",{"$nulls":4},"","","","","","",{"$nulls":4},"","","","","","",{"$nulls":4},"","","","","","",{"$nulls":4},"","","","","","",{"$nulls":4},"","","","","","",{"$nulls":4},"","","","","","",{"$nulls":4},"","","","","","",{"$nulls":4},"","","","","","",{"$nulls":4},"","","","","","",{"$nulls":4},"","","","","","",{"$nulls":4},"","","","","",""]
[{"$f":"'calculs - masquer'!E32","v":"2016-01-31"},{"$nulls":7},"","","","","",{"$nulls":5},"","","","","","",{"$nulls":4},"","","","","","",{"$nulls":4},"","","","","","",{"$nulls":4},"","","","","","",{"$nulls":4},"","","","","","",{"$nulls":4},"","","","","","",{"$nulls":4},"","","","","","",{"$nulls":4},"","","","","","",{"$nulls":4},"","","","","","",{"$nulls":4},"","","","","","",{"$nulls":4},"","","","","","",{"$nulls":4},"","","","","","",{"$nulls":4},"","","","","","",{"$nulls":4},"","","","","","",{"$nulls":4},"","","","","",""]
[]
[{"$nulls":8},{"$f":"SUM(I2:I32)","v":0},{"$f":"SUM(J2:J32)","v":0},0,0,0,{"$nulls":5},{"$f":"SUM(S2:S32)","v":0},{"$f":"SUM(T2:T32)","v":0},0,0,0,{"$nulls":5},{"$f":"SUM(AC2:AC32)","v":0},{"$f":"SUM(AD2:AD32)","v":0},0,0,0,{"$nulls":5},{"$f":"SUM(AM2:AM32)","v":0},{"$f":"SUM(AN2:AN32)","v":0},0,0,0,{"$nulls":5},{"$f":"SUM(AW2:AW32)","v":0},{"$f":"SUM(AX2:AX32)","v":0},0,0,0,{"$nulls":5},{"$f":"SUM(BG2:BG32)","v":0},{"$f":"SUM(BH2:BH32)","v":0},0,0,0,{"$nulls":5},{"$f":"SUM(BQ2:BQ32)","v":0},{"$f":"SUM(BR2:BR32)","v":0},0,0,0,{"$nulls":5},{"$f":"SUM(CA2:CA32)","v":0},{"$f":"SUM(CB2:CB32)","v":0},0,0,0,{"$nulls":5},{"$f":"SUM(CK2:CK32)","v":0},{"$f":"SUM(CL2:CL32)","v":0},0,0,0,{"$nulls":5},{"$f":"SUM(CU2:CU32)","v":0},{"$f":"SUM(CV2:CV32)","v":0},0,0,0,{"$nulls":5},{"$f":"SUM(DE2:DE32)","v":0},{"$f":"SUM(DF2:DF32)","v":0},0,0,0,{"$nulls":5},{"$f":"SUM(DO2:DO32)","v":0},{"$f":"SUM(DP2:DP32)","v":0},0,0,0,{"$nulls":5},{"$f":"SUM(DY2:DY32)","v":0},{"$f":"SUM(DZ2:DZ32)","v":0},0,0,0,{"$nulls":5},{"$f":"SUM(EI2:EI32)","v":0},{"$f":"SUM(EJ2:EJ32)","v":0},0,0,0,{"$nulls":5},{"$f":"SUM(ES2:ES32)","v":0},{"$f":"SUM(ET2:ET32)","v":0},0,0,0,{"$nulls":5},{"$f":"SUM(FC2:FC32)","v":0},{"$f":"SUM(FD2:FD32)","v":0},0,0,0]
[{"$nulls":8},{"$f":"SUM(I2:M32)","v":0},{"$nulls":9},{"$f":"SUM(S2:W32)","v":0},{"$nulls":9},{"$f":"SUM(AC2:AG32)","v":0},{"$nulls":9},{"$f":"SUM(AM2:AQ32)","v":0},{"$nulls":9},{"$f":"SUM(AW2:BA32)","v":0},{"$nulls":9},{"$f":"SUM(BG2:BK32)","v":0},{"$nulls":9},{"$f":"SUM(BQ2:BU32)","v":0},{"$nulls":9},{"$f":"SUM(CA2:CE32)","v":0},{"$nulls":9},{"$f":"SUM(CK2:CO32)","v":0},{"$nulls":9},{"$f":"SUM(CU2:CY32)","v":0},{"$nulls":9},{"$f":"SUM(DE2:DI32)","v":0},{"$nulls":9},{"$f":"SUM(DO2:DS32)","v":0},{"$nulls":9},{"$f":"SUM(DY2:EC32)","v":0},{"$nulls":9},{"$f":"SUM(EI2:EM32)","v":0},{"$nulls":9},{"$f":"SUM(ES2:EW32)","v":0},{"$nulls":9},{"$f":"SUM(FC2:FG32)","v":0}]
[]
[{"$nulls":8},"4 PLAGES :  N1:N6 ET N8:N14 ET N19:N23 ET N29:N30"]
[{"$nulls":8},"PLAGES",1,2,3,4]
[{"$nulls":8},"PREMIERE VALEUR","2016-01-01","2016-07-01","2016-01-18","28/1/2016"]
[{"$nulls":8},"DERNIERE VALEUR","2016-05-01","2016-01-13","22/1/2016","29/1/2016"]
[]
[{"$nulls":8},"Du"]
[{"$nulls":8},"Au"]
[{"$nulls":8},"Jours"]

{"sheet":"trame_planning_machine","index":3,"n_rows":36,"n_cols":41,"rows_kept":36,"hidden":true,"merged":[[0,3,0,4],[1,3,1,4],[3,3,3,7],[3,8,3,12],[3,13,4,15],[3,17,4,17],[3,19,4,23],[3,25,4,29],[3,36,4,36],[4,33,4,34]]}
[null,null,"Année : ",{"$f":"AO1","v":"2016"},{"$nulls":36},"2016"]
[null,null,"Mois : ",{"$f":"AO2","v":"janvier"},{"$nulls":36},"janvier"]
[]
[{"$nulls":3},"AA",{"$nulls":4},"BB",{"$nulls":4},"CC",{"$nulls":3},"DD",null,"EE",{"$nulls":5},"FF",{"$nulls":6},"HH",{"$nulls":3},"doublon"]
[{"$nulls":3},"A","B","C","D","E","A","B","C","D","E",{"$nulls":20},"commentaires"]
[null,null,{"$f":"'calculs - masquer'!$I2","v":"ve 1"},{"$nulls":33},{"$f":"IF('planning pers - masquer'!BG2=\"DOUB\",\"AG \",\"\")&IF('planning pers - masquer'!BG35=\"DOUB\",\"CB \",\"\")&IF('planning pers - masquer'!BH68=\"DOUB\",\"CC \",\"\")&IF('planning pers - masquer'!BG101=\"DOUB\",\"CG \",\"\")&IF('planning pers - masquer'!BG134=\"DOUB\",\"HV \",\"\")&IF('planning pers - masquer'!BG167=\"DOUB\",\"IP \",\"\")&IF('planning pers - masquer'!BG200=\"DOUB\",\"MG \",\"\")&IF('planning pers - masquer'!BG233=\"DOUB\",\"ML \",\"\")&IF('planning pers - masquer'!BG266=\"DOUB\",\"MOM \",\"\")&IF('planning pers - masquer'!BG299=\"DOUB\",\"MP \",\"\")&IF('planning pers - masquer'!BG332=\"DOUB\",\"OC \",\"\")&IF('planning pers - masquer'!BG365=\"DOUB\",\"PW \",\"\")&IF('planning pers - masquer'!BG398=\"DOUB\",\"RN \",\"\")&IF('planning pers - masquer'!BG431=\"DOUB\",\"SR \",\"\")&IF('planning pers - masquer'!BG464=\"DOUB\",\"TS \",\"\")&IF('planning pers - masquer'!BG497=\"DOUB\",\"VC \",\"\")","v":""},{"$f":"'calculs - masquer'!K2","v":"f"},{"$f":"'calculs - masquer'!$G2","v":""},{"$f":"'calculs - masquer'!M2","v":"v"},{"$f":"IF(OR(C6=\"\",AM6=\"we\"),\"\",IF(COUNTIF(D6:AI6,\"AG\"),\"\",\"AG \")&IF(COUNTIF(D6:AI6,\"CB\"),\"\",\"CB \")&IF(COUNTIF(D6:AI6,\"CC\"),\"\",\"CC \")&IF(COUNTIF(D6:AI6,\"CG\"),\"\",\"CG \")&IF(COUNTIF(D6:AI6,\"HV\"),\"\",\"HV \")&IF(COUNTIF(D6:AI6,\"IP\"),\"\",\"IP \")&IF(COUNTIF(D6:AI6,\"MG\"),\"\",\"MG \")&IF(COUNTIF(D6:AI6,\"ML\"),\"\",\"ML \")&IF(COUNTIF(D6:AI6,\"MOM\"),\"\",\"MOM \")&IF(COUNTIF(D6:AI6,\"MP\"),\"\",\"MP \")&IF(COUNTIF(D6:AI6,\"OC\"),\"\",\"OC \")&IF(COUNTIF(D6:AI6,\"PW\"),\"\",\"PW \")&IF(COUNTIF(D6:AI6,\"RN\"),\"\",\"RN \")&IF(COUNTIF(D6:AI6,\"SR\"),\"\",\"SR \")&IF(COUNTIF(D6:AI6,\"TS\"),\"\",\"TS \")&IF(COUNTIF(D6:AI6,\"VC\"),\"\",\"VC\"))","v":"AG CB CC CG HV IP MG ML MOM MP OC PW RN SR TS VC"}]
[null,null,{"$f":"'calculs - masquer'!$I3","v":"sa 2"},{"$nulls":33},{"$f":"IF('planning pers - masquer'!BG3=\"DOUB\",\"AG \",\"\")&IF('planning pers - masquer'!BG36=\"DOUB\",\"CB \",\"\")&IF('planning pers - masquer'!BH69=\"DOUB\",\"CC \",\"\")&IF('planning pers - masquer'!BG102=\"DOUB\",\"CG \",\"\")&IF('planning pers - masquer'!BG135=\"DOUB\",\"HV \",\"\")&IF('planning pers - masquer'!BG168=\"DOUB\",\"IP \",\"\")&IF('planning pers - masquer'!BG201=\"DOUB\",\"MG \",\"\")&IF('planning pers - masquer'!BG234=\"DOUB\",\"ML \",\"\")&IF('planning pers - masquer'!BG267=\"DOUB\",\"MOM \",\"\")&IF('planning pers - masquer'!BG300=\"DOUB\",\"MP \",\"\")&IF('planning pers - masquer'!BG333=\"DOUB\",\"OC \",\"\")&IF('planning pers - masquer'!BG366=\"DOUB\",\"PW \",\"\")&IF('planning pers - masquer'!BG399=\"DOUB\",\"RN \",\"\")&IF('planning pers - masquer'!BG432=\"DOUB\",\"SR \",\"\")&IF('planning pers - masquer'!BG465=\"DOUB\",\"TS \",\"\")&IF('planning pers - masquer'!BG498=\"DOUB\",\"VC \",\"\")","v":""},{"$f":"'calculs - masquer'!K3","v":""},{"$f":"'calculs - masquer'!$G3","v":"we"},{"$f":"'calculs - masquer'!M3","v":"v"},{"$f":"IF(OR(C7=\"\",AM7=\"we\",AL7=\"f\"),\"\",IF(COUNTIF(D7:AI7,\"AG\"),\"\",\"AG \")&IF(COUNTIF(D7:AI7,\"CB\"),\"\",\"CB \")&IF(COUNTIF(D7:AI7,\"CC\"),\"\",\"CC \")&IF(COUNTIF(D7:AI7,\"CG\"),\"\",\"CG \")&IF(COUNTIF(D7:AI7,\"HV\"),\"\",\"HV \")&IF(COUNTIF(D7:AI7,\"IP\"),\"\",\"IP \")&IF(COUNTIF(D7:AI7,\"MG\"),\"\",\"MG \")&IF(COUNTIF(D7:AI7,\"ML\"),\"\",\"ML \")&IF(COUNTIF(D7:AI7,\"MOM\"),\"\",\"MOM \")&IF(COUNTIF(D7:AI7,\"MP\"),\"\",\"MP \")&IF(COUNTIF(D7:AI7,\"OC\"),\"\",\"OC \")&IF(COUNTIF(D7:AI7,\"PW\"),\"\",\"PW \")&IF(COUNTIF(D7:AI7,\"RN\"),\"\",\"RN \")&IF(COUNTIF(D7:AI7,\"SR\"),\"\",\"SR \")&IF(COUNTIF(D7:AI7,\"TS\"),\"\",\"TS \")&IF(COUNTIF(D7:AI7,\"VC\"),\"\",\"VC\"))","v":""}]
[null,null,{"$f":"'calculs - masquer'!$I4","v":"di 3"},{"$nulls":33},{"$f":"IF('planning pers - masquer'!BG4=\"DOUB\",\"AG \",\"\")&IF('planning pers - masquer'!BG37=\"DOUB\",\"CB \",\"\")&IF('planning pers - masquer'!BH70=\"DOUB\",\"CC \",\"\")&IF('planning pers - masquer'!BG103=\"DOUB\",\"CG \",\"\")&IF('planning pers - masquer'!BG136=\"DOUB\",\"HV \",\"\")&IF('planning pers - masquer'!BG169=\"DOUB\",\"IP \",\"\")&IF('planning pers - masquer'!BG202=\"DOUB\",\"MG \",\"\")&IF('planning pers - masquer'!BG235=\"DOUB\",\"ML \",\"\")&IF('planning pers - masquer'!BG268=\"DOUB\",\"MOM \",\"\")&IF('planning pers - masquer'!BG301=\"DOUB\",\"MP \",\"\")&IF('planning pers - masquer'!BG334=\"DOUB\",\"OC \",\"\")&IF('planning pers - masquer'!BG367=\"DOUB\",\"PW \",\"\")&IF('planning pers - masquer'!BG400=\"DOUB\",\"RN \",\"\")&IF('planning pers - masquer'!BG433=\"DOUB\",\"SR \",\"\")&IF('planning pers - masquer'!BG466=\"DOUB\",\"TS \",\"\")&IF('planning pers - masquer'!BG499=\"DOUB\",\"VC \",\"\")","v":""},{"$f":"'calculs - masquer'!K4","v":""},{"$f":"'calculs - masquer'!$G4","v":"we"},{"$f":"'calculs - masquer'!M4","v":"v"},{"$f":"IF(OR(C8=\"\",AM8=\"we\",AL8=\"f\"),\"\",IF(COUNTIF(D8:AI8,\"AG\"),\"\",\"AG \")&IF(COUNTIF(D8:AI8,\"CB\"),\"\",\"CB \")&IF(COUNTIF(D8:AI8,\"CC\"),\"\",\"CC \")&IF(COUNTIF(D8:AI8,\"CG\"),\"\",\"CG \")&IF(COUNTIF(D8:AI8,\"HV\"),\"\",\"HV \")&IF(COUNTIF(D8:AI8,\"IP\"),\"\",\"IP \")&IF(COUNTIF(D8:AI8,\"MG\"),\"\",\"MG \")&IF(COUNTIF(D8:AI8,\"ML\"),\"\",\"ML \")&IF(COUNTIF(D8:AI8,\"MOM\"),\"\",\"MOM \")&IF(COUNTIF(D8:AI8,\"MP\"),\"\",\"MP \")&IF(COUNTIF(D8:AI8,\"OC\"),\"\",\"OC \")&IF(COUNTIF(D8:AI8,\"PW\"),\"\",\"PW \")&IF(COUNTIF(D8:AI8,\"RN\"),\"\",\"RN \")&IF(COUNTIF(D8:AI8,\"SR\"),\"\",\"SR \")&IF(COUNTIF(D8:AI8,\"TS\"),\"\",\"TS \")&IF(COUNTIF(D8:AI8,\"VC\"),\"\",\"VC\"))","v":""}]
[null,null,{"$f":"'calculs - masquer'!$I5","v":"lu 4"},{"$nulls":33},{"$f":"IF('planning pers - masquer'!BG5=\"DOUB\",\"AG \",\"\")&IF('planning pers - masquer'!BG38=\"DOUB\",\"CB \",\"\")&IF('planning pers - masquer'!BH71=\"DOUB\",\"CC \",\"\")&IF('planning pers - masquer'!BG104=\"DOUB\",\"CG \",\"\")&IF('planning pers - masquer'!BG137=\"DOUB\",\"HV \",\"\")&IF('planning pers - masquer'!BG170=\"DOUB\",\"IP \",\"\")&IF('planning pers - masquer'!BG203=\"DOUB\",\"MG \",\"\")&IF('planning pers - masquer'!BG236=\"DOUB\",\"ML \",\"\")&IF('planning pers - masquer'!BG269=\"DOUB\",\"MOM \",\"\")&IF('planning pers - masquer'!BG302=\"DOUB\",\"MP \",\"\")&IF('planning pers - masquer'!BG335=\"DOUB\",\"OC \",\"\")&IF('planning pers - masquer'!BG368=\"DOUB\",\"PW \",\"\")&IF('planning pers - masquer'!BG401=\"DOUB\",\"RN \",\"\")&IF('planning pers - masquer'!BG434=\"DOUB\",\"SR \",\"\")&IF('planning pers - masquer'!BG467=\"DOUB\",\"TS \",\"\")&IF('planning pers - masquer'!BG500=\"DOUB\",\"VC \",\"\")","v":""},{"$f":"'calculs - masquer'!K5","v":""},{"$f":"'calculs - masquer'!$G5","v":""},{"$f":"'calculs - masquer'!M5","v":"v"},"AG CB CC CG HV IP MG ML MOM MP OC PW RN SR TS VC"]
[null,null,{"$f":"'calculs - masquer'!$I6","v":"ma 5"},{"$nulls":33},{"$f":"IF('planning pers - masquer'!BG6=\"DOUB\",\"AG \",\"\")&IF('planning pers - masquer'!BG39=\"DOUB\",\"CB \",\"\")&IF('planning pers - masquer'!BH72=\"DOUB\",\"CC \",\"\")&IF('planning pers - masquer'!BG105=\"DOUB\",\"CG \",\"\")&IF('planning pers - masquer'!BG138=\"DOUB\",\"HV \",\"\")&IF('planning pers - masquer'!BG171=\"DOUB\",\"IP \",\"\")&IF('planning pers - masquer'!BG204=\"DOUB\",\"MG \",\"\")&IF('planning pers - masquer'!BG237=\"DOUB\",\"ML \",\"\")&IF('planning pers - masquer'!BG270=\"DOUB\",\"MOM \",\"\")&IF('planning pers - masquer'!BG303=\"DOUB\",\"MP \",\"\")&IF('planning pers - masquer'!BG336=\"DOUB\",\"OC \",\"\")&IF('planning pers - masquer'!BG369=\"DOUB\",\"PW \",\"\")&IF('planning pers - masquer'!BG402=\"DOUB\",\"RN \",\"\")&IF('planning pers - masquer'!BG435=\"DOUB\",\"SR \",\"\")&IF('planning pers - masquer'!BG468=\"DOUB\",\"TS \",\"\")&IF('planning pers - masquer'!BG501=\"DOUB\",\"VC \",\"\")","v":""},{"$f":"'calculs - masquer'!K6","v":""},{"$f":"'calculs - masquer'!$G6","v":""},{"$f":"'calculs - masquer'!M6","v":"v"},"AG CB CC CG HV IP MG ML MOM MP OC PW RN SR TS VC"]
[null,null,{"$f":"'calculs - masquer'!$I7","v":"me 6"},{"$nulls":33},{"$f":"IF('planning pers - masquer'!BG7=\"DOUB\",\"AG \",\"\")&IF('planning pers - masquer'!BG40=\"DOUB\",\"CB \",\"\")&IF('planning pers - masquer'!BH73=\"DOUB\",\"CC \",\"\")&IF('planning pers - masquer'!BG106=\"DOUB\",\"CG \",\"\")&IF('planning pers - masquer'!BG139=\"DOUB\",\"HV \",\"\")&IF('planning pers - masquer'!BG172=\"DOUB\",\"IP \",\"\")&IF('planning pers - masquer'!BG205=\"DOUB\",\"MG \",\"\")&IF('planning pers - masquer'!BG238=\"DOUB\",\"ML \",\"\")&IF('planning pers - masquer'!BG271=\"DOUB\",\"MOM \",\"\")&IF('planning pers - masquer'!BG304=\"DOUB\",\"MP \",\"\")&IF('planning pers - masquer'!BG337=\"DOUB\",\"OC \",\"\")&IF('planning pers - masquer'!BG370=\"DOUB\",\"PW \",\"\")&IF('planning pers - masquer'!BG403=\"DOUB\",\"RN \",\"\")&IF('planning pers - masquer'!BG436=\"DOUB\",\"SR \",\"\")&IF('planning pers - masquer'!BG469=\"DOUB\",\"TS \",\"\")&IF('planning pers - masquer'!BG502=\"DOUB\",\"VC \",\"\")","v":""},{"$f":"'calculs - masquer'!K7","v":""},{"$f":"'calculs - masquer'!$G7","v":""},{"$f":"'calculs - masquer'!M7","v":""},"AG CB CC CG HV IP MG ML MOM MP OC PW RN SR TS VC"]
[null,null,{"$f":"'calculs - masquer'!$I8","v":"je 7"},{"$nulls":33},{"$f":"IF('planning pers - masquer'!BG8=\"DOUB\",\"AG \",\"\")&IF('planning pers - masquer'!BG41=\"DOUB\",\"CB \",\"\")&IF('planning pers - masquer'!BH74=\"DOUB\",\"CC \",\"\")&IF('planning pers - masquer'!BG107=\"DOUB\",\"CG \",\"\")&IF('planning pers - masquer'!BG140=\"DOUB\",\"HV \",\"\")&IF('planning pers - masquer'!BG173=\"DOUB\",\"IP \",\"\")&IF('planning pers - masquer'!BG206=\"DOUB\",\"MG \",\"\")&IF('planning pers - masquer'!BG239=\"DOUB\",\"ML \",\"\")&IF('planning pers - masquer'!BG272=\"DOUB\",\"MOM \",\"\")&IF('planning pers - masquer'!BG305=\"DOUB\",\"MP \",\"\")&IF('planning pers - masquer'!BG338=\"DOUB\",\"OC \",\"\")&IF('planning pers - masquer'!BG371=\"DOUB\",\"PW \",\"\")&IF('planning pers - masquer'!BG404=\"DOUB\",\"RN \",\"\")&IF('planning pers - masquer'!BG437=\"DOUB\",\"SR \",\"\")&IF('planning pers - masquer'!BG470=\"DOUB\",\"TS \",\"\")&IF('planning pers - masquer'!BG503=\"DOUB\",\"VC \",\"\")","v":""},{"$f":"'calculs - masquer'!K8","v":""},{"$f":"'calculs - masquer'!$G8","v":""},{"$f":"'calculs - masquer'!M8","v":""},"AG CB CC CG HV IP MG ML MOM MP OC PW RN SR TS VC"]
[null,null,{"$f":"'calculs - masquer'!$I9","v":"ve 8"},{"$nulls":33},{"$f":"IF('planning pers - masquer'!BG9=\"DOUB\",\"AG \",\"\")&IF('planning pers - masquer'!BG42=\"DOUB\",\"CB \",\"\")&IF('planning pers - masquer'!BH75=\"DOUB\",\"CC \",\"\")&IF('planning pers - masquer'!BG108=\"DOUB\",\"CG \",\"\")&IF('planning pers - masquer'!BG141=\"DOUB\",\"HV \",\"\")&IF('planning pers - masquer'!BG174=\"DOUB\",\"IP \",\"\")&IF('planning pers - masquer'!BG207=\"DOUB\",\"MG \",\"\")&IF('planning pers - masquer'!BG240=\"DOUB\",\"ML \",\"\")&IF('planning pers - masquer'!BG273=\"DOUB\",\"MOM \",\"\")&IF('planning pers - masquer'!BG306=\"DOUB\",\"MP \",\"\")&IF('planning pers - masquer'!BG339=\"DOUB\",\"OC \",\"\")&IF('planning pers - masquer'!BG372=\"DOUB\",\"PW \",\"\")&IF('planning pers - masquer'!BG405=\"DOUB\",\"RN \",\"\")&IF('planning pers - masquer'!BG438=\"DOUB\",\"SR \",\"\")&IF('planning pers - masquer'!BG471=\"DOUB\",\"TS \",\"\")&IF('planning pers - masquer'!BG504=\"DOUB\",\"VC \",\"\")","v":""},{"$f":"'calculs - masquer'!K9","v":""},{"$f":"'calculs - masquer'!$G9","v":""},{"$f":"'calculs - masquer'!M9","v":""},"AG CB CC CG HV IP MG ML MOM MP OC PW RN SR TS VC"]
[null,null,{"$f":"'calculs - masquer'!$I10","v":"sa 9"},{"$nulls":33},{"$f":"IF('planning pers - masquer'!BG10=\"DOUB\",\"AG \",\"\")&IF('planning pers - masquer'!BG43=\"DOUB\",\"CB \",\"\")&IF('planning pers - masquer'!BH76=\"DOUB\",\"CC \",\"\")&IF('planning pers - masquer'!BG109=\"DOUB\",\"CG \",\"\")&IF('planning pers - masquer'!BG142=\"DOUB\",\"HV \",\"\")&IF('planning pers - masquer'!BG175=\"DOUB\",\"IP \",\"\")&IF('planning pers - masquer'!BG208=\"DOUB\",\"MG \",\"\")&IF('planning pers - masquer'!BG241=\"DOUB\",\"ML \",\"\")&IF('planning pers - masquer'!BG274=\"DOUB\",\"MOM \",\"\")&IF('planning pers - masquer'!BG307=\"DOUB\",\"MP \",\"\")&IF('planning pers - masquer'!BG340=\"DOUB\",\"OC \",\"\")&IF('planning pers - masquer'!BG373=\"DOUB\",\"PW \",\"\")&IF('planning pers - masquer'!BG406=\"DOUB\",\"RN \",\"\")&IF('planning pers - masquer'!BG439=\"DOUB\",\"SR \",\"\")&IF('planning pers - masquer'!BG472=\"DOUB\",\"TS \",\"\")&IF('planning pers - masquer'!BG505=\"DOUB\",\"VC \",\"\")","v":""},{"$f":"'calculs - masquer'!K10","v":""},{"$f":"'calculs - masquer'!$G10","v":"we"},{"$f":"'calculs - masquer'!M10","v":""},""]
[null,null,{"$f":"'calculs - masquer'!$I11","v":"di 10"},{"$nulls":33},{"$f":"IF('planning pers - masquer'!BG11=\"DOUB\",\"AG \",\"\")&IF('planning pers - masquer'!BG44=\"DOUB\",\"CB \",\"\")&IF('planning pers - masquer'!BH77=\"DOUB\",\"CC \",\"\")&IF('planning pers - masquer'!BG110=\"DOUB\",\"CG \",\"\")&IF('planning pers - masquer'!BG143=\"DOUB\",\"HV \",\"\")&IF('planning pers - masquer'!BG176=\"DOUB\",\"IP \",\"\")&IF('planning pers - masquer'!BG209=\"DOUB\",\"MG \",\"\")&IF('planning pers - masquer'!BG242=\"DOUB\",\"ML \",\"\")&IF('planning pers - masquer'!BG275=\"DOUB\",\"MOM \",\"\")&IF('planning pers - masquer'!BG308=\"DOUB\",\"MP \",\"\")&IF('planning pers - masquer'!BG341=\"DOUB\",\"OC \",\"\")&IF('planning pers - masquer'!BG374=\"DOUB\",\"PW \",\"\")&IF('planning pers - masquer'!BG407=\"DOUB\",\"RN \",\"\")&IF('planning pers - masquer'!BG440=\"DOUB\",\"SR \",\"\")&IF('planning pers - masquer'!BG473=\"DOUB\",\"TS \",\"\")&IF('planning pers - masquer'!BG506=\"DOUB\",\"VC \",\"\")","v":""},{"$f":"'calculs - masquer'!K11","v":""},{"$f":"'calculs - masquer'!$G11","v":"we"},{"$f":"'calculs - masquer'!M11","v":""},""]
[null,null,{"$f":"'calculs - masquer'!$I12","v":"lu 11"},{"$nulls":33},{"$f":"IF('planning pers - masquer'!BG12=\"DOUB\",\"AG \",\"\")&IF('planning pers - masquer'!BG45=\"DOUB\",\"CB \",\"\")&IF('planning pers - masquer'!BH78=\"DOUB\",\"CC \",\"\")&IF('planning pers - masquer'!BG111=\"DOUB\",\"CG \",\"\")&IF('planning pers - masquer'!BG144=\"DOUB\",\"HV \",\"\")&IF('planning pers - masquer'!BG177=\"DOUB\",\"IP \",\"\")&IF('planning pers - masquer'!BG210=\"DOUB\",\"MG \",\"\")&IF('planning pers - masquer'!BG243=\"DOUB\",\"ML \",\"\")&IF('planning pers - masquer'!BG276=\"DOUB\",\"MOM \",\"\")&IF('planning pers - masquer'!BG309=\"DOUB\",\"MP \",\"\")&IF('planning pers - masquer'!BG342=\"DOUB\",\"OC \",\"\")&IF('planning pers - masquer'!BG375=\"DOUB\",\"PW \",\"\")&IF('planning pers - masquer'!BG408=\"DOUB\",\"RN \",\"\")&IF('planning pers - masquer'!BG441=\"DOUB\",\"SR \",\"\")&IF('planning pers - masquer'!BG474=\"DOUB\",\"TS \",\"\")&IF('planning pers - masquer'!BG507=\"DOUB\",\"VC \",\"\")","v":""},{"$f":"'calculs - masquer'!K12","v":""},{"$f":"'calculs - masquer'!$G12","v":""},{"$f":"'calculs - masquer'!M12","v":""},"AG CB CC CG HV IP MG ML MOM MP OC PW RN SR TS VC"]
[null,null,{"$f":"'calculs - masquer'!$I13","v":"ma 12"},{"$nulls":33},{"$f":"IF('planning pers - masquer'!BG13=\"DOUB\",\"AG \",\"\")&IF('planning pers - masquer'!BG46=\"DOUB\",\"CB \",\"\")&IF('planning pers - masquer'!BH79=\"DOUB\",\"CC \",\"\")&IF('planning pers - masquer'!BG112=\"DOUB\",\"CG \",\"\")&IF('planning pers - masquer'!BG145=\"DOUB\",\"HV \",\"\")&IF('planning pers - masquer'!BG178=\"DOUB\",\"IP \",\"\")&IF('planning pers - masquer'!BG211=\"DOUB\",\"MG \",\"\")&IF('planning pers - masquer'!BG244=\"DOUB\",\"ML \",\"\")&IF('planning pers - masquer'!BG277=\"DOUB\",\"MOM \",\"\")&IF('planning pers - masquer'!BG310=\"DOUB\",\"MP \",\"\")&IF('planning pers - masquer'!BG343=\"DOUB\",\"OC \",\"\")&IF('planning pers - masquer'!BG376=\"DOUB\",\"PW \",\"\")&IF('planning pers - masquer'!BG409=\"DOUB\",\"RN \",\"\")&IF('planning pers - masquer'!BG442=\"DOUB\",\"SR \",\"\")&IF('planning pers - masquer'!BG475=\"DOUB\",\"TS \",\"\")&IF('planning pers - masquer'!BG508=\"DOUB\",\"VC \",\"\")","v":""},{"$f":"'calculs - masquer'!K13","v":""},{"$f":"'calculs - masquer'!$G13","v":""},{"$f":"'calculs - masquer'!M13","v":""},"AG CB CC CG HV IP MG ML MOM MP OC PW RN SR TS VC"]
[null,null,{"$f":"'calculs - masquer'!$I14","v":"me 13"},{"$nulls":33},{"$f":"IF('planning pers - masquer'!BG14=\"DOUB\",\"AG \",\"\")&IF('planning pers - masquer'!BG47=\"DOUB\",\"CB \",\"\")&IF('planning pers - masquer'!BH80=\"DOUB\",\"CC \",\"\")&IF('planning pers - masquer'!BG113=\"DOUB\",\"CG \",\"\")&IF('planning pers - masquer'!BG146=\"DOUB\",\"HV \",\"\")&IF('planning pers - masquer'!BG179=\"DOUB\",\"IP \",\"\")&IF('planning pers - masquer'!BG212=\"DOUB\",\"MG \",\"\")&IF('planning pers - masquer'!BG245=\"DOUB\",\"ML \",\"\")&IF('planning pers - masquer'!BG278=\"DOUB\",\"MOM \",\"\")&IF('planning pers - masquer'!BG311=\"DOUB\",\"MP \",\"\")&IF('planning pers - masquer'!BG344=\"DOUB\",\"OC \",\"\")&IF('planning pers - masquer'!BG377=\"DOUB\",\"PW \",\"\")&IF('planning pers - masquer'!BG410=\"DOUB\",\"RN \",\"\")&IF('planning pers - masquer'!BG443=\"DOUB\",\"SR \",\"\")&IF('planning pers - masquer'!BG476=\"DOUB\",\"TS \",\"\")&IF('planning pers - masquer'!BG509=\"DOUB\",\"VC \",\"\")","v":""},{"$f":"'calculs - masquer'!K14","v":""},{"$f":"'calculs - masquer'!$G14","v":""},{"$f":"'calculs - masquer'!M14","v":""},"AG CB CC CG HV IP MG ML MOM MP OC PW RN SR TS VC"]
[null,null,{"$f":"'calculs - masquer'!$I15","v":"je 14"},{"$nulls":33},{"$f":"IF('planning pers - masquer'!BG15=\"DOUB\",\"AG \",\"\")&IF('planning pers - masquer'!BG48=\"DOUB\",\"CB \",\"\")&IF('planning pers - masquer'!BH81=\"DOUB\",\"CC \",\"\")&IF('planning pers - masquer'!BG114=\"DOUB\",\"CG \",\"\")&IF('planning pers - masquer'!BG147=\"DOUB\",\"HV \",\"\")&IF('planning pers - masquer'!BG180=\"DOUB\",\"IP \",\"\")&IF('planning pers - masquer'!BG213=\"DOUB\",\"MG \",\"\")&IF('planning pers - masquer'!BG246=\"DOUB\",\"ML \",\"\")&IF('planning pers - masquer'!BG279=\"DOUB\",\"MOM \",\"\")&IF('planning pers - masquer'!BG312=\"DOUB\",\"MP \",\"\")&IF('planning pers - masquer'!BG345=\"DOUB\",\"OC \",\"\")&IF('planning pers - masquer'!BG378=\"DOUB\",\"PW \",\"\")&IF('planning pers - masquer'!BG411=\"DOUB\",\"RN \",\"\")&IF('planning pers - masquer'!BG444=\"DOUB\",\"SR \",\"\")&IF('planning pers - masquer'!BG477=\"DOUB\",\"TS \",\"\")&IF('planning pers - masquer'!BG510=\"DOUB\",\"VC \",\"\")","v":""},{"$f":"'calculs - masquer'!K15","v":""},{"$f":"'calculs - masquer'!$G15","v":""},{"$f":"'calculs - masquer'!M15","v":""},"AG CB CC CG HV IP MG ML MOM MP OC PW RN SR TS VC"]
[null,null,{"$f":"'calculs - masquer'!$I16","v":"ve 15"},{"$nulls":33},{"$f":"IF('planning pers - masquer'!BG16=\"DOUB\",\"AG \",\"\")&IF('planning pers - masquer'!BG49=\"DOUB\",\"CB \",\"\")&IF('planning pers - masquer'!BH82=\"DOUB\",\"CC \",\"\")&IF('planning pers - masquer'!BG115=\"DOUB\",\"CG \",\"\")&IF('planning pers - masquer'!BG148=\"DOUB\",\"HV \",\"\")&IF('planning pers - masquer'!BG181=\"DOUB\",\"IP \",\"\")&IF('planning pers - masquer'!BG214=\"DOUB\",\"MG \",\"\")&IF('planning pers - masquer'!BG247=\"DOUB\",\"ML \",\"\")&IF('planning pers - masquer'!BG280=\"DOUB\",\"MOM \",\"\")&IF('planning pers - masquer'!BG313=\"DOUB\",\"MP \",\"\")&IF('planning pers - masquer'!BG346=\"DOUB\",\"OC \",\"\")&IF('planning pers - masquer'!BG379=\"DOUB\",\"PW \",\"\")&IF('planning pers - masquer'!BG412=\"DOUB\",\"RN \",\"\")&IF('planning pers - masquer'!BG445=\"DOUB\",\"SR \",\"\")&IF('planning pers - masquer'!BG478=\"DOUB\",\"TS \",\"\")&IF('planning pers - masquer'!BG511=\"DOUB\",\"VC \",\"\")","v":""},{"$f":"'calculs - masquer'!K16","v":""},{"$f":"'calculs - masquer'!$G16","v":""},{"$f":"'calculs - masquer'!M16","v":""},"AG CB CC CG HV IP MG ML MOM MP OC PW RN SR TS VC"]
[null,null,{"$f":"'calculs - masquer'!$I17","v":"sa 16"},{"$nulls":33},{"$f":"IF('planning pers - masquer'!BG17=\"DOUB\",\"AG \",\"\")&IF('planning pers - masquer'!BG50=\"DOUB\",\"CB \",\"\")&IF('planning pers - masquer'!BH83=\"DOUB\",\"CC \",\"\")&IF('planning pers - masquer'!BG116=\"DOUB\",\"CG \",\"\")&IF('planning pers - masquer'!BG149=\"DOUB\",\"HV \",\"\")&IF('planning pers - masquer'!BG182=\"DOUB\",\"IP \",\"\")&IF('planning pers - masquer'!BG215=\"DOUB\",\"MG \",\"\")&IF('planning pers - masquer'!BG248=\"DOUB\",\"ML \",\"\")&IF('planning pers - masquer'!BG281=\"DOUB\",\"MOM \",\"\")&IF('planning pers - masquer'!BG314=\"DOUB\",\"MP \",\"\")&IF('planning pers - masquer'!BG347=\"DOUB\",\"OC \",\"\")&IF('planning pers - masquer'!BG380=\"DOUB\",\"PW \",\"\")&IF('planning pers - masquer'!BG413=\"DOUB\",\"RN \",\"\")&IF('planning pers - masquer'!BG446=\"DOUB\",\"SR \",\"\")&IF('planning pers - masquer'!BG479=\"DOUB\",\"TS \",\"\")&IF('planning pers - masquer'!BG512=\"DOUB\",\"VC \",\"\")","v":""},{"$f":"'calculs - masquer'!K17","v":""},{"$f":"'calculs - masquer'!$G17","v":"we"},{"$f":"'calculs - masquer'!M17","v":""},""]
[null,null,{"$f":"'calculs - masquer'!$I18","v":"di 17"},{"$nulls":33},{"$f":"IF('planning pers - masquer'!BG18=\"DOUB\",\"AG \",\"\")&IF('planning pers - masquer'!BG51=\"DOUB\",\"CB \",\"\")&IF('planning pers - masquer'!BH84=\"DOUB\",\"CC \",\"\")&IF('planning pers - masquer'!BG117=\"DOUB\",\"CG \",\"\")&IF('planning pers - masquer'!BG150=\"DOUB\",\"HV \",\"\")&IF('planning pers - masquer'!BG183=\"DOUB\",\"IP \",\"\")&IF('planning pers - masquer'!BG216=\"DOUB\",\"MG \",\"\")&IF('planning pers - masquer'!BG249=\"DOUB\",\"ML \",\"\")&IF('planning pers - masquer'!BG282=\"DOUB\",\"MOM \",\"\")&IF('planning pers - masquer'!BG315=\"DOUB\",\"MP \",\"\")&IF('planning pers - masquer'!BG348=\"DOUB\",\"OC \",\"\")&IF('planning pers - masquer'!BG381=\"DOUB\",\"PW \",\"\")&IF('planning pers - masquer'!BG414=\"DOUB\",\"RN \",\"\")&IF('planning pers - masquer'!BG447=\"DOUB\",\"SR \",\"\")&IF('planning pers - masquer'!BG480=\"DOUB\",\"TS \",\"\")&IF('planning pers - masquer'!BG513=\"DOUB\",\"VC \",\"\")","v":""},{"$f":"'calculs - masquer'!K18","v":""},{"$f":"'calculs - masquer'!$G18","v":"we"},{"$f":"'calculs - masquer'!M18","v":""},""]
[null,null,{"$f":"'calculs - masquer'!$I19","v":"lu 18"},{"$nulls":33},{"$f":"IF('planning pers - masquer'!BG19=\"DOUB\",\"AG \",\"\")&IF('planning pers - masquer'!BG52=\"DOUB\",\"CB \",\"\")&IF('planning pers - masquer'!BH85=\"DOUB\",\"CC \",\"\")&IF('planning pers - masquer'!BG118=\"DOUB\",\"CG \",\"\")&IF('planning pers - masquer'!BG151=\"DOUB\",\"HV \",\"\")&IF('planning pers - masquer'!BG184=\"DOUB\",\"IP \",\"\")&IF('planning pers - masquer'!BG217=\"DOUB\",\"MG \",\"\")&IF('planning pers - masquer'!BG250=\"DOUB\",\"ML \",\"\")&IF('planning pers - masquer'!BG283=\"DOUB\",\"MOM \",\"\")&IF('planning pers - masquer'!BG316=\"DOUB\",\"MP \",\"\")&IF('planning pers - masquer'!BG349=\"DOUB\",\"OC \",\"\")&IF('planning pers - masquer'!BG382=\"DOUB\",\"PW \",\"\")&IF('planning pers - masquer'!BG415=\"DOUB\",\"RN \",\"\")&IF('planning pers - masquer'!BG448=\"DOUB\",\"SR \",\"\")&IF('planning pers - masquer'!BG481=\"DOUB\",\"TS \",\"\")&IF('planning pers - masquer'!BG514=\"DOUB\",\"VC \",\"\")","v":""},{"$f":"'calculs - masquer'!K19","v":""},{"$f":"'calculs - masquer'!$G19","v":""},{"$f":"'calculs - masquer'!M19","v":""},"AG CB CC CG HV IP MG ML MOM MP OC PW RN SR TS VC"]
[null,null,{"$f":"'calculs - masquer'!$I20","v":"ma 19"},{"$nulls":33},{"$f":"IF('planning pers - masquer'!BG20=\"DOUB\",\"AG \",\"\")&IF('planning pers - masquer'!BG53=\"DOUB\",\"CB \",\"\")&IF('planning pers - masquer'!BH86=\"DOUB\",\"CC \",\"\")&IF('planning pers - masquer'!BG119=\"DOUB\",\"CG \",\"\")&IF('planning pers - masquer'!BG152=\"DOUB\",\"HV \",\"\")&IF('planning pers - masquer'!BG185=\"DOUB\",\"IP \",\"\")&IF('planning pers - masquer'!BG218=\"DOUB\",\"MG \",\"\")&IF('planning pers - masquer'!BG251=\"DOUB\",\"ML \",\"\")&IF('planning pers - masquer'!BG284=\"DOUB\",\"MOM \",\"\")&IF('planning pers - masquer'!BG317=\"DOUB\",\"MP \",\"\")&IF('planning pers - masquer'!BG350=\"DOUB\",\"OC \",\"\")&IF('planning pers - masquer'!BG383=\"DOUB\",\"PW \",\"\")&IF('planning pers - masquer'!BG416=\"DOUB\",\"RN \",\"\")&IF('planning pers - masquer'!BG449=\"DOUB\",\"SR \",\"\")&IF('planning pers - masquer'!BG482=\"DOUB\",\"TS \",\"\")&IF('planning pers - masquer'!BG515=\"DOUB\",\"VC \",\"\")","v":""},{"$f":"'calculs - masquer'!K20","v":""},{"$f":"'calculs - masquer'!$G20","v":""},{"$f":"'calculs - masquer'!M20","v":""},"AG CB CC CG HV IP MG ML MOM MP OC PW RN SR TS VC"]
[null,null,{"$f":"'calculs - masquer'!$I21","v":"me 20"},{"$nulls":33},{"$f":"IF('planning pers - masquer'!BG21=\"DOUB\",\"AG \",\"\")&IF('planning pers - masquer'!BG54=\"DOUB\",\"CB \",\"\")&IF('planning pers - masquer'!BH87=\"DOUB\",\"CC \",\"\")&IF('planning pers - masquer'!BG120=\"DOUB\",\"CG \",\"\")&IF('planning pers - masquer'!BG153=\"DOUB\",\"HV \",\"\")&IF('planning pers - masquer'!BG186=\"DOUB\",\"IP \",\"\")&IF('planning pers - masquer'!BG219=\"DOUB\",\"MG \",\"\")&IF('planning pers - masquer'!BG252=\"DOUB\",\"ML \",\"\")&IF('planning pers - masquer'!BG285=\"DOUB\",\"MOM \",\"\")&IF('planning pers - masquer'!BG318=\"DOUB\",\"MP \",\"\")&IF('planning pers - masquer'!BG351=\"DOUB\",\"OC \",\"\")&IF('planning pers - masquer'!BG384=\"DOUB\",\"PW \",\"\")&IF('planning pers - masquer'!BG417=\"DOUB\",\"RN \",\"\")&IF('planning pers - masquer'!BG450=\"DOUB\",\"SR \",\"\")&IF('planning pers - masquer'!BG483=\"DOUB\",\"TS \",\"\")&IF('planning pers - masquer'!BG516=\"DOUB\",\"VC \",\"\")","v":""},{"$f":"'calculs - masquer'!K21","v":""},{"$f":"'calculs - masquer'!$G21","v":""},{"$f":"'calculs - masquer'!M21","v":""},"AG CB CC CG HV IP MG ML MOM MP OC PW RN SR TS VC"]
[null,null,{"$f":"'calculs - masquer'!$I22","v":"je 21"},{"$nulls":33},{"$f":"IF('planning pers - masquer'!BG22=\"DOUB\",\"AG \",\"\")&IF('planning pers - masquer'!BG55=\"DOUB\",\"CB \",\"\")&IF('planning pers - masquer'!BH88=\"DOUB\",\"CC \",\"\")&IF('planning pers - masquer'!BG121=\"DOUB\",\"CG \",\"\")&IF('planning pers - masquer'!BG154=\"DOUB\",\"HV \",\"\")&IF('planning pers - masquer'!BG187=\"DOUB\",\"IP \",\"\")&IF('planning pers - masquer'!BG220=\"DOUB\",\"MG \",\"\")&IF('planning pers - masquer'!BG253=\"DOUB\",\"ML \",\"\")&IF('planning pers - masquer'!BG286=\"DOUB\",\"MOM \",\"\")&IF('planning pers - masquer'!BG319=\"DOUB\",\"MP \",\"\")&IF('planning pers - masquer'!BG352=\"DOUB\",\"OC \",\"\")&IF('planning pers - masquer'!BG385=\"DOUB\",\"PW \",\"\")&IF('planning pers - masquer'!BG418=\"DOUB\",\"RN \",\"\")&IF('planning pers - masquer'!BG451=\"DOUB\",\"SR \",\"\")&IF('planning pers - masquer'!BG484=\"DOUB\",\"TS \",\"\")&IF('planning pers - masquer'!BG517=\"DOUB\",\"VC \",\"\")","v":""},{"$f":"'calculs - masquer'!K22","v":""},{"$f":"'calculs - masquer'!$G22","v":""},{"$f":"'calculs - masquer'!M22","v":""},"AG CB CC CG HV IP MG ML MOM MP OC PW RN SR TS VC"]
[null,null,{"$f":"'calculs - masquer'!$I23","v":"ve 22"},{"$nulls":33},{"$f":"IF('planning pers - masquer'!BG23=\"DOUB\",\"AG \",\"\")&IF('planning pers - masquer'!BG56=\"DOUB\",\"CB \",\"\")&IF('planning pers - masquer'!BH89=\"DOUB\",\"CC \",\"\")&IF('planning pers - masquer'!BG122=\"DOUB\",\"CG \",\"\")&IF('planning pers - masquer'!BG155=\"DOUB\",\"HV \",\"\")&IF('planning pers - masquer'!BG188=\"DOUB\",\"IP \",\"\")&IF('planning pers - masquer'!BG221=\"DOUB\",\"MG \",\"\")&IF('planning pers - masquer'!BG254=\"DOUB\",\"ML \",\"\")&IF('planning pers - masquer'!BG287=\"DOUB\",\"MOM \",\"\")&IF('planning pers - masquer'!BG320=\"DOUB\",\"MP \",\"\")&IF('planning pers - masquer'!BG353=\"DOUB\",\"OC \",\"\")&IF('planning pers - masquer'!BG386=\"DOUB\",\"PW \",\"\")&IF('planning pers - masquer'!BG419=\"DOUB\",\"RN \",\"\")&IF('planning pers - masquer'!BG452=\"DOUB\",\"SR \",\"\")&IF('planning pers - masquer'!BG485=\"DOUB\",\"TS \",\"\")&IF('planning pers - masquer'!BG518=\"DOUB\",\"VC \",\"\")","v":""},{"$f":"'calculs - masquer'!K23","v":""},{"$f":"'calculs - masquer'!$G23","v":""},{"$f":"'calculs - masquer'!M23","v":""},"AG CB CC CG HV IP MG ML MOM MP OC PW RN SR TS VC"]
[null,null,{"$f":"'calculs - masquer'!$I24","v":"sa 23"},{"$nulls":33},{"$f":"IF('planning pers - masquer'!BG24=\"DOUB\",\"AG \",\"\")&IF('planning pers - masquer'!BG57=\"DOUB\",\"CB \",\"\")&IF('planning pers - masquer'!BH90=\"DOUB\",\"CC \",\"\")&IF('planning pers - masquer'!BG123=\"DOUB\",\"CG \",\"\")&IF('planning pers - masquer'!BG156=\"DOUB\",\"HV \",\"\")&IF('planning pers - masquer'!BG189=\"DOUB\",\"IP \",\"\")&IF('planning pers - masquer'!BG222=\"DOUB\",\"MG \",\"\")&IF('planning pers - masquer'!BG255=\"DOUB\",\"ML \",\"\")&IF('planning pers - masquer'!BG288=\"DOUB\",\"MOM \",\"\")&IF('planning pers - masquer'!BG321=\"DOUB\",\"MP \",\"\")&IF('planning pers - masquer'!BG354=\"DOUB\",\"OC \",\"\")&IF('planning pers - masquer'!BG387=\"DOUB\",\"PW \",\"\")&IF('planning pers - masquer'!BG420=\"DOUB\",\"RN \",\"\")&IF('planning pers - masquer'!BG453=\"DOUB\",\"SR \",\"\")&IF('planning pers - masquer'!BG486=\"DOUB\",\"TS \",\"\")&IF('planning pers - masquer'!BG519=\"DOUB\",\"VC \",\"\")","v":""},{"$f":"'calculs - masquer'!K24","v":""},{"$f":"'calculs - masquer'!$G24","v":"we"},{"$f":"'calculs - masquer'!M24","v":""},""]
[null,null,{"$f":"'calculs - masquer'!$I25","v":"di 24"},{"$nulls":33},{"$f":"IF('planning pers - masquer'!BG25=\"DOUB\",\"AG \",\"\")&IF('planning pers - masquer'!BG58=\"DOUB\",\"CB \",\"\")&IF('planning pers - masquer'!BH91=\"DOUB\",\"CC \",\"\")&IF('planning pers - masquer'!BG124=\"DOUB\",\"CG \",\"\")&IF('planning pers - masquer'!BG157=\"DOUB\",\"HV \",\"\")&IF('planning pers - masquer'!BG190=\"DOUB\",\"IP \",\"\")&IF('planning pers - masquer'!BG223=\"DOUB\",\"MG \",\"\")&IF('planning pers - masquer'!BG256=\"DOUB\",\"ML \",\"\")&IF('planning pers - masquer'!BG289=\"DOUB\",\"MOM \",\"\")&IF('planning pers - masquer'!BG322=\"DOUB\",\"MP \",\"\")&IF('planning pers - masquer'!BG355=\"DOUB\",\"OC \",\"\")&IF('planning pers - masquer'!BG388=\"DOUB\",\"PW \",\"\")&IF('planning pers - masquer'!BG421=\"DOUB\",\"RN \",\"\")&IF('planning pers - masquer'!BG454=\"DOUB\",\"SR \",\"\")&IF('planning pers - masquer'!BG487=\"DOUB\",\"TS \",\"\")&IF('planning pers - masquer'!BG520=\"DOUB\",\"VC \",\"\")","v":""},{"$f":"'calculs - masquer'!K25","v":""},{"$f":"'calculs - masquer'!$G25","v":"we"},{"$f":"'calculs - masquer'!M25","v":""},""]
[null,null,{"$f":"'calculs - masquer'!$I26","v":"lu 25"},{"$nulls":33},{"$f":"IF('planning pers - masquer'!BG26=\"DOUB\",\"AG \",\"\")&IF('planning pers - masquer'!BG59=\"DOUB\",\"CB \",\"\")&IF('planning pers - masquer'!BH92=\"DOUB\",\"CC \",\"\")&IF('planning pers - masquer'!BG125=\"DOUB\",\"CG \",\"\")&IF('planning pers - masquer'!BG158=\"DOUB\",\"HV \",\"\")&IF('planning pers - masquer'!BG191=\"DOUB\",\"IP \",\"\")&IF('planning pers - masquer'!BG224=\"DOUB\",\"MG \",\"\")&IF('planning pers - masquer'!BG257=\"DOUB\",\"ML \",\"\")&IF('planning pers - masquer'!BG290=\"DOUB\",\"MOM \",\"\")&IF('planning pers - masquer'!BG323=\"DOUB\",\"MP \",\"\")&IF('planning pers - masquer'!BG356=\"DOUB\",\"OC \",\"\")&IF('planning pers - masquer'!BG389=\"DOUB\",\"PW \",\"\")&IF('planning pers - masquer'!BG422=\"DOUB\",\"RN \",\"\")&IF('planning pers - masquer'!BG455=\"DOUB\",\"SR \",\"\")&IF('planning pers - masquer'!BG488=\"DOUB\",\"TS \",\"\")&IF('planning pers - masquer'!BG521=\"DOUB\",\"VC \",\"\")","v":""},{"$f":"'calculs - masquer'!K26","v":""},{"$f":"'calculs - masquer'!$G26","v":""},{"$f":"'calculs - masquer'!M26","v":""},"AG CB CC CG HV IP MG ML MOM MP OC PW RN SR TS VC"]
[null,null,{"$f":"'calculs - masquer'!$I27","v":"ma 26"},{"$nulls":33},{"$f":"IF('planning pers - masquer'!BG27=\"DOUB\",\"AG \",\"\")&IF('planning pers - masquer'!BG60=\"DOUB\",\"CB \",\"\")&IF('planning pers - masquer'!BH93=\"DOUB\",\"CC \",\"\")&IF('planning pers - masquer'!BG126=\"DOUB\",\"CG \",\"\")&IF('planning pers - masquer'!BG159=\"DOUB\",\"HV \",\"\")&IF('planning pers - masquer'!BG192=\"DOUB\",\"IP \",\"\")&IF('planning pers - masquer'!BG225=\"DOUB\",\"MG \",\"\")&IF('planning pers - masquer'!BG258=\"DOUB\",\"ML \",\"\")&IF('planning pers - masquer'!BG291=\"DOUB\",\"MOM \",\"\")&IF('planning pers - masquer'!BG324=\"DOUB\",\"MP \",\"\")&IF('planning pers - masquer'!BG357=\"DOUB\",\"OC \",\"\")&IF('planning pers - masquer'!BG390=\"DOUB\",\"PW \",\"\")&IF('planning pers - masquer'!BG423=\"DOUB\",\"RN \",\"\")&IF('planning pers - masquer'!BG456=\"DOUB\",\"SR \",\"\")&IF('planning pers - masquer'!BG489=\"DOUB\",\"TS \",\"\")&IF('planning pers - masquer'!BG522=\"DOUB\",\"VC \",\"\")","v":""},{"$f":"'calculs - masquer'!K27","v":""},{"$f":"'calculs - masquer'!$G27","v":""},{"$f":"'calculs - masquer'!M27","v":""},"AG CB CC CG HV IP MG ML MOM MP OC PW RN SR TS VC"]
[null,null,{"$f":"'calculs - masquer'!$I28","v":"me 27"},{"$nulls":33},{"$f":"IF('planning pers - masquer'!BG28=\"DOUB\",\"AG \",\"\")&IF('planning pers - masquer'!BG61=\"DOUB\",\"CB \",\"\")&IF('planning pers - masquer'!BH94=\"DOUB\",\"CC \",\"\")&IF('planning pers - masquer'!BG127=\"DOUB\",\"CG \",\"\")&IF('planning pers - masquer'!BG160=\"DOUB\",\"HV \",\"\")&IF('planning pers - masquer'!BG193=\"DOUB\",\"IP \",\"\")&IF('planning pers - masquer'!BG226=\"DOUB\",\"MG \",\"\")&IF('planning pers - masquer'!BG259=\"DOUB\",\"ML \",\"\")&IF('planning pers - masquer'!BG292=\"DOUB\",\"MOM \",\"\")&IF('planning pers - masquer'!BG325=\"DOUB\",\"MP \",\"\")&IF('planning pers - masquer'!BG358=\"DOUB\",\"OC \",\"\")&IF('planning pers - masquer'!BG391=\"DOUB\",\"PW \",\"\")&IF('planning pers - masquer'!BG424=\"DOUB\",\"RN \",\"\")&IF('planning pers - masquer'!BG457=\"DOUB\",\"SR \",\"\")&IF('planning pers - masquer'!BG490=\"DOUB\",\"TS \",\"\")&IF('planning pers - masquer'!BG523=\"DOUB\",\"VC \",\"\")","v":""},{"$f":"'calculs - masquer'!K28","v":""},{"$f":"'calculs - masquer'!$G28","v":""},{"$f":"'calculs - masquer'!M28","v":""},"AG CB CC CG HV IP MG ML MOM MP OC PW RN SR TS VC"]
[null,null,{"$f":"'calculs - masquer'!$I29","v":"je 28"},{"$nulls":33},{"$f":"IF('planning pers - masquer'!BG29=\"DOUB\",\"AG \",\"\")&IF('planning pers - masquer'!BG62=\"DOUB\",\"CB \",\"\")&IF('planning pers - masquer'!BH95=\"DOUB\",\"CC \",\"\")&IF('planning pers - masquer'!BG128=\"DOUB\",\"CG \",\"\")&IF('planning pers - masquer'!BG161=\"DOUB\",\"HV \",\"\")&IF('planning pers - masquer'!BG194=\"DOUB\",\"IP \",\"\")&IF('planning pers - masquer'!BG227=\"DOUB\",\"MG \",\"\")&IF('planning pers - masquer'!BG260=\"DOUB\",\"ML \",\"\")&IF('planning pers - masquer'!BG293=\"DOUB\",\"MOM \",\"\")&IF('planning pers - masquer'!BG326=\"DOUB\",\"MP \",\"\")&IF('planning pers - masquer'!BG359=\"DOUB\",\"OC \",\"\")&IF('planning pers - masquer'!BG392=\"DOUB\",\"PW \",\"\")&IF('planning pers - masquer'!BG425=\"DOUB\",\"RN \",\"\")&IF('planning pers - masquer'!BG458=\"DOUB\",\"SR \",\"\")&IF('planning pers - masquer'!BG491=\"DOUB\",\"TS \",\"\")&IF('planning pers - masquer'!BG524=\"DOUB\",\"VC \",\"\")","v":""},{"$f":"'calculs - masquer'!K29","v":""},{"$f":"'calculs - masquer'!$G29","v":""},{"$f":"'calculs - masquer'!M29","v":""},"AG CB CC CG HV IP MG ML MOM MP OC PW RN SR TS VC"]
[null,null,{"$f":"'calculs - masquer'!$I30","v":"ve 29"},{"$nulls":33},{"$f":"IF('planning pers - masquer'!BG30=\"DOUB\",\"AG \",\"\")&IF('planning pers - masquer'!BG63=\"DOUB\",\"CB \",\"\")&IF('planning pers - masquer'!BH96=\"DOUB\",\"CC \",\"\")&IF('planning pers - masquer'!BG129=\"DOUB\",\"CG \",\"\")&IF('planning pers - masquer'!BG162=\"DOUB\",\"HV \",\"\")&IF('planning pers - masquer'!BG195=\"DOUB\",\"IP \",\"\")&IF('planning pers - masquer'!BG228=\"DOUB\",\"MG \",\"\")&IF('planning pers - masquer'!BG261=\"DOUB\",\"ML \",\"\")&IF('planning pers - masquer'!BG294=\"DOUB\",\"MOM \",\"\")&IF('planning pers - masquer'!BG327=\"DOUB\",\"MP \",\"\")&IF('planning pers - masquer'!BG360=\"DOUB\",\"OC \",\"\")&IF('planning pers - masquer'!BG393=\"DOUB\",\"PW \",\"\")&IF('planning pers - masquer'!BG426=\"DOUB\",\"RN \",\"\")&IF('planning pers - masquer'!BG459=\"DOUB\",\"SR \",\"\")&IF('planning pers - masquer'!BG492=\"DOUB\",\"TS \",\"\")&IF('planning pers - masquer'!BG525=\"DOUB\",\"VC \",\"\")","v":""},{"$f":"'calculs - masquer'!K30","v":""},{"$f":"'calculs - masquer'!$G30","v":""},{"$f":"'calculs - masquer'!M30","v":""},"AG CB CC CG HV IP MG ML MOM MP OC PW RN SR TS VC"]
[null,null,{"$f":"'calculs - masquer'!$I31","v":"sa 30"},{"$nulls":33},{"$f":"IF('planning pers - masquer'!BG31=\"DOUB\",\"AG \",\"\")&IF('planning pers - masquer'!BG64=\"DOUB\",\"CB \",\"\")&IF('planning pers - masquer'!BH97=\"DOUB\",\"CC \",\"\")&IF('planning pers - masquer'!BG130=\"DOUB\",\"CG \",\"\")&IF('planning pers - masquer'!BG163=\"DOUB\",\"HV \",\"\")&IF('planning pers - masquer'!BG196=\"DOUB\",\"IP \",\"\")&IF('planning pers - masquer'!BG229=\"DOUB\",\"MG \",\"\")&IF('planning pers - masquer'!BG262=\"DOUB\",\"ML \",\"\")&IF('planning pers - masquer'!BG295=\"DOUB\",\"MOM \",\"\")&IF('planning pers - masquer'!BG328=\"DOUB\",\"MP \",\"\")&IF('planning pers - masquer'!BG361=\"DOUB\",\"OC \",\"\")&IF('planning pers - masquer'!BG394=\"DOUB\",\"PW \",\"\")&IF('planning pers - masquer'!BG427=\"DOUB\",\"RN \",\"\")&IF('planning pers - masquer'!BG460=\"DOUB\",\"SR \",\"\")&IF('planning pers - masquer'!BG493=\"DOUB\",\"TS \",\"\")&IF('planning pers - masquer'!BG526=\"DOUB\",\"VC \",\"\")","v":""},{"$f":"'calculs - masquer'!K31","v":""},{"$f":"'calculs - masquer'!$G31","v":"we"},{"$f":"'calculs - masquer'!M31","v":""},""]
[null,null,{"$f":"'calculs - masquer'!$I32","v":"di 31"},{"$nulls":33},{"$f":"IF('planning pers - masquer'!BG32=\"DOUB\",\"AG \",\"\")&IF('planning pers - masquer'!BG65=\"DOUB\",\"CB \",\"\")&IF('planning pers - masquer'!BH98=\"DOUB\",\"CC \",\"\")&IF('planning pers - masquer'!BG131=\"DOUB\",\"CG \",\"\")&IF('planning pers - masquer'!BG164=\"DOUB\",\"HV \",\"\")&IF('planning pers - masquer'!BG197=\"DOUB\",\"IP \",\"\")&IF('planning pers - masquer'!BG230=\"DOUB\",\"MG \",\"\")&IF('planning pers - masquer'!BG263=\"DOUB\",\"ML \",\"\")&IF('planning pers - masquer'!BG296=\"DOUB\",\"MOM \",\"\")&IF('planning pers - masquer'!BG329=\"DOUB\",\"MP \",\"\")&IF('planning pers - masquer'!BG362=\"DOUB\",\"OC \",\"\")&IF('planning pers - masquer'!BG395=\"DOUB\",\"PW \",\"\")&IF('planning pers - masquer'!BG428=\"DOUB\",\"RN \",\"\")&IF('planning pers - masquer'!BG461=\"DOUB\",\"SR \",\"\")&IF('planning pers - masquer'!BG494=\"DOUB\",\"TS \",\"\")&IF('planning pers - masquer'!BG527=\"DOUB\",\"VC \",\"\")","v":""},{"$f":"'calculs - masquer'!K32","v":""},{"$f":"'calculs - masquer'!$G32","v":"we"},{"$f":"'calculs - masquer'!M32","v":""},""]

{"sheet":"trame_planning_personnel","index":4,"n_rows":39,"n_cols":34,"rows_kept":39,"hidden":true}
[{"$f":"IF(trame_planning_machine!$D1=\"\",\"\",UPPER(trame_planning_machine!$D1))&\"  \"&IF(trame_planning_machine!$D2=\"\",\"\",trame_planning_machine!$D2)","v":"2016  janvier"}]
[]
[null,"aa",{"$f":"'calculs - masquer'!$H$2","v":"VE 1"},{"$f":"'calculs - masquer'!$H$3","v":"SA 2"},{"$f":"'calculs - masquer'!$H$4","v":"DI 3"},{"$f":"'calculs - masquer'!$H$5","v":"LU 4"},{"$f":"'calculs - masquer'!$H$6","v":"MA 5"},{"$f":"'calculs - masquer'!$H$7","v":"ME 6"},{"$f":"'calculs - masquer'!$H$8","v":"JE 7"},{"$f":"'calculs - masquer'!$H$9","v":"VE 8"},{"$f":"'calculs - masquer'!$H$10","v":"SA 9"},{"$f":"'calculs - masquer'!$H$11","v":"DI 10"},{"$f":"'calculs - masquer'!$H$12","v":"LU 11"},{"$f":"'calculs - masquer'!$H$13","v":"MA 12"},{"$f":"'calculs - masquer'!$H$14","v":"ME 13"},{"$f":"'calculs - masquer'!$H$15","v":"JE 14"},{"$f":"'calculs - masquer'!$H$16","v":"VE 15"},{"$f":"'calculs - masquer'!$H$17","v":"SA 16"},{"$f":"'calculs - masquer'!$H$18","v":"DI 17"},{"$f":"'calculs - masquer'!$H$19","v":"LU 18"},{"$f":"'calculs - masquer'!$H$20","v":"MA 19"},{"$f":"'calculs - masquer'!$H$21","v":"ME 20"},{"$f":"'calculs - masquer'!H22","v":"JE 21"},{"$f":"'calculs - masquer'!$H$23","v":"VE 22"},{"$f":"'calculs - masquer'!$H$24","v":"SA 23"},{"$f":"'calculs - masquer'!$H$25","v":"DI 24"},{"$f":"'calculs - masquer'!$H$26","v":"LU 25"},{"$f":"'calculs - masquer'!$H$27","v":"MA 26"},{"$f":"'calculs - masquer'!$H$28","v":"ME 27"},{"$f":"'calculs - masquer'!$H$29","v":"JE 28"},{"$f":"'calculs - masquer'!$H$30","v":"VE 29"},{"$f":"'calculs - masquer'!$H$31","v":"SA 30"},{"$f":"'calculs - masquer'!$H$32","v":"DI 31"},0]
["A","aa",{"$f":"'planning pers - masquer'!BI34","v":"vide"},{"$f":"'planning pers - masquer'!BJ34","v":"vide"},{"$f":"'planning pers - masquer'!BK34","v":"vide"},{"$f":"'planning pers - masquer'!BL34","v":"vide"},{"$f":"'planning pers - masquer'!BM34","v":"vide"},{"$f":"'planning pers - masquer'!BN34","v":"vide"},{"$f":"'planning pers - masquer'!BO34","v":"vide"},{"$f":"'planning pers - masquer'!BP34","v":"vide"},{"$f":"'planning pers - masquer'!BQ34","v":"vide"},{"$f":"'planning pers - masquer'!BR34","v":"vide"},{"$f":"'planning pers - masquer'!BS34","v":"vide"},{"$f":"'planning pers - masquer'!BT34","v":"vide"},{"$f":"'planning pers - masquer'!BU34","v":"vide"},{"$f":"'planning pers - masquer'!BV34","v":"vide"},{"$f":"'planning pers - masquer'!BW34","v":"vide"},{"$f":"'planning pers - masquer'!BX34","v":"vide"},{"$f":"'planning pers - masquer'!BY34","v":"vide"},{"$f":"'planning pers - masquer'!BZ34","v":"vide"},{"$f":"'planning pers - masquer'!CA34","v":"vide"},{"$f":"'planning pers - masquer'!CB34","v":"vide"},{"$f":"'planning pers - masquer'!CC34","v":"vide"},{"$f":"'planning pers - masquer'!CD34","v":"vide"},{"$f":"'planning pers - masquer'!CE34","v":"vide"},{"$f":"'planning pers - masquer'!CF34","v":"vide"},{"$f":"'planning pers - masquer'!CG34","v":"vide"},{"$f":"'planning pers - masquer'!CH34","v":"vide"},{"$f":"'planning pers - masquer'!CI34","v":"vide"},{"$f":"'planning pers - masquer'!CJ34","v":"vide"},{"$f":"'planning pers - masquer'!CK34","v":"vide"},{"$f":"'planning pers - masquer'!CL34","v":"vide"},{"$f":"'planning pers - masquer'!CM34","v":"vide"},0]
[]
["B","aa",{"$f":"'planning pers - masquer'!BI67","v":"vide"},{"$f":"'planning pers - masquer'!BJ67","v":"vide"},{"$f":"'planning pers - masquer'!BK67","v":"vide"},{"$f":"'planning pers - masquer'!BL67","v":"vide"},{"$f":"'planning pers - masquer'!BM67","v":"vide"},{"$f":"'planning pers - masquer'!BN67","v":"vide"},{"$f":"'planning pers - masquer'!BO67","v":"vide"},{"$f":"'planning pers - masquer'!BP67","v":"vide"},{"$f":"'planning pers - masquer'!BQ67","v":"vide"},{"$f":"'planning pers - masquer'!BR67","v":"vide"},{"$f":"'planning pers - masquer'!BS67","v":"vide"},{"$f":"'planning pers - masquer'!BT67","v":"vide"},{"$f":"'planning pers - masquer'!BU67","v":"vide"},{"$f":"'planning pers - masquer'!BV67","v":"vide"},{"$f":"'planning pers - masquer'!BW67","v":"vide"},{"$f":"'planning pers - masquer'!BX67","v":"vide"},{"$f":"'planning pers - masquer'!BY67","v":"vide"},{"$f":"'planning pers - masquer'!BZ67","v":"vide"},{"$f":"'planning pers - masquer'!CA67","v":"vide"},{"$f":"'planning pers - masquer'!CB67","v":"vide"},{"$f":"'planning pers - masquer'!CC67","v":"vide"},{"$f":"'planning pers - masquer'!CD67","v":"vide"},{"$f":"'planning pers - masquer'!CE67","v":"vide"},{"$f":"'planning pers - masquer'!CF67","v":"vide"},{"$f":"'planning pers - masquer'!CG67","v":"vide"},{"$f":"'planning pers - masquer'!CH67","v":"vide"},{"$f":"'planning pers - masquer'!CI67","v":"vide"},{"$f":"'planning pers - masquer'!CJ67","v":"vide"},{"$f":"'planning pers - masquer'!CK67","v":"vide"},{"$f":"'planning pers - masquer'!CL67","v":"vide"},{"$f":"'planning pers - masquer'!CM67","v":"vide"},0]
[]
["C","aa",{"$f":"'planning pers - masquer'!BI496","v":"vide"},{"$f":"'planning pers - masquer'!BJ496","v":"vide"},{"$f":"'planning pers - masquer'!BK496","v":"vide"},{"$f":"'planning pers - masquer'!BL496","v":"vide"},{"$f":"'planning pers - masquer'!BM496","v":"vide"},{"$f":"'planning pers - masquer'!BN496","v":"vide"},{"$f":"'planning pers - masquer'!BO496","v":"vide"},{"$f":"'planning pers - masquer'!BP496","v":"vide"},{"$f":"'planning pers - masquer'!BQ496","v":"vide"},{"$f":"'planning pers - masquer'!BR496","v":"vide"},{"$f":"'planning pers - masquer'!BS496","v":"vide"},{"$f":"'planning pers - masquer'!BT496","v":"vide"},{"$f":"'planning pers - masquer'!BU496","v":"vide"},{"$f":"'planning pers - masquer'!BV496","v":"vide"},{"$f":"'planning pers - masquer'!BW496","v":"vide"},{"$f":"'planning pers - masquer'!BX496","v":"vide"},{"$f":"'planning pers - masquer'!BY496","v":"vide"},{"$f":"'planning pers - masquer'!BZ496","v":"vide"},{"$f":"'planning pers - masquer'!CA496","v":"vide"},{"$f":"'planning pers - masquer'!CB496","v":"vide"},{"$f":"'planning pers - masquer'!CC496","v":"vide"},{"$f":"'planning pers - masquer'!CD496","v":"vide"},{"$f":"'planning pers - masquer'!CE496","v":"vide"},{"$f":"'planning pers - masquer'!CF496","v":"vide"},{"$f":"'planning pers - masquer'!CG496","v":"vide"},{"$f":"'planning pers - masquer'!CH496","v":"vide"},{"$f":"'planning pers - masquer'!CI496","v":"vide"},{"$f":"'planning pers - masquer'!CJ496","v":"vide"},{"$f":"'planning pers - masquer'!CK496","v":"vide"},{"$f":"'planning pers - masquer'!CL496","v":"vide"},{"$f":"'planning pers - masquer'!CM496","v":"vide"},0]
[]
["D","aa",{"$f":"'planning pers - masquer'!BI331","v":"vide"},{"$f":"'planning pers - masquer'!BJ331","v":"vide"},{"$f":"'planning pers - masquer'!BK331","v":"vide"},{"$f":"'planning pers - masquer'!BL331","v":"vide"},{"$f":"'planning pers - masquer'!BM331","v":"vide"},{"$f":"'planning pers - masquer'!BN331","v":"vide"},{"$f":"'planning pers - masquer'!BO331","v":"vide"},{"$f":"'planning pers - masquer'!BP331","v":"vide"},{"$f":"'planning pers - masquer'!BQ331","v":"vide"},{"$f":"'planning pers - masquer'!BR331","v":"vide"},{"$f":"'planning pers - masquer'!BS331","v":"vide"},{"$f":"'planning pers - masquer'!BT331","v":"vide"},{"$f":"'planning pers - masquer'!BU331","v":"vide"},{"$f":"'planning pers - masquer'!BV331","v":"vide"},{"$f":"'planning pers - masquer'!BW331","v":"vide"},{"$f":"'planning pers - masquer'!BX331","v":"vide"},{"$f":"'planning pers - masquer'!BY331","v":"vide"},{"$f":"'planning pers - masquer'!BZ331","v":"vide"},{"$f":"'planning pers - masquer'!CA331","v":"vide"},{"$f":"'planning pers - masquer'!CB331","v":"vide"},{"$f":"'planning pers - masquer'!CC331","v":"vide"},{"$f":"'planning pers - masquer'!CD331","v":"vide"},{"$f":"'planning pers - masquer'!CE331","v":"vide"},{"$f":"'planning pers - masquer'!CF331","v":"vide"},{"$f":"'planning pers - masquer'!CG331","v":"vide"},{"$f":"'planning pers - masquer'!CH331","v":"vide"},{"$f":"'planning pers - masquer'!CI331","v":"vide"},{"$f":"'planning pers - masquer'!CJ331","v":"vide"},{"$f":"'planning pers - masquer'!CK331","v":"vide"},{"$f":"'planning pers - masquer'!CL331","v":"vide"},{"$f":"'planning pers - masquer'!CM331","v":"vide"},0]
[]
["E","aa",{"$f":"'planning pers - masquer'!BI298","v":"vide"},{"$f":"'planning pers - masquer'!BJ298","v":"vide"},{"$f":"'planning pers - masquer'!BK298","v":"vide"},{"$f":"'planning pers - masquer'!BL298","v":"vide"},{"$f":"'planning pers - masquer'!BM298","v":"vide"},{"$f":"'planning pers - masquer'!BN298","v":"vide"},{"$f":"'planning pers - masquer'!BO298","v":"vide"},{"$f":"'planning pers - masquer'!BP298","v":"vide"},{"$f":"'planning pers - masquer'!BQ298","v":"vide"},{"$f":"'planning pers - masquer'!BR298","v":"vide"},{"$f":"'planning pers - masquer'!BS298","v":"vide"},{"$f":"'planning pers - masquer'!BT298","v":"vide"},{"$f":"'planning pers - masquer'!BU298","v":"vide"},{"$f":"'planning pers - masquer'!BV298","v":"vide"},{"$f":"'planning pers - masquer'!BW298","v":"vide"},{"$f":"'planning pers - masquer'!BX298","v":"vide"},{"$f":"'planning pers - masquer'!BY298","v":"vide"},{"$f":"'planning pers - masquer'!BZ298","v":"vide"},{"$f":"'planning pers - masquer'!CA298","v":"vide"},{"$f":"'planning pers - masquer'!CB298","v":"vide"},{"$f":"'planning pers - masquer'!CC298","v":"vide"},{"$f":"'planning pers - masquer'!CD298","v":"vide"},{"$f":"'planning pers - masquer'!CE298","v":"vide"},{"$f":"'planning pers - masquer'!CF298","v":"vide"},{"$f":"'planning pers - masquer'!CG298","v":"vide"},{"$f":"'planning pers - masquer'!CH298","v":"vide"},{"$f":"'planning pers - masquer'!CI298","v":"vide"},{"$f":"'planning pers - masquer'!CJ298","v":"vide"},{"$f":"'planning pers - masquer'!CK298","v":"vide"},{"$f":"'planning pers - masquer'!CL298","v":"vide"},{"$f":"'planning pers - masquer'!CM298","v":"vide"},0]
[]
["F","aa",{"$f":"'planning pers - masquer'!BI199","v":"vide"},{"$f":"'planning pers - masquer'!BJ199","v":"vide"},{"$f":"'planning pers - masquer'!BK199","v":"vide"},{"$f":"'planning pers - masquer'!BL199","v":"vide"},{"$f":"'planning pers - masquer'!BM199","v":"vide"},{"$f":"'planning pers - masquer'!BN199","v":"vide"},{"$f":"'planning pers - masquer'!BO199","v":"vide"},{"$f":"'planning pers - masquer'!BP199","v":"vide"},{"$f":"'planning pers - masquer'!BQ199","v":"vide"},{"$f":"'planning pers - masquer'!BR199","v":"vide"},{"$f":"'planning pers - masquer'!BS199","v":"vide"},{"$f":"'planning pers - masquer'!BT199","v":"vide"},{"$f":"'planning pers - masquer'!BU199","v":"vide"},{"$f":"'planning pers - masquer'!BV199","v":"vide"},{"$f":"'planning pers - masquer'!BW199","v":"vide"},{"$f":"'planning pers - masquer'!BX199","v":"vide"},{"$f":"'planning pers - masquer'!BY199","v":"vide"},{"$f":"'planning pers - masquer'!BZ199","v":"vide"},{"$f":"'planning pers - masquer'!CA199","v":"vide"},{"$f":"'planning pers - masquer'!CB199","v":"vide"},{"$f":"'planning pers - masquer'!CC199","v":"vide"},{"$f":"'planning pers - masquer'!CD199","v":"vide"},{"$f":"'planning pers - masquer'!CE199","v":"vide"},{"$f":"'planning pers - masquer'!CF199","v":"vide"},{"$f":"'planning pers - masquer'!CG199","v":"vide"},{"$f":"'planning pers - masquer'!CH199","v":"vide"},{"$f":"'planning pers - masquer'!CI199","v":"vide"},{"$f":"'planning pers - masquer'!CJ199","v":"vide"},{"$f":"'planning pers - masquer'!CK199","v":"vide"},{"$f":"'planning pers - masquer'!CL199","v":"vide"},{"$f":"'planning pers - masquer'!CM199","v":"vide"},0]
[]
["G","aa",{"$f":"'planning pers - masquer'!BI100","v":"vide"},{"$f":"'planning pers - masquer'!BJ100","v":"vide"},{"$f":"'planning pers - masquer'!BK100","v":"vide"},{"$f":"'planning pers - masquer'!BL100","v":"vide"},{"$f":"'planning pers - masquer'!BM100","v":"vide"},{"$f":"'planning pers - masquer'!BN100","v":"vide"},{"$f":"'planning pers - masquer'!BO100","v":"vide"},{"$f":"'planning pers - masquer'!BP100","v":"vide"},{"$f":"'planning pers - masquer'!BQ100","v":"vide"},{"$f":"'planning pers - masquer'!BR100","v":"vide"},{"$f":"'planning pers - masquer'!BS100","v":"vide"},{"$f":"'planning pers - masquer'!BT100","v":"vide"},{"$f":"'planning pers - masquer'!BU100","v":"vide"},{"$f":"'planning pers - masquer'!BV100","v":"vide"},{"$f":"'planning pers - masquer'!BW100","v":"vide"},{"$f":"'planning pers - masquer'!BX100","v":"vide"},{"$f":"'planning pers - masquer'!BY100","v":"vide"},{"$f":"'planning pers - masquer'!BZ100","v":"vide"},{"$f":"'planning pers - masquer'!CA100","v":"vide"},{"$f":"'planning pers - masquer'!CB100","v":"vide"},{"$f":"'planning pers - masquer'!CC100","v":"vide"},{"$f":"'planning pers - masquer'!CD100","v":"vide"},{"$f":"'planning pers - masquer'!CE100","v":"vide"},{"$f":"'planning pers - masquer'!CF100","v":"vide"},{"$f":"'planning pers - masquer'!CG100","v":"vide"},{"$f":"'planning pers - masquer'!CH100","v":"vide"},{"$f":"'planning pers - masquer'!CI100","v":"vide"},{"$f":"'planning pers - masquer'!CJ100","v":"vide"},{"$f":"'planning pers - masquer'!CK100","v":"vide"},{"$f":"'planning pers - masquer'!CL100","v":"vide"},{"$f":"'planning pers - masquer'!CM100","v":"vide"},0]
[]
["H","aa",{"$f":"'planning pers - masquer'!BI1","v":"vide"},{"$f":"'planning pers - masquer'!BJ1","v":"vide"},{"$f":"'planning pers - masquer'!BK1","v":"vide"},{"$f":"'planning pers - masquer'!BL1","v":"vide"},{"$f":"'planning pers - masquer'!BM1","v":"vide"},{"$f":"'planning pers - masquer'!BN1","v":"vide"},{"$f":"'planning pers - masquer'!BO1","v":"vide"},{"$f":"'planning pers - masquer'!BP1","v":"vide"},{"$f":"'planning pers - masquer'!BQ1","v":"vide"},{"$f":"'planning pers - masquer'!BR1","v":"vide"},{"$f":"'planning pers - masquer'!BS1","v":"vide"},{"$f":"'planning pers - masquer'!BT1","v":"vide"},{"$f":"'planning pers - masquer'!BU1","v":"vide"},{"$f":"'planning pers - masquer'!BV1","v":"vide"},{"$f":"'planning pers - masquer'!BW1","v":"vide"},{"$f":"'planning pers - masquer'!BX1","v":"vide"},{"$f":"'planning pers - masquer'!BY1","v":"vide"},{"$f":"'planning pers - masquer'!BZ1","v":"vide"},{"$f":"'planning pers - masquer'!CA1","v":"vide"},{"$f":"'planning pers - masquer'!CB1","v":"vide"},{"$f":"'planning pers - masquer'!CC1","v":"vide"},{"$f":"'planning pers - masquer'!CD1","v":"vide"},{"$f":"'planning pers - masquer'!CE1","v":"vide"},{"$f":"'planning pers - masquer'!CF1","v":"vide"},{"$f":"'planning pers - masquer'!CG1","v":"vide"},{"$f":"'planning pers - masquer'!CH1","v":"vide"},{"$f":"'planning pers - masquer'!CI1","v":"vide"},{"$f":"'planning pers - masquer'!CJ1","v":"vide"},{"$f":"'planning pers - masquer'!CK1","v":"vide"},{"$f":"'planning pers - masquer'!CL1","v":"vide"},{"$f":"'planning pers - masquer'!CM1","v":"vide"},0]
[]
[null,"aa",{"$f":"'calculs - masquer'!$H$2","v":"VE 1"},{"$f":"'calculs - masquer'!$H$3","v":"SA 2"},{"$f":"'calculs - masquer'!$H$4","v":"DI 3"},{"$f":"'calculs - masquer'!$H$5","v":"LU 4"},{"$f":"'calculs - masquer'!$H$6","v":"MA 5"},{"$f":"'calculs - masquer'!$H$7","v":"ME 6"},{"$f":"'calculs - masquer'!$H$8","v":"JE 7"},{"$f":"'calculs - masquer'!$H$9","v":"VE 8"},{"$f":"'calculs - masquer'!$H$10","v":"SA 9"},{"$f":"'calculs - masquer'!$H$11","v":"DI 10"},{"$f":"'calculs - masquer'!$H$12","v":"LU 11"},{"$f":"'calculs - masquer'!$H$13","v":"MA 12"},{"$f":"'calculs - masquer'!$H$14","v":"ME 13"},{"$f":"'calculs - masquer'!$H$15","v":"JE 14"},{"$f":"'calculs - masquer'!$H$16","v":"VE 15"},{"$f":"'calculs - masquer'!$H$17","v":"SA 16"},{"$f":"'calculs - masquer'!$H$18","v":"DI 17"},{"$f":"'calculs - masquer'!$H$19","v":"LU 18"},{"$f":"'calculs - masquer'!$H$20","v":"MA 19"},{"$f":"'calculs - masquer'!$H$21","v":"ME 20"},{"$f":"'calculs - masquer'!$H$22","v":"JE 21"},{"$f":"'calculs - masquer'!$H$23","v":"VE 22"},{"$f":"'calculs - masquer'!$H$24","v":"SA 23"},{"$f":"'calculs - masquer'!$H$25","v":"DI 24"},{"$f":"'calculs - masquer'!$H$26","v":"LU 25"},{"$f":"'calculs - masquer'!$H$27","v":"MA 26"},{"$f":"'calculs - masquer'!$H$28","v":"ME 27"},{"$f":"'calculs - masquer'!$H$29","v":"JE 28"},{"$f":"'calculs - masquer'!$H$30","v":"VE 29"},{"$f":"'calculs - masquer'!$H$31","v":"SA 30"},{"$f":"'calculs - masquer'!$H$32","v":"DI 31"},0]
["I","aa",{"$f":"'planning pers - masquer'!BI232","v":"vide"},{"$f":"'planning pers - masquer'!BJ232","v":"vide"},{"$f":"'planning pers - masquer'!BK232","v":"vide"},{"$f":"'planning pers - masquer'!BL232","v":"vide"},{"$f":"'planning pers - masquer'!BM232","v":"vide"},{"$f":"'planning pers - masquer'!BN232","v":"vide"},{"$f":"'planning pers - masquer'!BO232","v":"vide"},{"$f":"'planning pers - masquer'!BP232","v":"vide"},{"$f":"'planning pers - masquer'!BQ232","v":"vide"},{"$f":"'planning pers - masquer'!BR232","v":"vide"},{"$f":"'planning pers - masquer'!BS232","v":"vide"},{"$f":"'planning pers - masquer'!BT232","v":"vide"},{"$f":"'planning pers - masquer'!BU232","v":"vide"},{"$f":"'planning pers - masquer'!BV232","v":"vide"},{"$f":"'planning pers - masquer'!BW232","v":"vide"},{"$f":"'planning pers - masquer'!BX232","v":"vide"},{"$f":"'planning pers - masquer'!BY232","v":"vide"},{"$f":"'planning pers - masquer'!BZ232","v":"vide"},{"$f":"'planning pers - masquer'!CA232","v":"vide"},{"$f":"'planning pers - masquer'!CB232","v":"vide"},{"$f":"'planning pers - masquer'!CC232","v":"vide"},{"$f":"'planning pers - masquer'!CD232","v":"vide"},{"$f":"'planning pers - masquer'!CE232","v":"vide"},{"$f":"'planning pers - masquer'!CF232","v":"vide"},{"$f":"'planning pers - masquer'!CG232","v":"vide"},{"$f":"'planning pers - masquer'!CH232","v":"vide"},{"$f":"'planning pers - masquer'!CI232","v":"vide"},{"$f":"'planning pers - masquer'!CJ232","v":"vide"},{"$f":"'planning pers - masquer'!CK232","v":"vide"},{"$f":"'planning pers - masquer'!CL232","v":"vide"},{"$f":"'planning pers - masquer'!CM232","v":"vide"},0]
[]
["J","aa",{"$f":"'planning pers - masquer'!BI265","v":"vide"},{"$f":"'planning pers - masquer'!BJ265","v":"vide"},{"$f":"'planning pers - masquer'!BK265","v":"vide"},{"$f":"'planning pers - masquer'!BL265","v":"vide"},{"$f":"'planning pers - masquer'!BM265","v":"vide"},{"$f":"'planning pers - masquer'!BN265","v":"vide"},{"$f":"'planning pers - masquer'!BO265","v":"vide"},{"$f":"'planning pers - masquer'!BP265","v":"vide"},{"$f":"'planning pers - masquer'!BQ265","v":"vide"},{"$f":"'planning pers - masquer'!BR265","v":"vide"},{"$f":"'planning pers - masquer'!BS265","v":"vide"},{"$f":"'planning pers - masquer'!BT265","v":"vide"},{"$f":"'planning pers - masquer'!BU265","v":"vide"},{"$f":"'planning pers - masquer'!BV265","v":"vide"},{"$f":"'planning pers - masquer'!BW265","v":"vide"},{"$f":"'planning pers - masquer'!BX265","v":"vide"},{"$f":"'planning pers - masquer'!BY265","v":"vide"},{"$f":"'planning pers - masquer'!BZ265","v":"vide"},{"$f":"'planning pers - masquer'!CA265","v":"vide"},{"$f":"'planning pers - masquer'!CB265","v":"vide"},{"$f":"'planning pers - masquer'!CC265","v":"vide"},{"$f":"'planning pers - masquer'!CD265","v":"vide"},{"$f":"'planning pers - masquer'!CE265","v":"vide"},{"$f":"'planning pers - masquer'!CF265","v":"vide"},{"$f":"'planning pers - masquer'!CG265","v":"vide"},{"$f":"'planning pers - masquer'!CH265","v":"vide"},{"$f":"'planning pers - masquer'!CI265","v":"vide"},{"$f":"'planning pers - masquer'!CJ265","v":"vide"},{"$f":"'planning pers - masquer'!CK265","v":"vide"},{"$f":"'planning pers - masquer'!CL265","v":"vide"},{"$f":"'planning pers - masquer'!CM265","v":"vide"},0]
[]
["K","aa",{"$f":"'planning pers - masquer'!BI397","v":"vide"},{"$f":"'planning pers - masquer'!BJ397","v":"vide"},{"$f":"'planning pers - masquer'!BK397","v":"vide"},{"$f":"'planning pers - masquer'!BL397","v":"vide"},{"$f":"'planning pers - masquer'!BM397","v":"vide"},{"$f":"'planning pers - masquer'!BN397","v":"vide"},{"$f":"'planning pers - masquer'!BO397","v":"vide"},{"$f":"'planning pers - masquer'!BP397","v":"vide"},{"$f":"'planning pers - masquer'!BQ397","v":"vide"},{"$f":"'planning pers - masquer'!BR397","v":"vide"},{"$f":"'planning pers - masquer'!BS397","v":"vide"},{"$f":"'planning pers - masquer'!BT397","v":"vide"},{"$f":"'planning pers - masquer'!BU397","v":"vide"},{"$f":"'planning pers - masquer'!BV397","v":"vide"},{"$f":"'planning pers - masquer'!BW397","v":"vide"},{"$f":"'planning pers - masquer'!BX397","v":"vide"},{"$f":"'planning pers - masquer'!BY397","v":"vide"},{"$f":"'planning pers - masquer'!BZ397","v":"vide"},{"$f":"'planning pers - masquer'!CA397","v":"vide"},{"$f":"'planning pers - masquer'!CB397","v":"vide"},{"$f":"'planning pers - masquer'!CC397","v":"vide"},{"$f":"'planning pers - masquer'!CD397","v":"vide"},{"$f":"'planning pers - masquer'!CE397","v":"vide"},{"$f":"'planning pers - masquer'!CF397","v":"vide"},{"$f":"'planning pers - masquer'!CG397","v":"vide"},{"$f":"'planning pers - masquer'!CH397","v":"vide"},{"$f":"'planning pers - masquer'!CI397","v":"vide"},{"$f":"'planning pers - masquer'!CJ397","v":"vide"},{"$f":"'planning pers - masquer'!CK397","v":"vide"},{"$f":"'planning pers - masquer'!CL397","v":"vide"},{"$f":"'planning pers - masquer'!CM397","v":"vide"},0]
[]
["L","aa",{"$f":"'planning pers - masquer'!BI166","v":"vide"},{"$f":"'planning pers - masquer'!BJ166","v":"vide"},{"$f":"'planning pers - masquer'!BK166","v":"vide"},{"$f":"'planning pers - masquer'!BL166","v":"vide"},{"$f":"'planning pers - masquer'!BM166","v":"vide"},{"$f":"'planning pers - masquer'!BN166","v":"vide"},{"$f":"'planning pers - masquer'!BO166","v":"vide"},{"$f":"'planning pers - masquer'!BP166","v":"vide"},{"$f":"'planning pers - masquer'!BQ166","v":"vide"},{"$f":"'planning pers - masquer'!BR166","v":"vide"},{"$f":"'planning pers - masquer'!BS166","v":"vide"},{"$f":"'planning pers - masquer'!BT166","v":"vide"},{"$f":"'planning pers - masquer'!BU166","v":"vide"},{"$f":"'planning pers - masquer'!BV166","v":"vide"},{"$f":"'planning pers - masquer'!BW166","v":"vide"},{"$f":"'planning pers - masquer'!BX166","v":"vide"},{"$f":"'planning pers - masquer'!BY166","v":"vide"},{"$f":"'planning pers - masquer'!BZ166","v":"vide"},{"$f":"'planning pers - masquer'!CA166","v":"vide"},{"$f":"'planning pers - masquer'!CB166","v":"vide"},{"$f":"'planning pers - masquer'!CC166","v":"vide"},{"$f":"'planning pers - masquer'!CD166","v":"vide"},{"$f":"'planning pers - masquer'!CE166","v":"vide"},{"$f":"'planning pers - masquer'!CF166","v":"vide"},{"$f":"'planning pers - masquer'!CG166","v":"vide"},{"$f":"'planning pers - masquer'!CH166","v":"vide"},{"$f":"'planning pers - masquer'!CI166","v":"vide"},{"$f":"'planning pers - masquer'!CJ166","v":"vide"},{"$f":"'planning pers - masquer'!CK166","v":"vide"},{"$f":"'planning pers - masquer'!CL166","v":"vide"},{"$f":"'planning pers - masquer'!CM166","v":"vide"},0]
[]
["M","aa",{"$f":"'planning pers - masquer'!BI430","v":"vide"},{"$f":"'planning pers - masquer'!BJ430","v":"vide"},{"$f":"'planning pers - masquer'!BK430","v":"vide"},{"$f":"'planning pers - masquer'!BL430","v":"vide"},{"$f":"'planning pers - masquer'!BM430","v":"vide"},{"$f":"'planning pers - masquer'!BN430","v":"vide"},{"$f":"'planning pers - masquer'!BO430","v":"vide"},{"$f":"'planning pers - masquer'!BP430","v":"vide"},{"$f":"'planning pers - masquer'!BQ430","v":"vide"},{"$f":"'planning pers - masquer'!BR430","v":"vide"},{"$f":"'planning pers - masquer'!BS430","v":"vide"},{"$f":"'planning pers - masquer'!BT430","v":"vide"},{"$f":"'planning pers - masquer'!BU430","v":"vide"},{"$f":"'planning pers - masquer'!BV430","v":"vide"},{"$f":"'planning pers - masquer'!BW430","v":"vide"},{"$f":"'planning pers - masquer'!BX430","v":"vide"},{"$f":"'planning pers - masquer'!BY430","v":"vide"},{"$f":"'planning pers - masquer'!BZ430","v":"vide"},{"$f":"'planning pers - masquer'!CA430","v":"vide"},{"$f":"'planning pers - masquer'!CB430","v":"vide"},{"$f":"'planning pers - masquer'!CC430","v":"vide"},{"$f":"'planning pers - masquer'!CD430","v":"vide"},{"$f":"'planning pers - masquer'!CE430","v":"vide"},{"$f":"'planning pers - masquer'!CF430","v":"vide"},{"$f":"'planning pers - masquer'!CG430","v":"vide"},{"$f":"'planning pers - masquer'!CH430","v":"vide"},{"$f":"'planning pers - masquer'!CI430","v":"vide"},{"$f":"'planning pers - masquer'!CJ430","v":"vide"},{"$f":"'planning pers - masquer'!CK430","v":"vide"},{"$f":"'planning pers - masquer'!CL430","v":"vide"},{"$f":"'planning pers - masquer'!CM430","v":"vide"},0]
[]
["N","aa",{"$f":"'planning pers - masquer'!BI463","v":"vide"},{"$f":"'planning pers - masquer'!BJ463","v":"vide"},{"$f":"'planning pers - masquer'!BK463","v":"vide"},{"$f":"'planning pers - masquer'!BL463","v":"vide"},{"$f":"'planning pers - masquer'!BM463","v":"vide"},{"$f":"'planning pers - masquer'!BN463","v":"vide"},{"$f":"'planning pers - masquer'!BO463","v":"vide"},{"$f":"'planning pers - masquer'!BP463","v":"vide"},{"$f":"'planning pers - masquer'!BQ463","v":"vide"},{"$f":"'planning pers - masquer'!BR463","v":"vide"},{"$f":"'planning pers - masquer'!BS463","v":"vide"},{"$f":"'planning pers - masquer'!BT463","v":"vide"},{"$f":"'planning pers - masquer'!BU463","v":"vide"},{"$f":"'planning pers - masquer'!BV463","v":"vide"},{"$f":"'planning pers - masquer'!BW463","v":"vide"},{"$f":"'planning pers - masquer'!BX463","v":"vide"},{"$f":"'planning pers - masquer'!BY463","v":"vide"},{"$f":"'planning pers - masquer'!BZ463","v":"vide"},{"$f":"'planning pers - masquer'!CA463","v":"vide"},{"$f":"'planning pers - masquer'!CB463","v":"vide"},{"$f":"'planning pers - masquer'!CC463","v":"vide"},{"$f":"'planning pers - masquer'!CD463","v":"vide"},{"$f":"'planning pers - masquer'!CE463","v":"vide"},{"$f":"'planning pers - masquer'!CF463","v":"vide"},{"$f":"'planning pers - masquer'!CG463","v":"vide"},{"$f":"'planning pers - masquer'!CH463","v":"vide"},{"$f":"'planning pers - masquer'!CI463","v":"vide"},{"$f":"'planning pers - masquer'!CJ463","v":"vide"},{"$f":"'planning pers - masquer'!CK463","v":"vide"},{"$f":"'planning pers - masquer'!CL463","v":"vide"},{"$f":"'planning pers - masquer'!CM463","v":"vide"},0]
[]
["O","aa",{"$f":"'planning pers - masquer'!BI133","v":"vide"},{"$f":"'planning pers - masquer'!BJ133","v":"vide"},{"$f":"'planning pers - masquer'!BK133","v":"vide"},{"$f":"'planning pers - masquer'!BL133","v":"vide"},{"$f":"'planning pers - masquer'!BM133","v":"vide"},{"$f":"'planning pers - masquer'!BN133","v":"vide"},{"$f":"'planning pers - masquer'!BO133","v":"vide"},{"$f":"'planning pers - masquer'!BP133","v":"vide"},{"$f":"'planning pers - masquer'!BQ133","v":"vide"},{"$f":"'planning pers - masquer'!BR133","v":"vide"},{"$f":"'planning pers - masquer'!BS133","v":"vide"},{"$f":"'planning pers - masquer'!BT133","v":"vide"},{"$f":"'planning pers - masquer'!BU133","v":"vide"},{"$f":"'planning pers - masquer'!BV133","v":"vide"},{"$f":"'planning pers - masquer'!BW133","v":"vide"},{"$f":"'planning pers - masquer'!BX133","v":"vide"},{"$f":"'planning pers - masquer'!BY133","v":"vide"},{"$f":"'planning pers - masquer'!BZ133","v":"vide"},{"$f":"'planning pers - masquer'!CA133","v":"vide"},{"$f":"'planning pers - masquer'!CB133","v":"vide"},{"$f":"'planning pers - masquer'!CC133","v":"vide"},{"$f":"'planning pers - masquer'!CD133","v":"vide"},{"$f":"'planning pers - masquer'!CE133","v":"vide"},{"$f":"'planning pers - masquer'!CF133","v":"vide"},{"$f":"'planning pers - masquer'!CG133","v":"vide"},{"$f":"'planning pers - masquer'!CH133","v":"vide"},{"$f":"'planning pers - masquer'!CI133","v":"vide"},{"$f":"'planning pers - masquer'!CJ133","v":"vide"},{"$f":"'planning pers - masquer'!CK133","v":"vide"},{"$f":"'planning pers - masquer'!CL133","v":"vide"},{"$f":"'planning pers - masquer'!CM133","v":"vide"},0]
[]
["P","aa",{"$f":"'planning pers - masquer'!BI364","v":"vide"},{"$f":"'planning pers - masquer'!BJ364","v":"vide"},{"$f":"'planning pers - masquer'!BK364","v":"vide"},{"$f":"'planning pers - masquer'!BL364","v":"vide"},{"$f":"'planning pers - masquer'!BM364","v":"vide"},{"$f":"'planning pers - masquer'!BN364","v":"vide"},{"$f":"'planning pers - masquer'!BO364","v":"vide"},{"$f":"'planning pers - masquer'!BP364","v":"vide"},{"$f":"'planning pers - masquer'!BQ364","v":"vide"},{"$f":"'planning pers - masquer'!BR364","v":"vide"},{"$f":"'planning pers - masquer'!BS364","v":"vide"},{"$f":"'planning pers - masquer'!BT364","v":"vide"},{"$f":"'planning pers - masquer'!BU364","v":"vide"},{"$f":"'planning pers - masquer'!BV364","v":"vide"},{"$f":"'planning pers - masquer'!BW364","v":"vide"},{"$f":"'planning pers - masquer'!BX364","v":"vide"},{"$f":"'planning pers - masquer'!BY364","v":"vide"},{"$f":"'planning pers - masquer'!BZ364","v":"vide"},{"$f":"'planning pers - masquer'!CA364","v":"vide"},{"$f":"'planning pers - masquer'!CB364","v":"vide"},{"$f":"'planning pers - masquer'!CC364","v":"vide"},{"$f":"'planning pers - masquer'!CD364","v":"vide"},{"$f":"'planning pers - masquer'!CE364","v":"vide"},{"$f":"'planning pers - masquer'!CF364","v":"vide"},{"$f":"'planning pers - masquer'!CG364","v":"vide"},{"$f":"'planning pers - masquer'!CH364","v":"vide"},{"$f":"'planning pers - masquer'!CI364","v":"vide"},{"$f":"'planning pers - masquer'!CJ364","v":"vide"},{"$f":"'planning pers - masquer'!CK364","v":"vide"},{"$f":"'planning pers - masquer'!CL364","v":"vide"},{"$f":"'planning pers - masquer'!CM364","v":"vide"},0]
[]
[null,null,{"$f":"'calculs - masquer'!$G$2","v":""},{"$f":"'calculs - masquer'!$G$3","v":"we"},{"$f":"'calculs - masquer'!$G$4","v":"we"},{"$f":"'calculs - masquer'!$G$5","v":""},{"$f":"'calculs - masquer'!$G$6","v":""},{"$f":"'calculs - masquer'!$G$7","v":""},{"$f":"'calculs - masquer'!$G$8","v":""},{"$f":"'calculs - masquer'!$G$9","v":""},{"$f":"'calculs - masquer'!$G$10","v":"we"},{"$f":"'calculs - masquer'!$G$11","v":"we"},{"$f":"'calculs - masquer'!$G$12","v":""},{"$f":"'calculs - masquer'!$G$13","v":""},{"$f":"'calculs - masquer'!$G$14","v":""},{"$f":"'calculs - masquer'!$G$15","v":""},{"$f":"'calculs - masquer'!$G$16","v":""},{"$f":"'calculs - masquer'!$G$17","v":"we"},{"$f":"'calculs - masquer'!$G$18","v":"we"},{"$f":"'calculs - masquer'!$G$19","v":""},{"$f":"'calculs - masquer'!$G$20","v":""},{"$f":"'calculs - masquer'!$G$21","v":""},{"$f":"'calculs - masquer'!$G$22","v":""},{"$f":"'calculs - masquer'!$G$23","v":""},{"$f":"'calculs - masquer'!$G$24","v":"we"},{"$f":"'calculs - masquer'!$G$25","v":"we"},{"$f":"'calculs - masquer'!$G$26","v":""},{"$f":"'calculs - masquer'!$G$27","v":""},{"$f":"'calculs - masquer'!$G$28","v":""},{"$f":"'calculs - masquer'!$G$29","v":""},{"$f":"'calculs - masquer'!$G$30","v":""},{"$f":"'calculs - masquer'!$G$31","v":"we"},{"$f":"'calculs - masquer'!$G$32","v":"we"}]
[null,null,{"$f":"'calculs - masquer'!$K$2","v":"f"},{"$f":"'calculs - masquer'!$K$3","v":""},{"$f":"'calculs - masquer'!$K$4","v":""},{"$f":"'calculs - masquer'!$K$5","v":""},{"$f":"'calculs - masquer'!$K$6","v":""},{"$f":"'calculs - masquer'!$K$7","v":""},{"$f":"'calculs - masquer'!$K$8","v":""},{"$f":"'calculs - masquer'!$K$9","v":""},{"$f":"'calculs - masquer'!$K$10","v":""},{"$f":"'calculs - masquer'!$K$11","v":""},{"$f":"'calculs - masquer'!$K$12","v":""},{"$f":"'calculs - masquer'!$K$13","v":""},{"$f":"'calculs - masquer'!$K$14","v":""},{"$f":"'calculs - masquer'!$K$15","v":""},{"$f":"'calculs - masquer'!$K$16","v":""},{"$f":"'calculs - masquer'!$K$17","v":""},{"$f":"'calculs - masquer'!$K$18","v":""},{"$f":"'calculs - masquer'!$K$19","v":""},{"$f":"'calculs - masquer'!$K$20","v":""},{"$f":"'calculs - masquer'!$K$21","v":""},{"$f":"'calculs - masquer'!$K$22","v":""},{"$f":"'calculs - masquer'!$K$23","v":""},{"$f":"'calculs - masquer'!$K$24","v":""},{"$f":"'calculs - masquer'!$K$25","v":""},{"$f":"'calculs - masquer'!$K$26","v":""},{"$f":"'calculs - masquer'!$K$27","v":""},{"$f":"'calculs - masquer'!$K$28","v":""},{"$f":"'calculs - masquer'!$K$29","v":""},{"$f":"'calculs - masquer'!$K$30","v":""},{"$f":"'calculs - masquer'!$K$31","v":""},{"$f":"'calculs - masquer'!$K$32","v":""}]
[null,null,{"$f":"'calculs - masquer'!$M$2","v":"v"},{"$f":"'calculs - masquer'!$M$3","v":"v"},{"$f":"'calculs - masquer'!$M$4","v":"v"},{"$f":"'calculs - masquer'!$M$5","v":"v"},{"$f":"'calculs - masquer'!$M$6","v":"v"},{"$f":"'calculs - masquer'!$M$7","v":""},{"$f":"'calculs - masquer'!$M$8","v":""},{"$f":"'calculs - masquer'!$M$9","v":""},{"$f":"'calculs - masquer'!$M$10","v":""},{"$f":"'calculs - masquer'!$M$11","v":""},{"$f":"'calculs - masquer'!$M$12","v":""},{"$f":"'calculs - masquer'!$M$13","v":""},{"$f":"'calculs - masquer'!$M$14","v":""},{"$f":"'calculs - masquer'!$M$15","v":""},{"$f":"'calculs - masquer'!$M$16","v":""},{"$f":"'calculs - masquer'!$M$17","v":""},{"$f":"'calculs - masquer'!$M$18","v":""},{"$f":"'calculs - masquer'!$M$19","v":""},{"$f":"'calculs - masquer'!$M$20","v":""},{"$f":"'calculs - masquer'!$M$21","v":""},{"$f":"'calculs - masquer'!$M$22","v":""},{"$f":"'calculs - masquer'!$M$23","v":""},{"$f":"'calculs - masquer'!$M$24","v":""},{"$f":"'calculs - masquer'!$M$25","v":""},{"$f":"'calculs - masquer'!$M$26","v":""},{"$f":"'calculs - masquer'!$M$27","v":""},{"$f":"'calculs - masquer'!$M$28","v":""},{"$f":"'calculs - masquer'!$M$29","v":""},{"$f":"'calculs - masquer'!$M$30","v":""},{"$f":"'calculs - masquer'!$M$31","v":""},{"$f":"'calculs - masquer'!$M$32","v":""}]

{"sheet":"roulement_vacances","index":5,"n_rows":17,"n_cols":5,"rows_kept":17,"hidden":true}
[{"$f":"trame_planning_machine!$D$1","v":"2016"},{"$f":"trame_planning_machine!$D$2","v":"janvier"},"Nb de jours posés sur tout le mois","du","au"]
["A","CB",{"$f":"plan_pers_vac!S35","v":0},{"$f":"plan_pers_vac!$Y$2","v":"a"},{"$f":"plan_pers_vac!$Z$2","v":"a"}]
["B","CC",{"$f":"plan_pers_vac!AC35","v":0},{"$f":"plan_pers_vac!$AI$2","v":""},{"$f":"plan_pers_vac!$AJ$2","v":""}]
["C","VC",{"$f":"plan_pers_vac!FC35","v":0},{"$f":"plan_pers_vac!$FI$2","v":""},{"$f":"plan_pers_vac!$FJ$2","v":""}]
["D","OC",{"$f":"plan_pers_vac!DE35","v":0},{"$f":"plan_pers_vac!$DK$2","v":""},{"$f":"plan_pers_vac!$DL$2","v":""}]
["E","MP",{"$f":"plan_pers_vac!CU35","v":0},{"$f":"plan_pers_vac!$DA$2","v":""},{"$f":"plan_pers_vac!$DB$2","v":""}]
["F","MG",{"$f":"plan_pers_vac!BQ35","v":0},{"$f":"plan_pers_vac!$BW$2","v":""},{"$f":"plan_pers_vac!$BX$2","v":""}]
["G","CG",{"$f":"plan_pers_vac!AM35","v":0},{"$f":"plan_pers_vac!$AS$2","v":""},{"$f":"plan_pers_vac!$AT$2","v":""}]
["H","AG",{"$f":"plan_pers_vac!I35","v":0},{"$f":"plan_pers_vac!$O$2","v":"2016-01-01"},{"$f":"plan_pers_vac!$P$2","v":"2016-01-29"}]
["I","ML",{"$f":"plan_pers_vac!CA35","v":0},{"$f":"plan_pers_vac!$CG$2","v":""},{"$f":"plan_pers_vac!$CH$2","v":""}]
["J","MOM",{"$f":"plan_pers_vac!CK35","v":0},{"$f":"plan_pers_vac!$CQ$2","v":""},{"$f":"plan_pers_vac!$CR$2","v":""}]
["K","RN",{"$f":"plan_pers_vac!DY35","v":0},{"$f":"plan_pers_vac!$EE$2","v":""},{"$f":"plan_pers_vac!$EF$2","v":""}]
["L","IP",{"$f":"plan_pers_vac!BG35","v":0},{"$f":"plan_pers_vac!$BM$2","v":""},{"$f":"plan_pers_vac!$BN$2","v":""}]
["M","SR",{"$f":"plan_pers_vac!EI35","v":0},{"$f":"plan_pers_vac!$EO$2","v":""},{"$f":"plan_pers_vac!$EP$2","v":""}]
["N","TS",{"$f":"plan_pers_vac!ES35","v":0},{"$f":"plan_pers_vac!$EY$2","v":""},{"$f":"plan_pers_vac!$EZ$2","v":""}]
["O","HV",{"$f":"plan_pers_vac!AW35","v":0},{"$f":"plan_pers_vac!$BC$2","v":""},{"$f":"plan_pers_vac!$BD$2","v":""}]
["P","PW",{"$f":"plan_pers_vac!DO35","v":0},{"$f":"plan_pers_vac!$DU$2","v":""},{"$f":"plan_pers_vac!$DV$2","v":""}]