{"text_format":"3","workbook":"xlsx","n_sheets":6,"sheets":["Présentaion","Empilage","Detail_des_effets","Matériaux","Constantes_de_frettage","Type_piece"],"not_rendered":{"charts":1,"images":3,"macros":1,"external_links":1,"defined_names":3},"read":"whole","date_system":"1900"}

{"sheet":"Présentaion","index":0,"n_rows":60,"n_cols":6,"rows_kept":60,"merged":[[22,0,24,9]]}
[]
[]
[null,"Outil de pré-dimensionnement : ",{"$nulls":3},"Prédimaxe"]
[]
["But de l'outil :",{"$nulls":3},"Pré-dimensionnement pour l'empilage axial d'un rotor de turbopompe"]
[]
["Utilisation de la méthode dans le cadre de :",{"$nulls":3},"Pré-dimensionnement"]
[]
["Contact en cas de questions :",{"$nulls":3},"FLTTM"]
[]
["Principe d'utilisation :"]
[]
["1 - Indiquer dans la cellule le nombre de frettage que comporte l'empilage et appuyer sur \"entrée\"."]
["2 - Cliquer sur le bouton \"Démarrer étude\", le nombre de tableaux de définition des pièces se mettra à jour automatiquement."]
["3 - Renseigner les données géométriques et matériaux dans les cellules vertes pour les frettages mâles et femelles."]
["Il faut noter que une pièce peut avoir avoir plusieurs frettages. Il faut définir la pièce autant de fois qu'elle comporte de frettage."]
["Des informations complémentaires pour le \"Type de pèce\" sont disponibles dans l'onglet \"Type_piece\""]
["De plus, vous pouvez ajouter un matériau supplémentaire au besoin. Dans ce cas veuillez vous reporter à l'onglet \"Matériaux\"."]
[]
["4 - A noter que pour l'effet de fond, la cellule n'est à remplir que si le type de pièce est différent du type \"Profil cylindrique\""]
["Pour l'effet de fond, préciser son action bénéfique (négatif) ou antagoniste (positif)."]
[]
["5 - Renseigner les valeurs lié à la variation de diamètre. On considèrera la \"Distance au plan grand diamètre\" comme étant la distance entre le bord du frette et le plan moyen du grand diamètre. On prendra en compte seulement la partie pleine. On renseignera également le plus grand diamètre."]
[]
[]
[]
["6 - Renseigner les données système (cellules vertes uniquement)."]
[]
["Les calculs seront automatique et la récupération des résultats est immédiate."]
{"$rows_empty":19}
["Nota :"]
[]
[" - La modification du nom sera automatique sur les tableaux de résultats du même frettage."]
[" - On retrouvera les résultats relatifs au déformations et contraintes dans l'onglet \"Empilage\" ainsi que les résultats liés aux efforts d'emmanchement."]
[" - Pour le détails de chaque effets par frettage, rendez-vous dans l'onglet \"Details_des_effets\"."]
[" - Pour un nouveau calcul au même nombre de frettage, vous pouvez sauter l'étape 1 et 2."]
[" "]
["!! Attention, en dehors des cellules vertes, ne rien modifier !!"]
[]
[]
[]
["Pour plus de détails : "]

{"sheet":"Empilage","index":1,"n_rows":254,"n_cols":40,"rows_kept":254,"merged":[[5,1,5,4],[6,1,6,4],[10,2,10,3],[10,6,10,7],[10,10,10,11],[10,14,10,15],[10,18,10,19],[10,22,10,23],[10,26,10,27],[10,30,10,31],[10,34,10,35],[10,38,10,39],[11,2,11,3],[11,6,11,7],[11,10,11,11],[11,14,11,15],[11,18,11,19],[11,22,11,23],[11,26,11,27],[11,30,11,31],[11,34,11,35],[11,38,11,39],[30,2,30,3],[30,6,30,7],[30,10,30,11],[30,14,30,15],[30,18,30,19],[30,22,30,23],[30,26,30,27],[30,30,30,31],[30,34,30,35],[30,38,30,39],[31,2,31,3],[31,6,31,7],[31,10,31,11],[31,14,31,15],[31,18,31,19],[31,22,31,23],[31,26,31,27],[31,30,31,31],[31,34,31,35],[31,38,31,39],[37,2,37,3],[37,6,37,7],[37,10,37,11],[37,14,37,15],[37,18,37,19],[37,22,37,23],[37,26,37,27],[37,30,37,31],[37,34,37,35],[37,38,37,39],[85,1,86,2],[87,1,87,2],[88,1,88,2],[89,1,89,2],[90,1,90,2],[91,1,92,2],[91,3,92,3],[91,4,92,4],[93,1,93,2],[94,1,94,2],[95,1,95,2],[96,1,96,2],[102,2,102,3],[102,6,102,7],[102,10,102,11],[102,14,102,15],[102,18,102,19],[102,22,102,23],[102,26,102,27],[102,30,102,31],[102,34,102,35],[102,38,102,39],[103,1,103,3],[103,5,103,7],[103,9,103,11],[103,13,103,15],[103,17,103,19],[103,21,103,23],[103,25,103,27],[103,29,103,31],[103,33,103,35],[103,37,103,39],[109,1,109,3],[109,5,109,7],[109,9,109,11],[109,13,109,15],[109,17,109,19],[109,21,109,23],[109,25,109,27],[109,29,109,31],[109,33,109,35],[109,37,109,39],[116,2,116,3],[116,6,116,7],[116,10,116,11],[116,14,116,15],[116,18,116,19],[116,22,116,23],[116,26,116,27],[116,30,116,31],[116,34,116,35],[116,38,116,39],[117,1,117,3],[117,5,117,7],[117,9,117,11],[117,13,117,15],[117,17,117,19],[117,21,117,23],[117,25,117,27],[117,29,117,31],[117,33,117,35],[117,37,117,39],[123,1,123,3],[123,5,123,7],[123,9,123,11],[123,13,123,15],[123,17,123,19],[123,21,123,23],[123,25,123,27],[123,29,123,31],[123,33,123,35],[123,37,123,39],[133,2,133,3],[133,6,133,7],[133,10,133,11],[133,14,133,15],[133,18,133,19],[133,22,133,23],[133,26,133,27],[133,30,133,31],[133,34,133,35],[133,38,133,39],[134,1,134,3],[134,5,134,7],[134,9,134,11],[134,13,134,15],[134,17,134,19],[134,21,134,23],[134,25,134,27],[134,29,134,31],[134,33,134,35],[134,37,134,39],[140,1,140,3],[140,5,140,7],[140,9,140,11],[140,13,140,15],[140,17,140,19],[140,21,140,23],[140,25,140,27],[140,29,140,31],[140,33,140,35],[140,37,140,39],[147,2,147,3],[147,6,147,7],[147,10,147,11],[147,14,147,15],[147,18,147,19],[147,22,147,23],[147,26,147,27],[147,30,147,31],[147,34,147,35],[147,38,147,39],[148,1,148,3],[148,5,148,7],[148,9,148,11],[148,13,148,15],[148,17,148,19],[148,21,148,23],[148,25,148,27],[148,29,148,31],[148,33,148,35],[148,37,148,39],[154,1,154,3],[154,5,154,7],[154,9,154,11],[154,13,154,15],[154,17,154,19],[154,21,154,23],[154,25,154,27],[154,29,154,31],[154,33,154,35],[154,37,154,39],[164,2,164,3],[164,6,164,7],[164,10,164,11],[164,14,164,15],[164,18,164,19],[164,22,164,23],[164,26,164,27],[164,30,164,31],[164,34,164,35],[164,38,164,39],[165,1,165,3],[165,5,165,7],[165,9,165,11],[165,13,165,15],[165,17,165,19],[165,21,165,23],[165,25,165,27],[165,29,165,31],[165,33,165,35],[165,37,165,39],[171,1,171,3],[171,5,171,7],[171,9,171,11],[171,13,171,15],[171,17,171,19],[171,21,171,23],[171,25,171,27],[171,29,171,31],[171,33,171,35],[171,37,171,39],[178,2,178,3],[178,6,178,7],[178,10,178,11],[178,14,178,15],[178,18,178,19],[178,22,178,23],[178,26,178,27],[178,30,178,31],[178,34,178,35],[178,38,178,39],[179,1,179,3],[179,5,179,7],[179,9,179,11],[179,13,179,15],[179,17,179,19],[179,21,179,23],[179,25,179,27],[179,29,179,31],[179,33,179,35],[179,37,179,39],[185,1,185,3],[185,5,185,7],[185,9,185,11],[185,13,185,15],[185,17,185,19],[185,21,185,23],[185,25,185,27],[185,29,185,31],[185,33,185,35],[185,37,185,39],[196,0,196,1],[196,4,196,5],[196,8,196,9],[196,12,196,13],[196,16,196,17],[196,20,196,21],[196,24,196,25],[196,28,196,29],[196,32,196,33],[196,36,196,37],[197,0,197,1],[197,4,197,5],[197,8,197,9],[197,12,197,13],[197,16,197,17],[197,20,197,21],[197,24,197,25],[197,28,197,29],[197,32,197,33],[197,36,197,37],[198,0,198,1],[198,4,198,5],[198,8,198,9],[198,12,198,13],[198,16,198,17],[198,20,198,21],[198,24,198,25],[198,28,198,29],[198,32,198,33],[198,36,198,37],[199,0,199,1],[199,4,199,5],[199,8,199,9],[199,12,199,13],[199,16,199,17],[199,20,199,21],[199,24,199,25],[199,28,199,29],[199,32,199,33],[199,36,199,37],[200,0,200,1],[200,2,200,3],[200,4,200,5],[200,6,200,7],[200,8,200,9],[200,10,200,11],[200,12,200,13],[200,14,200,15],[200,16,200,17],[200,18,200,19],[200,20,200,21],[200,22,200,23],[200,24,200,25],[200,26,200,27],[200,28,200,29],[200,30,200,31],[200,32,200,33],[200,34,200,35],[200,36,200,37],[200,38,200,39],[201,0,201,1],[201,4,201,5],[201,8,201,9],[201,12,201,13],[201,16,201,17],[201,20,201,21],[201,24,201,25],[201,28,201,29],[201,32,201,33],[201,36,201,37],[203,0,203,4],[204,0,204,4],[205,0,205,6],[206,0,206,4],[207,0,207,4],[213,2,213,3],[213,4,213,6],[213,7,213,9],[214,0,214,1],[214,4,214,6],[214,7,214,9],[215,0,215,1],[216,0,216,1],[217,0,217,1],[218,0,218,1],[219,0,219,1],[220,0,220,1],[221,0,221,1],[222,0,222,1],[226,2,226,3],[226,4,226,6],[226,7,226,9],[226,10,226,13],[227,0,227,1],[228,0,228,1],[229,0,229,1],[230,0,230,1],[230,4,230,6],[230,7,230,9],[231,0,231,1],[232,0,232,1],[233,0,233,1],[234,0,234,1],[235,0,235,1],[236,0,236,1],[237,0,237,1],[242,2,242,3],[242,4,242,6],[242,7,242,9],[243,0,243,1],[244,0,244,1],[245,0,245,1],[246,0,246,1],[246,4,246,6],[246,7,246,9],[247,0,247,1],[248,0,248,1],[249,0,249,1],[250,0,250,1],[251,0,251,1],[252,0,252,1],[253,0,253,1]]}
["Outil de prédimensionnement empilage rotor"]
[]
[]
[null,"Nombre de couple sur l'empilage :",null,10]
[]
[null,"Les cellules vertes sont à renseigner par l'utilisateur."]
[null,"Les autres cellules ne doivent pas être modifiées!"]
[]
[null,"Définition matériaux, propriétés et géomètries des pièces mâles et femelles"]
[]
[null,"Nom :","Pièce mâle",null,null,"Nom :","Pièce mâle",null,null,"Nom :","Pièce mâle",null,null,"Nom :","Pièce mâle",null,null,"Nom :","Pièce mâle",null,null,"Nom :","Pièce mâle",null,null,"Nom :","Pièce mâle",null,null,"Nom :","Pièce mâle",null,null,"Nom :","Pièce mâle",null,null,"Nom :","Pièce mâle"]
[null,"Matière :","3 - Inconel 718",null,null,"Matière :","3 - Inconel 718",null,null,"Matière :","3 - Inconel 718",null,null,"Matière :","3 - Inconel 718",null,null,"Matière :","3 - Inconel 718",null,null,"Matière :","3 - Inconel 718",null,null,"Matière :","3 - Inconel 718",null,null,"Matière :","3 - Inconel 718",null,null,"Matière :","3 - Inconel 718",null,null,"Matière :","3 - Inconel 718"]
[null,"L zone",{"v":52.7,"d":"52.700"},"mm",null,"L zone",{"v":52.7,"d":"52.700"},"mm",null,"L zone",{"v":52.7,"d":"52.700"},"mm",null,"L zone",{"v":52.7,"d":"52.700"},"mm",null,"L zone",{"v":52.7,"d":"52.700"},"mm",null,"L zone",{"v":52.7,"d":"52.700"},"mm",null,"L zone",{"v":52.7,"d":"52.700"},"mm",null,"L zone",{"v":52.7,"d":"52.700"},"mm",null,"L zone",{"v":52.7,"d":"52.700"},"mm",null,"L zone",{"v":52.7,"d":"52.700"},"mm"]
[null,"L frette",{"v":0,"d":"0.000"},"mm",null,"L frette",{"v":0,"d":"0.000"},"mm",null,"L frette",{"v":0,"d":"0.000"},"mm",null,"L frette",{"v":0,"d":"0.000"},"mm",null,"L frette",{"v":0,"d":"0.000"},"mm",null,"L frette",{"v":0,"d":"0.000"},"mm",null,"L frette",{"v":0,"d":"0.000"},"mm",null,"L frette",{"v":0,"d":"0.000"},"mm",null,"L frette",{"v":0,"d":"0.000"},"mm",null,"L frette",{"v":0,"d":"0.000"},"mm"]
[null,"Dext",{"v":25,"d":"25.000"},"mm",null,"Dext",{"v":25,"d":"25.000"},"mm",null,"Dext",{"v":25,"d":"25.000"},"mm",null,"Dext",{"v":25,"d":"25.000"},"mm",null,"Dext",{"v":25,"d":"25.000"},"mm",null,"Dext",{"v":25,"d":"25.000"},"mm",null,"Dext",{"v":25,"d":"25.000"},"mm",null,"Dext",{"v":25,"d":"25.000"},"mm",null,"Dext",{"v":25,"d":"25.000"},"mm",null,"Dext",{"v":25,"d":"25.000"},"mm"]
[null,"dint",{"v":0,"d":"0.000"},"mm",null,"dint",{"v":0,"d":"0.000"},"mm",null,"dint",{"v":0,"d":"0.000"},"mm",null,"dint",{"v":0,"d":"0.000"},"mm",null,"dint",{"v":0,"d":"0.000"},"mm",null,"dint",{"v":0,"d":"0.000"},"mm",null,"dint",{"v":0,"d":"0.000"},"mm",null,"dint",{"v":0,"d":"0.000"},"mm",null,"dint",{"v":0,"d":"0.000"},"mm",null,"dint",{"v":0,"d":"0.000"},"mm"]
[null,"Diamètre de calcul",{"v":20,"d":"20.000"},"mm",null,"Diamètre de calcul",{"v":20,"d":"20.000"},"mm",null,"Diamètre de calcul",{"v":20,"d":"20.000"},"mm",null,"Diamètre de calcul",{"v":20,"d":"20.000"},"mm",null,"Diamètre de calcul",{"v":20,"d":"20.000"},"mm",null,"Diamètre de calcul",{"v":20,"d":"20.000"},"mm",null,"Diamètre de calcul",{"v":20,"d":"20.000"},"mm",null,"Diamètre de calcul",{"v":20,"d":"20.000"},"mm",null,"Diamètre de calcul",{"v":20,"d":"20.000"},"mm",null,"Diamètre de calcul",{"v":20,"d":"20.000"},"mm"]
[null,"Young Montage",{"$f":"VLOOKUP(C12,Matériaux!$C$4:$T$15,6)","v":{"v":20674.822,"d":"20675"}},"daN/mm2",null,"Young Montage",{"$f":"VLOOKUP(G12,Matériaux!$C$4:$T$15,6)","v":{"v":20674.822,"d":"20675"}},"daN/mm2",null,"Young Montage",{"$f":"VLOOKUP(K12,Matériaux!$C$4:$T$15,6)","v":{"v":20674.822,"d":"20675"}},"daN/mm2",null,"Young Montage",{"$f":"VLOOKUP(O12,Matériaux!$C$4:$T$15,6)","v":{"v":20674.822,"d":"20675"}},"daN/mm2",null,"Young Montage",{"$f":"VLOOKUP(S12,Matériaux!$C$4:$T$15,6)","v":{"v":20674.822,"d":"20675"}},"daN/mm2",null,"Young Montage",{"$f":"VLOOKUP(W12,Matériaux!$C$4:$T$15,6)","v":{"v":20674.822,"d":"20675"}},"daN/mm2",null,"Young Montage",{"$f":"VLOOKUP(AA12,Matériaux!$C$4:$T$15,6)","v":{"v":20674.822,"d":"20675"}},"daN/mm2",null,"Young Montage",{"$f":"VLOOKUP(AE12,Matériaux!$C$4:$T$15,6)","v":{"v":20674.822,"d":"20675"}},"daN/mm2",null,"Young Montage",{"$f":"VLOOKUP(AI12,Matériaux!$C$4:$T$15,6)","v":{"v":20674.822,"d":"20675"}},"daN/mm2",null,"Young Montage",{"$f":"VLOOKUP(AM12,Matériaux!$C$4:$T$15,6)","v":{"v":20674.822,"d":"20675"}},"daN/mm2"]
[null,"Youg MeF",{"$f":"VLOOKUP(C12,Matériaux!$C$4:$T$15,7)","v":22036},"daN/mm2",null,"Youg MeF",{"$f":"VLOOKUP(G12,Matériaux!$C$4:$T$15,7)","v":22036},"daN/mm2",null,"Youg MeF",{"$f":"VLOOKUP(K12,Matériaux!$C$4:$T$15,7)","v":22036},"daN/mm2",null,"Youg MeF",{"$f":"VLOOKUP(O12,Matériaux!$C$4:$T$15,7)","v":22036},"daN/mm2",null,"Youg MeF",{"$f":"VLOOKUP(S12,Matériaux!$C$4:$T$15,7)","v":22036},"daN/mm2",null,"Youg MeF",{"$f":"VLOOKUP(W12,Matériaux!$C$4:$T$15,7)","v":22036},"daN/mm2",null,"Youg MeF",{"$f":"VLOOKUP(AA12,Matériaux!$C$4:$T$15,7)","v":22036},"daN/mm2",null,"Youg MeF",{"$f":"VLOOKUP(AE12,Matériaux!$C$4:$T$15,7)","v":22036},"daN/mm2",null,"Youg MeF",{"$f":"VLOOKUP(AI12,Matériaux!$C$4:$T$15,7)","v":22036},"daN/mm2",null,"Youg MeF",{"$f":"VLOOKUP(AM12,Matériaux!$C$4:$T$15,7)","v":22036},"daN/mm2"]
[null,"Young fonctionnement",{"$f":"VLOOKUP(C12,Matériaux!$C$4:$T$15,8)","v":{"v":21715.4,"d":"21715"}},"daN/mm2",null,"Young fonctionnement",{"$f":"VLOOKUP(G12,Matériaux!$C$4:$T$15,8)","v":{"v":21715.4,"d":"21715"}},"daN/mm2",null,"Young fonctionnement",{"$f":"VLOOKUP(K12,Matériaux!$C$4:$T$15,8)","v":{"v":21715.4,"d":"21715"}},"daN/mm2",null,"Young fonctionnement",{"$f":"VLOOKUP(O12,Matériaux!$C$4:$T$15,8)","v":{"v":21715.4,"d":"21715"}},"daN/mm2",null,"Young fonctionnement",{"$f":"VLOOKUP(S12,Matériaux!$C$4:$T$15,8)","v":{"v":21715.4,"d":"21715"}},"daN/mm2",null,"Young fonctionnement",{"$f":"VLOOKUP(W12,Matériaux!$C$4:$T$15,8)","v":{"v":21715.4,"d":"21715"}},"daN/mm2",null,"Young fonctionnement",{"$f":"VLOOKUP(AA12,Matériaux!$C$4:$T$15,8)","v":{"v":21715.4,"d":"21715"}},"daN/mm2",null,"Young fonctionnement",{"$f":"VLOOKUP(AE12,Matériaux!$C$4:$T$15,8)","v":{"v":21715.4,"d":"21715"}},"daN/mm2",null,"Young fonctionnement",{"$f":"VLOOKUP(AI12,Matériaux!$C$4:$T$15,8)","v":{"v":21715.4,"d":"21715"}},"daN/mm2",null,"Young fonctionnement",{"$f":"VLOOKUP(AM12,Matériaux!$C$4:$T$15,8)","v":{"v":21715.4,"d":"21715"}},"daN/mm2"]
[null,"S",{"$f":"(PI()/4*((C15)-(C16)))^2","v":{"v":385.5314219175531,"d":"385.531"}},"mm2",null,"S",{"$f":"(PI()/4*((G15)-(G16)))^2","v":{"v":385.5314219175531,"d":"385.531"}},"mm2",null,"S",{"$f":"(PI()/4*((K15)-(K16)))^2","v":{"v":385.5314219175531,"d":"385.531"}},"mm2",null,"S",{"$f":"(PI()/4*((O15)-(O16)))^2","v":{"v":385.5314219175531,"d":"385.531"}},"mm2",null,"S",{"$f":"(PI()/4*((S15)-(S16)))^2","v":{"v":385.5314219175531,"d":"385.531"}},"mm2",null,"S",{"$f":"(PI()/4*((W15)-(W16)))^2","v":{"v":385.5314219175531,"d":"385.531"}},"mm2",null,"S",{"$f":"(PI()/4*((AA15)-(AA16)))^2","v":{"v":385.5314219175531,"d":"385.531"}},"mm2",null,"S",{"$f":"(PI()/4*((AE15)-(AE16)))^2","v":{"v":385.5314219175531,"d":"385.531"}},"mm2",null,"S",{"$f":"(PI()/4*((AI15)-(AI16)))^2","v":{"v":385.5314219175531,"d":"385.531"}},"mm2",null,"S",{"$f":"(PI()/4*((AM15)-(AM16)))^2","v":{"v":385.5314219175531,"d":"385.531"}},"mm2"]
[null,"Kv (montage)",{"$f":"IFERROR(C21*C18/C13,0)","v":{"v":151248.4539573493,"d":"1.512E+05"}},"daN/mm",null,"Kv (montage)",{"$f":"IFERROR(G21*G18/G13,0)","v":{"v":151248.4539573493,"d":"1.512E+05"}},"daN/mm",null,"Kv (montage)",{"$f":"IFERROR(K21*K18/K13,0)","v":{"v":151248.4539573493,"d":"1.512E+05"}},"daN/mm",null,"Kv (montage)",{"$f":"IFERROR(O21*O18/O13,0)","v":{"v":151248.4539573493,"d":"1.512E+05"}},"daN/mm",null,"Kv (montage)",{"$f":"IFERROR(S21*S18/S13,0)","v":{"v":151248.4539573493,"d":"1.512E+05"}},"daN/mm",null,"Kv (montage)",{"$f":"IFERROR(W21*W18/W13,0)","v":{"v":151248.4539573493,"d":"1.512E+05"}},"daN/mm",null,"Kv (montage)",{"$f":"IFERROR(AA21*AA18/AA13,0)","v":{"v":151248.4539573493,"d":"1.512E+05"}},"daN/mm",null,"Kv (montage)",{"$f":"IFERROR(AE21*AE18/AE13,0)","v":{"v":151248.4539573493,"d":"1.512E+05"}},"daN/mm",null,"Kv (montage)",{"$f":"IFERROR(AI21*AI18/AI13,0)","v":{"v":151248.4539573493,"d":"1.512E+05"}},"daN/mm",null,"Kv (montage)",{"$f":"IFERROR(AM21*AM18/AM13,0)","v":{"v":151248.4539573493,"d":"1.512E+05"}},"daN/mm"]
[null,"Kv (MeF)",{"$f":"IFERROR(C21*C19/C13,0)","v":{"v":161206.2697035142,"d":"1.612E+05"}},"daN/mm",null,"Kv (MeF)",{"$f":"IFERROR(G21*G19/G13,0)","v":{"v":161206.2697035142,"d":"1.612E+05"}},"daN/mm",null,"Kv (MeF)",{"$f":"IFERROR(K21*K19/K13,0)","v":{"v":161206.2697035142,"d":"1.612E+05"}},"daN/mm",null,"Kv (MeF)",{"$f":"IFERROR(O21*O19/O13,0)","v":{"v":161206.2697035142,"d":"1.612E+05"}},"daN/mm",null,"Kv (MeF)",{"$f":"IFERROR(S21*S19/S13,0)","v":{"v":161206.2697035142,"d":"1.612E+05"}},"daN/mm",null,"Kv (MeF)",{"$f":"IFERROR(W21*W19/W13,0)","v":{"v":161206.2697035142,"d":"1.612E+05"}},"daN/mm",null,"Kv (MeF)",{"$f":"IFERROR(AA21*AA19/AA13,0)","v":{"v":161206.2697035142,"d":"1.612E+05"}},"daN/mm",null,"Kv (MeF)",{"$f":"IFERROR(AE21*AE19/AE13,0)","v":{"v":161206.2697035142,"d":"1.612E+05"}},"daN/mm",null,"Kv (MeF)",{"$f":"IFERROR(AI21*AI19/AI13,0)","v":{"v":161206.2697035142,"d":"1.612E+05"}},"daN/mm",null,"Kv (MeF)",{"$f":"IFERROR(AM21*AM19/AM13,0)","v":{"v":161206.2697035142,"d":"1.612E+05"}},"daN/mm"]
[null,"Kv (fonctionnement)",{"$f":"IFERROR(C21*C20/C13,0)","v":{"v":158860.89259029282,"d":"1.589E+05"}},"daN/mm",null,"Kv (fonctionnement)",{"$f":"IFERROR(G21*G20/G13,0)","v":{"v":158860.89259029282,"d":"1.589E+05"}},"daN/mm",null,"Kv (fonctionnement)",{"$f":"IFERROR(K21*K20/K13,0)","v":{"v":158860.89259029282,"d":"1.589E+05"}},"daN/mm",null,"Kv (fonctionnement)",{"$f":"IFERROR(O21*O20/O13,0)","v":{"v":158860.89259029282,"d":"1.589E+05"}},"daN/mm",null,"Kv (fonctionnement)",{"$f":"IFERROR(S21*S20/S13,0)","v":{"v":158860.89259029282,"d":"1.589E+05"}},"daN/mm",null,"Kv (fonctionnement)",{"$f":"IFERROR(W21*W20/W13,0)","v":{"v":158860.89259029282,"d":"1.589E+05"}},"daN/mm",null,"Kv (fonctionnement)",{"$f":"IFERROR(AA21*AA20/AA13,0)","v":{"v":158860.89259029282,"d":"1.589E+05"}},"daN/mm",null,"Kv (fonctionnement)",{"$f":"IFERROR(AE21*AE20/AE13,0)","v":{"v":158860.89259029282,"d":"1.589E+05"}},"daN/mm",null,"Kv (fonctionnement)",{"$f":"IFERROR(AI21*AI20/AI13,0)","v":{"v":158860.89259029282,"d":"1.589E+05"}},"daN/mm",null,"Kv (fonctionnement)",{"$f":"IFERROR(AM21*AM20/AM13,0)","v":{"v":158860.89259029282,"d":"1.589E+05"}},"daN/mm"]
[null,"ΔL/L MeF",{"$f":"VLOOKUP(C12,Matériaux!$C$4:$T$15,15)","v":{"v":-249.62028,"d":"-249.6"}},"*10^-5",null,"ΔL/L MeF",{"$f":"VLOOKUP(G12,Matériaux!$C$4:$T$15,15)","v":{"v":-249.62028,"d":"-249.6"}},"*10^-5",null,"ΔL/L MeF",{"$f":"VLOOKUP(K12,Matériaux!$C$4:$T$15,15)","v":{"v":-249.62028,"d":"-249.6"}},"*10^-5",null,"ΔL/L MeF",{"$f":"VLOOKUP(O12,Matériaux!$C$4:$T$15,15)","v":{"v":-249.62028,"d":"-249.6"}},"*10^-5",null,"ΔL/L MeF",{"$f":"VLOOKUP(S12,Matériaux!$C$4:$T$15,15)","v":{"v":-249.62028,"d":"-249.6"}},"*10^-5",null,"ΔL/L MeF",{"$f":"VLOOKUP(W12,Matériaux!$C$4:$T$15,15)","v":{"v":-249.62028,"d":"-249.6"}},"*10^-5",null,"ΔL/L MeF",{"$f":"VLOOKUP(AA12,Matériaux!$C$4:$T$15,15)","v":{"v":-249.62028,"d":"-249.6"}},"*10^-5",null,"ΔL/L MeF",{"$f":"VLOOKUP(AE12,Matériaux!$C$4:$T$15,15)","v":{"v":-249.62028,"d":"-249.6"}},"*10^-5",null,"ΔL/L MeF",{"$f":"VLOOKUP(AI12,Matériaux!$C$4:$T$15,15)","v":{"v":-249.62028,"d":"-249.6"}},"*10^-5",null,"ΔL/L MeF",{"$f":"VLOOKUP(AM12,Matériaux!$C$4:$T$15,15)","v":{"v":-249.62028,"d":"-249.6"}},"*10^-5"]
[null,"ΔL/L Fonctionnement",{"$f":"VLOOKUP(C12,Matériaux!$C$4:$T$15,16)","v":{"v":-200.62084,"d":"-200.6"}},"*10^-5",null,"ΔL/L Fonctionnement",{"$f":"VLOOKUP(G12,Matériaux!$C$4:$T$15,16)","v":{"v":-200.62084,"d":"-200.6"}},"*10^-5",null,"ΔL/L Fonctionnement",{"$f":"VLOOKUP(K12,Matériaux!$C$4:$T$15,16)","v":{"v":-200.62084,"d":"-200.6"}},"*10^-5",null,"ΔL/L Fonctionnement",{"$f":"VLOOKUP(O12,Matériaux!$C$4:$T$15,16)","v":{"v":-200.62084,"d":"-200.6"}},"*10^-5",null,"ΔL/L Fonctionnement",{"$f":"VLOOKUP(S12,Matériaux!$C$4:$T$15,16)","v":{"v":-200.62084,"d":"-200.6"}},"*10^-5",null,"ΔL/L Fonctionnement",{"$f":"VLOOKUP(W12,Matériaux!$C$4:$T$15,16)","v":{"v":-200.62084,"d":"-200.6"}},"*10^-5",null,"ΔL/L Fonctionnement",{"$f":"VLOOKUP(AA12,Matériaux!$C$4:$T$15,16)","v":{"v":-200.62084,"d":"-200.6"}},"*10^-5",null,"ΔL/L Fonctionnement",{"$f":"VLOOKUP(AE12,Matériaux!$C$4:$T$15,16)","v":{"v":-200.62084,"d":"-200.6"}},"*10^-5",null,"ΔL/L Fonctionnement",{"$f":"VLOOKUP(AI12,Matériaux!$C$4:$T$15,16)","v":{"v":-200.62084,"d":"-200.6"}},"*10^-5",null,"ΔL/L Fonctionnement",{"$f":"VLOOKUP(AM12,Matériaux!$C$4:$T$15,16)","v":{"v":-200.62084,"d":"-200.6"}},"*10^-5"]
[null,"ν",{"$f":"VLOOKUP(C12,Matériaux!$C$4:$T$15,17)","v":{"v":0.2795269411764706,"d":"0.28"}},"-",null,"ν",{"$f":"VLOOKUP(G12,Matériaux!$C$4:$T$15,17)","v":{"v":0.2795269411764706,"d":"0.28"}},"-",null,"ν",{"$f":"VLOOKUP(K12,Matériaux!$C$4:$T$15,17)","v":{"v":0.2795269411764706,"d":"0.28"}},"-",null,"ν",{"$f":"VLOOKUP(O12,Matériaux!$C$4:$T$15,17)","v":{"v":0.2795269411764706,"d":"0.28"}},"-",null,"ν",{"$f":"VLOOKUP(S12,Matériaux!$C$4:$T$15,17)","v":{"v":0.2795269411764706,"d":"0.28"}},"-",null,"ν",{"$f":"VLOOKUP(W12,Matériaux!$C$4:$T$15,17)","v":{"v":0.2795269411764706,"d":"0.28"}},"-",null,"ν",{"$f":"VLOOKUP(AA12,Matériaux!$C$4:$T$15,17)","v":{"v":0.2795269411764706,"d":"0.28"}},"-",null,"ν",{"$f":"VLOOKUP(AE12,Matériaux!$C$4:$T$15,17)","v":{"v":0.2795269411764706,"d":"0.28"}},"-",null,"ν",{"$f":"VLOOKUP(AI12,Matériaux!$C$4:$T$15,17)","v":{"v":0.2795269411764706,"d":"0.28"}},"-",null,"ν",{"$f":"VLOOKUP(AM12,Matériaux!$C$4:$T$15,17)","v":{"v":0.2795269411764706,"d":"0.28"}},"-"]
[null,"ρ",{"$f":"VLOOKUP(C12,Matériaux!$C$4:$T$15,18)","v":8260},"kg/m3",null,"ρ",{"$f":"VLOOKUP(G12,Matériaux!$C$4:$T$15,18)","v":8260},"kg/m3",null,"ρ",{"$f":"VLOOKUP(K12,Matériaux!$C$4:$T$15,18)","v":8260},"kg/m3",null,"ρ",{"$f":"VLOOKUP(O12,Matériaux!$C$4:$T$15,18)","v":8260},"kg/m3",null,"ρ",{"$f":"VLOOKUP(S12,Matériaux!$C$4:$T$15,18)","v":8260},"kg/m3",null,"ρ",{"$f":"VLOOKUP(W12,Matériaux!$C$4:$T$15,18)","v":8260},"kg/m3",null,"ρ",{"$f":"VLOOKUP(AA12,Matériaux!$C$4:$T$15,18)","v":8260},"kg/m3",null,"ρ",{"$f":"VLOOKUP(AE12,Matériaux!$C$4:$T$15,18)","v":8260},"kg/m3",null,"ρ",{"$f":"VLOOKUP(AI12,Matériaux!$C$4:$T$15,18)","v":8260},"kg/m3",null,"ρ",{"$f":"VLOOKUP(AM12,Matériaux!$C$4:$T$15,18)","v":8260},"kg/m3"]
[null,"Frettage en def",170,"microns",null,"Frettage en def",170,"microns",null,"Frettage en def",170,"microns",null,"Frettage en def",170,"microns",null,"Frettage en def",170,"microns",null,"Frettage en def",170,"microns",null,"Frettage en def",170,"microns",null,"Frettage en def",170,"microns",null,"Frettage en def",170,"microns",null,"Frettage en def",170,"microns"]
[]
[null,"Nom :","Pièce femelle",null,null,"Nom :","Pièce femelle",null,null,"Nom :","Pièce femelle",null,null,"Nom :","Pièce femelle",null,null,"Nom :","Pièce femelle",null,null,"Nom :","Pièce femelle",null,null,"Nom :","Pièce femelle",null,null,"Nom :","Pièce femelle",null,null,"Nom :","Pièce femelle",null,null,"Nom :","Pièce femelle"]
[null,"Matière :","3 - Inconel 718",null,null,"Matière :","3 - Inconel 718",null,null,"Matière :","3 - Inconel 718",null,null,"Matière :","3 - Inconel 718",null,null,"Matière :","3 - Inconel 718",null,null,"Matière :","3 - Inconel 718",null,null,"Matière :","3 - Inconel 718",null,null,"Matière :","3 - Inconel 718",null,null,"Matière :","3 - Inconel 718",null,null,"Matière :","3 - Inconel 718"]
[null,"L zone",{"v":52.7,"d":"52.700"},"mm",null,"L zone",{"v":52.7,"d":"52.700"},"mm",null,"L zone",{"v":52.7,"d":"52.700"},"mm",null,"L zone",{"v":52.7,"d":"52.700"},"mm",null,"L zone",{"v":52.7,"d":"52.700"},"mm",null,"L zone",{"v":52.7,"d":"52.700"},"mm",null,"L zone",{"v":52.7,"d":"52.700"},"mm",null,"L zone",{"v":52.7,"d":"52.700"},"mm",null,"L zone",{"v":52.7,"d":"52.700"},"mm",null,"L zone",{"v":52.7,"d":"52.700"},"mm"]
[null,"L frette",{"v":0,"d":"0.000"},"mm",null,"L frette",{"v":0,"d":"0.000"},"mm",null,"L frette",{"v":0,"d":"0.000"},"mm",null,"L frette",{"v":0,"d":"0.000"},"mm",null,"L frette",{"v":0,"d":"0.000"},"mm",null,"L frette",{"v":0,"d":"0.000"},"mm",null,"L frette",{"v":0,"d":"0.000"},"mm",null,"L frette",{"v":0,"d":"0.000"},"mm",null,"L frette",{"v":0,"d":"0.000"},"mm",null,"L frette",{"v":0,"d":"0.000"},"mm"]
[null,"Dext",{"v":30,"d":"30.000"},"mm",null,"Dext",{"v":30,"d":"30.000"},"mm",null,"Dext",{"v":30,"d":"30.000"},"mm",null,"Dext",{"v":30,"d":"30.000"},"mm",null,"Dext",{"v":30,"d":"30.000"},"mm",null,"Dext",{"v":30,"d":"30.000"},"mm",null,"Dext",{"v":30,"d":"30.000"},"mm",null,"Dext",{"v":30,"d":"30.000"},"mm",null,"Dext",{"v":30,"d":"30.000"},"mm",null,"Dext",{"v":30,"d":"30.000"},"mm"]
[null,"dint",{"v":25,"d":"25.000"},"mm",null,"dint",{"v":25,"d":"25.000"},"mm",null,"dint",{"v":25,"d":"25.000"},"mm",null,"dint",{"v":25,"d":"25.000"},"mm",null,"dint",{"v":25,"d":"25.000"},"mm",null,"dint",{"v":25,"d":"25.000"},"mm",null,"dint",{"v":25,"d":"25.000"},"mm",null,"dint",{"v":25,"d":"25.000"},"mm",null,"dint",{"v":25,"d":"25.000"},"mm",null,"dint",{"v":25,"d":"25.000"},"mm"]
[null,"Diamètre de calcul",{"v":29,"d":"29.000"},"mm",null,"Diamètre de calcul",{"v":29,"d":"29.000"},"mm",null,"Diamètre de calcul",{"v":29,"d":"29.000"},"mm",null,"Diamètre de calcul",{"v":29,"d":"29.000"},"mm",null,"Diamètre de calcul",{"v":29,"d":"29.000"},"mm",null,"Diamètre de calcul",{"v":29,"d":"29.000"},"mm",null,"Diamètre de calcul",{"v":29,"d":"29.000"},"mm",null,"Diamètre de calcul",{"v":29,"d":"29.000"},"mm",null,"Diamètre de calcul",{"v":29,"d":"29.000"},"mm",null,"Diamètre de calcul",{"v":29,"d":"29.000"},"mm"]
[null,"Type de pièce","1 - Profil cylindrique",null,null,"Type de pièce","1 - Profil cylindrique",null,null,"Type de pièce","1 - Profil cylindrique",null,null,"Type de pièce","1 - Profil cylindrique",null,null,"Type de pièce","1 - Profil cylindrique",null,null,"Type de pièce","1 - Profil cylindrique",null,null,"Type de pièce","1 - Profil cylindrique",null,null,"Type de pièce","1 - Profil cylindrique",null,null,"Type de pièce","1 - Profil cylindrique",null,null,"Type de pièce","1 - Profil cylindrique"]
[null,"Distance au plan grand diamètre",{"v":0,"d":"0.000"},"mm",null,"Distance au plan grand diamètre",{"v":0,"d":"0.000"},"mm",null,"Distance au plan grand diamètre",{"v":0,"d":"0.000"},"mm",null,"Distance au plan grand diamètre",{"v":0,"d":"0.000"},"mm",null,"Distance au plan grand diamètre",{"v":0,"d":"0.000"},"mm",null,"Distance au plan grand diamètre",{"v":0,"d":"0.000"},"mm",null,"Distance au plan grand diamètre",{"v":0,"d":"0.000"},"mm",null,"Distance au plan grand diamètre",{"v":0,"d":"0.000"},"mm",null,"Distance au plan grand diamètre",{"v":0,"d":"0.000"},"mm",null,"Distance au plan grand diamètre",{"v":0,"d":"0.000"},"mm"]
[null,"Rayon max pièce",{"v":0,"d":"0.000"},"mm",null,"Rayon max pièce",{"v":0,"d":"0.000"},"mm",null,"Rayon max pièce",{"v":0,"d":"0.000"},"mm",null,"Rayon max pièce",{"v":0,"d":"0.000"},"mm",null,"Rayon max pièce",{"v":0,"d":"0.000"},"mm",null,"Rayon max pièce",{"v":0,"d":"0.000"},"mm",null,"Rayon max pièce",{"v":0,"d":"0.000"},"mm",null,"Rayon max pièce",{"v":0,"d":"0.000"},"mm",null,"Rayon max pièce",{"v":0,"d":"0.000"},"mm",null,"Rayon max pièce",{"v":0,"d":"0.000"},"mm"]
[null,"Epaisseur grand diamètre",{"v":0,"d":"0.000"},"mm",null,"Epaisseur grand diamètre",{"v":0,"d":"0.000"},"mm",null,"Epaisseur grand diamètre",{"v":0,"d":"0.000"},"mm",null,"Epaisseur grand diamètre",{"v":0,"d":"0.000"},"mm",null,"Epaisseur grand diamètre",{"v":0,"d":"0.000"},"mm",null,"Epaisseur grand diamètre",{"v":0,"d":"0.000"},"mm",null,"Epaisseur grand diamètre",{"v":0,"d":"0.000"},"mm",null,"Epaisseur grand diamètre",{"v":0,"d":"0.000"},"mm",null,"Epaisseur grand diamètre",{"v":0,"d":"0.000"},"mm",null,"Epaisseur grand diamètre",{"v":0,"d":"0.000"},"mm"]
[null,"Effet de fond",{"v":0,"d":"0.000"},"N",null,"Effet de fond",{"v":0,"d":"0.000"},"N",null,"Effet de fond",{"v":0,"d":"0.000"},"N",null,"Effet de fond",{"v":0,"d":"0.000"},"N",null,"Effet de fond",{"v":0,"d":"0.000"},"N",null,"Effet de fond",{"v":0,"d":"0.000"},"N",null,"Effet de fond",{"v":0,"d":"0.000"},"N",null,"Effet de fond",{"v":0,"d":"0.000"},"N",null,"Effet de fond",{"v":0,"d":"0.000"},"N",null,"Effet de fond",{"v":0,"d":"0.000"},"N"]
[null,"Young Montage",{"$f":"VLOOKUP(C32,Matériaux!$C$4:$T$15,6)","v":{"v":20674.822,"d":"20675"}},"daN/mm2",null,"Young Montage",{"$f":"VLOOKUP(G32,Matériaux!$C$4:$T$15,6)","v":{"v":20674.822,"d":"20675"}},"daN/mm2",null,"Young Montage",{"$f":"VLOOKUP(K32,Matériaux!$C$4:$T$15,6)","v":{"v":20674.822,"d":"20675"}},"daN/mm2",null,"Young Montage",{"$f":"VLOOKUP(O32,Matériaux!$C$4:$T$15,6)","v":{"v":20674.822,"d":"20675"}},"daN/mm2",null,"Young Montage",{"$f":"VLOOKUP(S32,Matériaux!$C$4:$T$15,6)","v":{"v":20674.822,"d":"20675"}},"daN/mm2",null,"Young Montage",{"$f":"VLOOKUP(W32,Matériaux!$C$4:$T$15,6)","v":{"v":20674.822,"d":"20675"}},"daN/mm2",null,"Young Montage",{"$f":"VLOOKUP(AA32,Matériaux!$C$4:$T$15,6)","v":{"v":20674.822,"d":"20675"}},"daN/mm2",null,"Young Montage",{"$f":"VLOOKUP(AE32,Matériaux!$C$4:$T$15,6)","v":{"v":20674.822,"d":"20675"}},"daN/mm2",null,"Young Montage",{"$f":"VLOOKUP(AI32,Matériaux!$C$4:$T$15,6)","v":{"v":20674.822,"d":"20675"}},"daN/mm2",null,"Young Montage",{"$f":"VLOOKUP(AM32,Matériaux!$C$4:$T$15,6)","v":{"v":20674.822,"d":"20675"}},"daN/mm2"]
[null,"Youg MeF",{"$f":"VLOOKUP(C32,Matériaux!$C$4:$T$15,7)","v":22036},"daN/mm2",null,"Youg MeF",{"$f":"VLOOKUP(G32,Matériaux!$C$4:$T$15,7)","v":22036},"daN/mm2",null,"Youg MeF",{"$f":"VLOOKUP(K32,Matériaux!$C$4:$T$15,7)","v":22036},"daN/mm2",null,"Youg MeF",{"$f":"VLOOKUP(O32,Matériaux!$C$4:$T$15,7)","v":22036},"daN/mm2",null,"Youg MeF",{"$f":"VLOOKUP(S32,Matériaux!$C$4:$T$15,7)","v":22036},"daN/mm2",null,"Youg MeF",{"$f":"VLOOKUP(W32,Matériaux!$C$4:$T$15,7)","v":22036},"daN/mm2",null,"Youg MeF",{"$f":"VLOOKUP(AA32,Matériaux!$C$4:$T$15,7)","v":22036},"daN/mm2",null,"Youg MeF",{"$f":"VLOOKUP(AE32,Matériaux!$C$4:$T$15,7)","v":22036},"daN/mm2",null,"Youg MeF",{"$f":"VLOOKUP(AI32,Matériaux!$C$4:$T$15,7)","v":22036},"daN/mm2",null,"Youg MeF",{"$f":"VLOOKUP(AM32,Matériaux!$C$4:$T$15,7)","v":22036},"daN/mm2"]
[null,"Young fonctionnement",{"$f":"VLOOKUP(C32,Matériaux!$C$4:$T$15,8)","v":{"v":21715.4,"d":"21715"}},"daN/mm2",null,"Young fonctionnement",{"$f":"VLOOKUP(G32,Matériaux!$C$4:$T$15,8)","v":{"v":21715.4,"d":"21715"}},"daN/mm2",null,"Young fonctionnement",{"$f":"VLOOKUP(K32,Matériaux!$C$4:$T$15,8)","v":{"v":21715.4,"d":"21715"}},"daN/mm2",null,"Young fonctionnement",{"$f":"VLOOKUP(O32,Matériaux!$C$4:$T$15,8)","v":{"v":21715.4,"d":"21715"}},"daN/mm2",null,"Young fonctionnement",{"$f":"VLOOKUP(S32,Matériaux!$C$4:$T$15,8)","v":{"v":21715.4,"d":"21715"}},"daN/mm2",null,"Young fonctionnement",{"$f":"VLOOKUP(W32,Matériaux!$C$4:$T$15,8)","v":{"v":21715.4,"d":"21715"}},"daN/mm2",null,"Young fonctionnement",{"$f":"VLOOKUP(AA32,Matériaux!$C$4:$T$15,8)","v":{"v":21715.4,"d":"21715"}},"daN/mm2",null,"Young fonctionnement",{"$f":"VLOOKUP(AE32,Matériaux!$C$4:$T$15,8)","v":{"v":21715.4,"d":"21715"}},"daN/mm2",null,"Young fonctionnement",{"$f":"VLOOKUP(AI32,Matériaux!$C$4:$T$15,8)","v":{"v":21715.4,"d":"21715"}},"daN/mm2",null,"Young fonctionnement",{"$f":"VLOOKUP(AM32,Matériaux!$C$4:$T$15,8)","v":{"v":21715.4,"d":"21715"}},"daN/mm2"]
[null,"S",{"$f":"(PI()/4*((C35)-(C36)))^2","v":{"v":15.421256876702122,"d":"15.421"}},"mm2",null,"S",{"$f":"(PI()/4*((G35)-(G36)))^2","v":{"v":15.421256876702122,"d":"15.421"}},"mm2",null,"S",{"$f":"(PI()/4*((K35)-(K36)))^2","v":{"v":15.421256876702122,"d":"15.421"}},"mm2",null,"S",{"$f":"(PI()/4*((O35)-(O36)))^2","v":{"v":15.421256876702122,"d":"15.421"}},"mm2",null,"S",{"$f":"(PI()/4*((S35)-(S36)))^2","v":{"v":15.421256876702122,"d":"15.421"}},"mm2",null,"S",{"$f":"(PI()/4*((W35)-(W36)))^2","v":{"v":15.421256876702122,"d":"15.421"}},"mm2",null,"S",{"$f":"(PI()/4*((AA35)-(AA36)))^2","v":{"v":15.421256876702122,"d":"15.421"}},"mm2",null,"S",{"$f":"(PI()/4*((AE35)-(AE36)))^2","v":{"v":15.421256876702122,"d":"15.421"}},"mm2",null,"S",{"$f":"(PI()/4*((AI35)-(AI36)))^2","v":{"v":15.421256876702122,"d":"15.421"}},"mm2",null,"S",{"$f":"(PI()/4*((AM35)-(AM36)))^2","v":{"v":15.421256876702122,"d":"15.421"}},"mm2"]
[null,"Kv (montage)",{"$f":"IFERROR(C46*C43/C33,0)","v":{"v":6049.938158293971,"d":"6.050E+03"}},"daN/mm",null,"Kv (montage)",{"$f":"IFERROR(G46*G43/G33,0)","v":{"v":6049.938158293971,"d":"6.050E+03"}},"daN/mm",null,"Kv (montage)",{"$f":"IFERROR(K46*K43/K33,0)","v":{"v":6049.938158293971,"d":"6.050E+03"}},"daN/mm",null,"Kv (montage)",{"$f":"IFERROR(O46*O43/O33,0)","v":{"v":6049.938158293971,"d":"6.050E+03"}},"daN/mm",null,"Kv (montage)",{"$f":"IFERROR(S46*S43/S33,0)","v":{"v":6049.938158293971,"d":"6.050E+03"}},"daN/mm",null,"Kv (montage)",{"$f":"IFERROR(W46*W43/W33,0)","v":{"v":6049.938158293971,"d":"6.050E+03"}},"daN/mm",null,"Kv (montage)",{"$f":"IFERROR(AA46*AA43/AA33,0)","v":{"v":6049.938158293971,"d":"6.050E+03"}},"daN/mm",null,"Kv (montage)",{"$f":"IFERROR(AE46*AE43/AE33,0)","v":{"v":6049.938158293971,"d":"6.050E+03"}},"daN/mm",null,"Kv (montage)",{"$f":"IFERROR(AI46*AI43/AI33,0)","v":{"v":6049.938158293971,"d":"6.050E+03"}},"daN/mm",null,"Kv (montage)",{"$f":"IFERROR(AM46*AM43/AM33,0)","v":{"v":6049.938158293971,"d":"6.050E+03"}},"daN/mm"]
[null,"Kv (MeF)",{"$f":"IFERROR(C46*C44/C33,0)","v":{"v":6448.250788140568,"d":"6.448E+03"}},"daN/mm",null,"Kv (MeF)",{"$f":"IFERROR(G46*G44/G33,0)","v":{"v":6448.250788140568,"d":"6.448E+03"}},"daN/mm",null,"Kv (MeF)",{"$f":"IFERROR(K46*K44/K33,0)","v":{"v":6448.250788140568,"d":"6.448E+03"}},"daN/mm",null,"Kv (MeF)",{"$f":"IFERROR(O46*O44/O33,0)","v":{"v":6448.250788140568,"d":"6.448E+03"}},"daN/mm",null,"Kv (MeF)",{"$f":"IFERROR(S46*S44/S33,0)","v":{"v":6448.250788140568,"d":"6.448E+03"}},"daN/mm",null,"Kv (MeF)",{"$f":"IFERROR(W46*W44/W33,0)","v":{"v":6448.250788140568,"d":"6.448E+03"}},"daN/mm",null,"Kv (MeF)",{"$f":"IFERROR(AA46*AA44/AA33,0)","v":{"v":6448.250788140568,"d":"6.448E+03"}},"daN/mm",null,"Kv (MeF)",{"$f":"IFERROR(AE46*AE44/AE33,0)","v":{"v":6448.250788140568,"d":"6.448E+03"}},"daN/mm",null,"Kv (MeF)",{"$f":"IFERROR(AI46*AI44/AI33,0)","v":{"v":6448.250788140568,"d":"6.448E+03"}},"daN/mm",null,"Kv (MeF)",{"$f":"IFERROR(AM46*AM44/AM33,0)","v":{"v":6448.250788140568,"d":"6.448E+03"}},"daN/mm"]
[null,"Kv (fonctionnement)",{"$f":"IFERROR(C46*C45/C33,0)","v":{"v":6354.4357036117135,"d":"6.354E+03"}},"daN/mm",null,"Kv (fonctionnement)",{"$f":"IFERROR(G46*G45/G33,0)","v":{"v":6354.4357036117135,"d":"6.354E+03"}},"daN/mm",null,"Kv (fonctionnement)",{"$f":"IFERROR(K46*K45/K33,0)","v":{"v":6354.4357036117135,"d":"6.354E+03"}},"daN/mm",null,"Kv (fonctionnement)",{"$f":"IFERROR(O46*O45/O33,0)","v":{"v":6354.4357036117135,"d":"6.354E+03"}},"daN/mm",null,"Kv (fonctionnement)",{"$f":"IFERROR(S46*S45/S33,0)","v":{"v":6354.4357036117135,"d":"6.354E+03"}},"daN/mm",null,"Kv (fonctionnement)",{"$f":"IFERROR(W46*W45/W33,0)","v":{"v":6354.4357036117135,"d":"6.354E+03"}},"daN/mm",null,"Kv (fonctionnement)",{"$f":"IFERROR(AA46*AA45/AA33,0)","v":{"v":6354.4357036117135,"d":"6.354E+03"}},"daN/mm",null,"Kv (fonctionnement)",{"$f":"IFERROR(AE46*AE45/AE33,0)","v":{"v":6354.4357036117135,"d":"6.354E+03"}},"daN/mm",null,"Kv (fonctionnement)",{"$f":"IFERROR(AI46*AI45/AI33,0)","v":{"v":6354.4357036117135,"d":"6.354E+03"}},"daN/mm",null,"Kv (fonctionnement)",{"$f":"IFERROR(AM46*AM45/AM33,0)","v":{"v":6354.4357036117135,"d":"6.354E+03"}},"daN/mm"]
[null,"ΔL/L MeF",{"$f":"VLOOKUP(C32,Matériaux!$C$4:$T$15,15)","v":{"v":-249.62028,"d":"-249.6"}},"*10^-5",null,"ΔL/L MeF",{"$f":"VLOOKUP(G32,Matériaux!$C$4:$T$15,15)","v":{"v":-249.62028,"d":"-249.6"}},"*10^-5",null,"ΔL/L MeF",{"$f":"VLOOKUP(K32,Matériaux!$C$4:$T$15,15)","v":{"v":-249.62028,"d":"-249.6"}},"*10^-5",null,"ΔL/L MeF",{"$f":"VLOOKUP(O32,Matériaux!$C$4:$T$15,15)","v":{"v":-249.62028,"d":"-249.6"}},"*10^-5",null,"ΔL/L MeF",{"$f":"VLOOKUP(S32,Matériaux!$C$4:$T$15,15)","v":{"v":-249.62028,"d":"-249.6"}},"*10^-5",null,"ΔL/L MeF",{"$f":"VLOOKUP(W32,Matériaux!$C$4:$T$15,15)","v":{"v":-249.62028,"d":"-249.6"}},"*10^-5",null,"ΔL/L MeF",{"$f":"VLOOKUP(AA32,Matériaux!$C$4:$T$15,15)","v":{"v":-249.62028,"d":"-249.6"}},"*10^-5",null,"ΔL/L MeF",{"$f":"VLOOKUP(AE32,Matériaux!$C$4:$T$15,15)","v":{"v":-249.62028,"d":"-249.6"}},"*10^-5",null,"ΔL/L MeF",{"$f":"VLOOKUP(AI32,Matériaux!$C$4:$T$15,15)","v":{"v":-249.62028,"d":"-249.6"}},"*10^-5",null,"ΔL/L MeF",{"$f":"VLOOKUP(AM32,Matériaux!$C$4:$T$15,15)","v":{"v":-249.62028,"d":"-249.6"}},"*10^-5"]
[null,"ΔL/L Fonctionnement",{"$f":"VLOOKUP(C32,Matériaux!$C$4:$T$15,16)","v":{"v":-200.62084,"d":"-200.6"}},"*10^-5",null,"ΔL/L Fonctionnement",{"$f":"VLOOKUP(G32,Matériaux!$C$4:$T$15,16)","v":{"v":-200.62084,"d":"-200.6"}},"*10^-5",null,"ΔL/L Fonctionnement",{"$f":"VLOOKUP(K32,Matériaux!$C$4:$T$15,16)","v":{"v":-200.62084,"d":"-200.6"}},"*10^-5",null,"ΔL/L Fonctionnement",{"$f":"VLOOKUP(O32,Matériaux!$C$4:$T$15,16)","v":{"v":-200.62084,"d":"-200.6"}},"*10^-5",null,"ΔL/L Fonctionnement",{"$f":"VLOOKUP(S32,Matériaux!$C$4:$T$15,16)","v":{"v":-200.62084,"d":"-200.6"}},"*10^-5",null,"ΔL/L Fonctionnement",{"$f":"VLOOKUP(W32,Matériaux!$C$4:$T$15,16)","v":{"v":-200.62084,"d":"-200.6"}},"*10^-5",null,"ΔL/L Fonctionnement",{"$f":"VLOOKUP(AA32,Matériaux!$C$4:$T$15,16)","v":{"v":-200.62084,"d":"-200.6"}},"*10^-5",null,"ΔL/L Fonctionnement",{"$f":"VLOOKUP(AE32,Matériaux!$C$4:$T$15,16)","v":{"v":-200.62084,"d":"-200.6"}},"*10^-5",null,"ΔL/L Fonctionnement",{"$f":"VLOOKUP(AI32,Matériaux!$C$4:$T$15,16)","v":{"v":-200.62084,"d":"-200.6"}},"*10^-5",null,"ΔL/L Fonctionnement",{"$f":"VLOOKUP(AM32,Matériaux!$C$4:$T$15,16)","v":{"v":-200.62084,"d":"-200.6"}},"*10^-5"]
[null,"ν",{"$f":"VLOOKUP(C32,Matériaux!$C$4:$T$15,17)","v":{"v":0.2795269411764706,"d":"0.28"}},"-",null,"ν",{"$f":"VLOOKUP(G32,Matériaux!$C$4:$T$15,17)","v":{"v":0.2795269411764706,"d":"0.28"}},"-",null,"ν",{"$f":"VLOOKUP(K32,Matériaux!$C$4:$T$15,17)","v":{"v":0.2795269411764706,"d":"0.28"}},"-",null,"ν",{"$f":"VLOOKUP(O32,Matériaux!$C$4:$T$15,17)","v":{"v":0.2795269411764706,"d":"0.28"}},"-",null,"ν",{"$f":"VLOOKUP(S32,Matériaux!$C$4:$T$15,17)","v":{"v":0.2795269411764706,"d":"0.28"}},"-",null,"ν",{"$f":"VLOOKUP(W32,Matériaux!$C$4:$T$15,17)","v":{"v":0.2795269411764706,"d":"0.28"}},"-",null,"ν",{"$f":"VLOOKUP(AA32,Matériaux!$C$4:$T$15,17)","v":{"v":0.2795269411764706,"d":"0.28"}},"-",null,"ν",{"$f":"VLOOKUP(AE32,Matériaux!$C$4:$T$15,17)","v":{"v":0.2795269411764706,"d":"0.28"}},"-",null,"ν",{"$f":"VLOOKUP(AI32,Matériaux!$C$4:$T$15,17)","v":{"v":0.2795269411764706,"d":"0.28"}},"-",null,"ν",{"$f":"VLOOKUP(AM32,Matériaux!$C$4:$T$15,17)","v":{"v":0.2795269411764706,"d":"0.28"}},"-"]
[null,"ρ",{"$f":"VLOOKUP(C32,Matériaux!$C$4:$T$15,18)","v":8260},"kg/m3",null,"ρ",{"$f":"VLOOKUP(G32,Matériaux!$C$4:$T$15,18)","v":8260},"kg/m3",null,"ρ",{"$f":"VLOOKUP(K32,Matériaux!$C$4:$T$15,18)","v":8260},"kg/m3",null,"ρ",{"$f":"VLOOKUP(O32,Matériaux!$C$4:$T$15,18)","v":8260},"kg/m3",null,"ρ",{"$f":"VLOOKUP(S32,Matériaux!$C$4:$T$15,18)","v":8260},"kg/m3",null,"ρ",{"$f":"VLOOKUP(W32,Matériaux!$C$4:$T$15,18)","v":8260},"kg/m3",null,"ρ",{"$f":"VLOOKUP(AA32,Matériaux!$C$4:$T$15,18)","v":8260},"kg/m3",null,"ρ",{"$f":"VLOOKUP(AE32,Matériaux!$C$4:$T$15,18)","v":8260},"kg/m3",null,"ρ",{"$f":"VLOOKUP(AI32,Matériaux!$C$4:$T$15,18)","v":8260},"kg/m3",null,"ρ",{"$f":"VLOOKUP(AM32,Matériaux!$C$4:$T$15,18)","v":8260},"kg/m3"]
[]
[null,"Coefficient de frottement",0.12,"-",null,"Coefficient de frottement",0.12,"-",null,"Coefficient de frottement",0.12,"-",null,"Coefficient de frottement",0.12,"-",null,"Coefficient de frottement",0.12,"-",null,"Coefficient de frottement",0.12,"-",null,"Coefficient de frottement",0.12,"-",null,"Coefficient de frottement",0.12,"-",null,"Coefficient de frottement",0.12,"-",null,"Coefficient de frottement",0.12,"-"]
[]
[null,"Montage :"]
[]
[null,"L_Total :",{"$f":"SUM(13:13)","v":527},"mm"]
[null,"K_Total_Traction :",{"$f":"(22:22)","v":{"v":151248.4539573493,"d":"151248"}},"daN/mm"]
[null,"L_Total :",{"$f":"SUM(33:33)","v":527},"mm"]
[null,"K_Total_Compression :",{"$f":"SUM(47:47)","v":{"v":60499.381582939706,"d":"60499"}},"daN/mm"]
[]
[null,"MeF :"]
[]
[null,"L_Total :",{"$f":"SUM(13:13)","v":527},"mm"]
[null,"DeltaL/L moyen :",{"$f":"(SUM(13:13)*SUM(25:25)*0.00001)/C66","v":{"v":-0.024962028000000008,"d":"-2.50E-02"}},"mm/mm"]
[null,"K_Total_Traction :",{"$f":"SUM(23:23)","v":{"v":1612062.697035142,"d":"1612063"}},"daN/mm"]
[null,"L_Total :",{"$f":"SUM(33:33)","v":527},"mm"]
[null,"DeltaL/L moyen :",{"$f":"(SUM(33:33)*SUM(50:50)*0.00001)/C69","v":{"v":-0.024962028000000008,"d":"-2.50E-02"}},"mm/mm"]
[null,"K_Total_Compression :",{"$f":"SUM(48:48)","v":{"v":64482.50788140568,"d":"64483"}},"daN/mm"]
[]
[null,"Fonctionnement :"]
[]
[null,"L_Total :",{"$f":"SUM(13:13)","v":527},"mm"]
[null,"DeltaL/L moyen :",{"$f":"(SUM(13:13)*SUM(26:26)*0.00001)/C66","v":{"v":-0.020062084000000004,"d":"-2.01E-02"}},"mm/mm"]
[null,"K_Total_Traction :",{"$f":"SUM(24:24)","v":{"v":1588608.925902928,"d":"1588609"}},"daN/mm"]
[null,"L_Total :",{"$f":"SUM(33:33)","v":527},"mm"]
[null,"DeltaL/L moyen :",{"$f":"(SUM(33:33)*SUM(51:51)*0.00001)/C69","v":{"v":-0.020062084000000004,"d":"-2.01E-02"}},"mm/mm"]
[null,"K_Total_Compression :",{"$f":"SUM(49:49)","v":{"v":63544.35703611714,"d":"63544"}},"daN/mm"]
[]
[null,"Pour ajouter un matériau hors liste, veuillez vous reporter à l'onglet \"Matériaux\" et suivre la procédure."]
[]
[null,"Définition des données système"]
[]
[null,"Vitesse de rotation",null,30000,"tr/min"]
[{"$nulls":3},{"$f":"2*3.141592/60*D86","v":{"v":3141.592,"d":"3142"}},"rad/s"]
[null,"Pression intérieure mâle",null,{"v":10,"d":"10.0"},"bar"]
[null,"Pression extérieure mâle",null,{"v":20,"d":"20.0"},"bar"]
[null,"Pression intérieure femelle",null,{"v":10,"d":"10.0"},"bar"]
[null,"Pression extérieure femelle",null,{"v":20,"d":"20.0"},"bar"]
[null,"Effort axial F (traction F=+..., compression F=-...)",null,6000,"daN"]
[]
[null,"Température Montage",null,293,"K"]
[null,"Température Mise en froid",null,20,"K"]
[null,"Température Fonctionnement",null,90,"K"]
[]
[]
[]
[]
[null,"Résultats des effets conjugués par pièce au montage"]
[]
[null,"Nom :",{"$f":"C11","v":"Pièce mâle"},null,null,"Nom :",{"$f":"G11","v":"Pièce mâle"},null,null,"Nom :",{"$f":"K11","v":"Pièce mâle"},null,null,"Nom :",{"$f":"O11","v":"Pièce mâle"},null,null,"Nom :",{"$f":"S11","v":"Pièce mâle"},null,null,"Nom :",{"$f":"W11","v":"Pièce mâle"},null,null,"Nom :",{"$f":"AA11","v":"Pièce mâle"},null,null,"Nom :",{"$f":"AE11","v":"Pièce mâle"},null,null,"Nom :",{"$f":"AI11","v":"Pièce mâle"},null,null,"Nom :",{"$f":"AM11","v":"Pièce mâle"}]
[null,"Au niveau du frettage",{"$nulls":3},"Au niveau du frettage",{"$nulls":3},"Au niveau du frettage",{"$nulls":3},"Au niveau du frettage",{"$nulls":3},"Au niveau du frettage",{"$nulls":3},"Au niveau du frettage",{"$nulls":3},"Au niveau du frettage",{"$nulls":3},"Au niveau du frettage",{"$nulls":3},"Au niveau du frettage",{"$nulls":3},"Au niveau du frettage"]
[null,"Contrainte axiale",{"$f":"Detail_des_effets!C28","v":{"v":122.23099629457562,"d":"122.23"}},"MPa",null,"Contrainte axiale",{"$f":"Detail_des_effets!G28","v":{"v":122.23099629457562,"d":"122.23"}},"MPa",null,"Contrainte axiale",{"$f":"Detail_des_effets!K28","v":{"v":122.23099629457562,"d":"122.23"}},"MPa",null,"Contrainte axiale",{"$f":"Detail_des_effets!O28","v":{"v":122.23099629457562,"d":"122.23"}},"MPa",null,"Contrainte axiale",{"$f":"Detail_des_effets!S28","v":{"v":122.23099629457562,"d":"122.23"}},"MPa",null,"Contrainte axiale",{"$f":"Detail_des_effets!W28","v":{"v":122.23099629457562,"d":"122.23"}},"MPa",null,"Contrainte axiale",{"$f":"Detail_des_effets!AA28","v":{"v":122.23099629457562,"d":"122.23"}},"MPa",null,"Contrainte axiale",{"$f":"Detail_des_effets!AE28","v":{"v":122.23099629457562,"d":"122.23"}},"MPa",null,"Contrainte axiale",{"$f":"Detail_des_effets!AI28","v":{"v":122.23099629457562,"d":"122.23"}},"MPa",null,"Contrainte axiale",{"$f":"Detail_des_effets!AM28","v":{"v":122.23099629457562,"d":"122.23"}},"MPa"]
[null,"Contrainte radiale",{"$f":"Detail_des_effets!C59","v":{"$error":"#VALUE!"}},"MPa",null,"Contrainte radiale",{"$f":"Detail_des_effets!G59","v":{"$error":"#VALUE!"}},"MPa",null,"Contrainte radiale",{"$f":"Detail_des_effets!K59","v":{"$error":"#VALUE!"}},"MPa",null,"Contrainte radiale",{"$f":"Detail_des_effets!O59","v":{"$error":"#VALUE!"}},"MPa",null,"Contrainte radiale",{"$f":"Detail_des_effets!S59","v":{"$error":"#VALUE!"}},"MPa",null,"Contrainte radiale",{"$f":"Detail_des_effets!W59","v":{"$error":"#VALUE!"}},"MPa",null,"Contrainte radiale",{"$f":"Detail_des_effets!AA59","v":{"$error":"#VALUE!"}},"MPa",null,"Contrainte radiale",{"$f":"Detail_des_effets!AE59","v":{"$error":"#VALUE!"}},"MPa",null,"Contrainte radiale",{"$f":"Detail_des_effets!AI59","v":{"$error":"#VALUE!"}},"MPa",null,"Contrainte radiale",{"$f":"Detail_des_effets!AM59","v":{"$error":"#VALUE!"}},"MPa"]
[null,"Contrainte tangentielle",{"$f":"Detail_des_effets!C60","v":{"$error":"#VALUE!"}},"MPa",null,"Contrainte tangentielle",{"$f":"Detail_des_effets!G60","v":{"$error":"#VALUE!"}},"MPa",null,"Contrainte tangentielle",{"$f":"Detail_des_effets!K60","v":{"$error":"#VALUE!"}},"MPa",null,"Contrainte tangentielle",{"$f":"Detail_des_effets!O60","v":{"$error":"#VALUE!"}},"MPa",null,"Contrainte tangentielle",{"$f":"Detail_des_effets!S60","v":{"$error":"#VALUE!"}},"MPa",null,"Contrainte tangentielle",{"$f":"Detail_des_effets!W60","v":{"$error":"#VALUE!"}},"MPa",null,"Contrainte tangentielle",{"$f":"Detail_des_effets!AA60","v":{"$error":"#VALUE!"}},"MPa",null,"Contrainte tangentielle",{"$f":"Detail_des_effets!AE60","v":{"$error":"#VALUE!"}},"MPa",null,"Contrainte tangentielle",{"$f":"Detail_des_effets!AI60","v":{"$error":"#VALUE!"}},"MPa",null,"Contrainte tangentielle",{"$f":"Detail_des_effets!AM60","v":{"$error":"#VALUE!"}},"MPa"]
[null,"Déformée axiale",{"$f":"Detail_des_effets!C29","v":{"v":0.031156609255083963,"d":"0.031"}},"mm",null,"Déformée axiale",{"$f":"Detail_des_effets!G29","v":{"v":0.031156609255083963,"d":"0.031"}},"mm",null,"Déformée axiale",{"$f":"Detail_des_effets!K29","v":{"v":0.031156609255083963,"d":"0.031"}},"mm",null,"Déformée axiale",{"$f":"Detail_des_effets!O29","v":{"v":0.031156609255083963,"d":"0.031"}},"mm",null,"Déformée axiale",{"$f":"Detail_des_effets!S29","v":{"v":0.031156609255083963,"d":"0.031"}},"mm",null,"Déformée axiale",{"$f":"Detail_des_effets!W29","v":{"v":0.031156609255083963,"d":"0.031"}},"mm",null,"Déformée axiale",{"$f":"Detail_des_effets!AA29","v":{"v":0.031156609255083963,"d":"0.031"}},"mm",null,"Déformée axiale",{"$f":"Detail_des_effets!AE29","v":{"v":0.031156609255083963,"d":"0.031"}},"mm",null,"Déformée axiale",{"$f":"Detail_des_effets!AI29","v":{"v":0.031156609255083963,"d":"0.031"}},"mm",null,"Déformée axiale",{"$f":"Detail_des_effets!AM29","v":{"v":0.031156609255083963,"d":"0.031"}},"mm"]
[null,"Déformée radiale",{"$f":"Detail_des_effets!C30+Detail_des_effets!C61","v":{"$error":"#VALUE!"}},"mm",null,"Déformée radiale",{"$f":"Detail_des_effets!G30+Detail_des_effets!G61","v":{"$error":"#VALUE!"}},"mm",null,"Déformée radiale",{"$f":"Detail_des_effets!K30+Detail_des_effets!K61","v":{"$error":"#VALUE!"}},"mm",null,"Déformée radiale",{"$f":"Detail_des_effets!O30+Detail_des_effets!O61","v":{"$error":"#VALUE!"}},"mm",null,"Déformée radiale",{"$f":"Detail_des_effets!S30+Detail_des_effets!S61","v":{"$error":"#VALUE!"}},"mm",null,"Déformée radiale",{"$f":"Detail_des_effets!W30+Detail_des_effets!W61","v":{"$error":"#VALUE!"}},"mm",null,"Déformée radiale",{"$f":"Detail_des_effets!AA30+Detail_des_effets!AA61","v":{"$error":"#VALUE!"}},"mm",null,"Déformée radiale",{"$f":"Detail_des_effets!AE30+Detail_des_effets!AE61","v":{"$error":"#VALUE!"}},"mm",null,"Déformée radiale",{"$f":"Detail_des_effets!AI30+Detail_des_effets!AI61","v":{"$error":"#VALUE!"}},"mm",null,"Déformée radiale",{"$f":"Detail_des_effets!AM30+Detail_des_effets!AM61","v":{"$error":"#VALUE!"}},"mm"]
[null,"Dans la pièce, au diamètre particulier",{"$nulls":3},"Dans la pièce, au diamètre particulier",{"$nulls":3},"Dans la pièce, au diamètre particulier",{"$nulls":3},"Dans la pièce, au diamètre particulier",{"$nulls":3},"Dans la pièce, au diamètre particulier",{"$nulls":3},"Dans la pièce, au diamètre particulier",{"$nulls":3},"Dans la pièce, au diamètre particulier",{"$nulls":3},"Dans la pièce, au diamètre particulier",{"$nulls":3},"Dans la pièce, au diamètre particulier",{"$nulls":3},"Dans la pièce, au diamètre particulier"]
[null,"Contrainte axiale",{"$f":"Detail_des_effets!C32","v":{"v":122.23099629457562,"d":"122.23"}},"MPa",null,"Contrainte axiale",{"$f":"Detail_des_effets!G32","v":{"v":122.23099629457562,"d":"122.23"}},"MPa",null,"Contrainte axiale",{"$f":"Detail_des_effets!K32","v":{"v":122.23099629457562,"d":"122.23"}},"MPa",null,"Contrainte axiale",{"$f":"Detail_des_effets!O32","v":{"v":122.23099629457562,"d":"122.23"}},"MPa",null,"Contrainte axiale",{"$f":"Detail_des_effets!S32","v":{"v":122.23099629457562,"d":"122.23"}},"MPa",null,"Contrainte axiale",{"$f":"Detail_des_effets!W32","v":{"v":122.23099629457562,"d":"122.23"}},"MPa",null,"Contrainte axiale",{"$f":"Detail_des_effets!AA32","v":{"v":122.23099629457562,"d":"122.23"}},"MPa",null,"Contrainte axiale",{"$f":"Detail_des_effets!AE32","v":{"v":122.23099629457562,"d":"122.23"}},"MPa",null,"Contrainte axiale",{"$f":"Detail_des_effets!AI32","v":{"v":122.23099629457562,"d":"122.23"}},"MPa",null,"Contrainte axiale",{"$f":"Detail_des_effets!AM32","v":{"v":122.23099629457562,"d":"122.23"}},"MPa"]
[null,"Contrainte radiale",{"$f":"Detail_des_effets!C63","v":{"$error":"#VALUE!"}},"MPa",null,"Contrainte radiale",{"$f":"Detail_des_effets!G63","v":{"$error":"#VALUE!"}},"MPa",null,"Contrainte radiale",{"$f":"Detail_des_effets!K63","v":{"$error":"#VALUE!"}},"MPa",null,"Contrainte radiale",{"$f":"Detail_des_effets!O63","v":{"$error":"#VALUE!"}},"MPa",null,"Contrainte radiale",{"$f":"Detail_des_effets!S63","v":{"$error":"#VALUE!"}},"MPa",null,"Contrainte radiale",{"$f":"Detail_des_effets!W63","v":{"$error":"#VALUE!"}},"MPa",null,"Contrainte radiale",{"$f":"Detail_des_effets!AA63","v":{"$error":"#VALUE!"}},"MPa",null,"Contrainte radiale",{"$f":"Detail_des_effets!AE63","v":{"$error":"#VALUE!"}},"MPa",null,"Contrainte radiale",{"$f":"Detail_des_effets!AI63","v":{"$error":"#VALUE!"}},"MPa",null,"Contrainte radiale",{"$f":"Detail_des_effets!AM63","v":{"$error":"#VALUE!"}},"MPa"]
[null,"Contrainte tangentielle",{"$f":"Detail_des_effets!C64","v":{"$error":"#VALUE!"}},"MPa",null,"Contrainte tangentielle",{"$f":"Detail_des_effets!G64","v":{"$error":"#VALUE!"}},"MPa",null,"Contrainte tangentielle",{"$f":"Detail_des_effets!K64","v":{"$error":"#VALUE!"}},"MPa",null,"Contrainte tangentielle",{"$f":"Detail_des_effets!O64","v":{"$error":"#VALUE!"}},"MPa",null,"Contrainte tangentielle",{"$f":"Detail_des_effets!S64","v":{"$error":"#VALUE!"}},"MPa",null,"Contrainte tangentielle",{"$f":"Detail_des_effets!W64","v":{"$error":"#VALUE!"}},"MPa",null,"Contrainte tangentielle",{"$f":"Detail_des_effets!AA64","v":{"$error":"#VALUE!"}},"MPa",null,"Contrainte tangentielle",{"$f":"Detail_des_effets!AE64","v":{"$error":"#VALUE!"}},"MPa",null,"Contrainte tangentielle",{"$f":"Detail_des_effets!AI64","v":{"$error":"#VALUE!"}},"MPa",null,"Contrainte tangentielle",{"$f":"Detail_des_effets!AM64","v":{"$error":"#VALUE!"}},"MPa"]
[null,"Déformée axiale",{"$f":"Detail_des_effets!C29","v":{"v":0.031156609255083963,"d":"0.031"}},"mm",null,"Déformée axiale",{"$f":"Detail_des_effets!G29","v":{"v":0.031156609255083963,"d":"0.031"}},"mm",null,"Déformée axiale",{"$f":"Detail_des_effets!K29","v":{"v":0.031156609255083963,"d":"0.031"}},"mm",null,"Déformée axiale",{"$f":"Detail_des_effets!O29","v":{"v":0.031156609255083963,"d":"0.031"}},"mm",null,"Déformée axiale",{"$f":"Detail_des_effets!S29","v":{"v":0.031156609255083963,"d":"0.031"}},"mm",null,"Déformée axiale",{"$f":"Detail_des_effets!W29","v":{"v":0.031156609255083963,"d":"0.031"}},"mm",null,"Déformée axiale",{"$f":"Detail_des_effets!AA29","v":{"v":0.031156609255083963,"d":"0.031"}},"mm",null,"Déformée axiale",{"$f":"Detail_des_effets!AE29","v":{"v":0.031156609255083963,"d":"0.031"}},"mm",null,"Déformée axiale",{"$f":"Detail_des_effets!AI29","v":{"v":0.031156609255083963,"d":"0.031"}},"mm",null,"Déformée axiale",{"$f":"Detail_des_effets!AM29","v":{"v":0.031156609255083963,"d":"0.031"}},"mm"]
[null,"Déformée radiale",{"$f":"Detail_des_effets!C34+Detail_des_effets!C65","v":{"$error":"#VALUE!"}},"mm",null,"Déformée radiale",{"$f":"Detail_des_effets!G34+Detail_des_effets!G65","v":{"$error":"#VALUE!"}},"mm",null,"Déformée radiale",{"$f":"Detail_des_effets!K34+Detail_des_effets!K65","v":{"$error":"#VALUE!"}},"mm",null,"Déformée radiale",{"$f":"Detail_des_effets!O34+Detail_des_effets!O65","v":{"$error":"#VALUE!"}},"mm",null,"Déformée radiale",{"$f":"Detail_des_effets!S34+Detail_des_effets!S65","v":{"$error":"#VALUE!"}},"mm",null,"Déformée radiale",{"$f":"Detail_des_effets!W34+Detail_des_effets!W65","v":{"$error":"#VALUE!"}},"mm",null,"Déformée radiale",{"$f":"Detail_des_effets!AA34+Detail_des_effets!AA65","v":{"$error":"#VALUE!"}},"mm",null,"Déformée radiale",{"$f":"Detail_des_effets!AE34+Detail_des_effets!AE65","v":{"$error":"#VALUE!"}},"mm",null,"Déformée radiale",{"$f":"Detail_des_effets!AI34+Detail_des_effets!AI65","v":{"$error":"#VALUE!"}},"mm",null,"Déformée radiale",{"$f":"Detail_des_effets!AM34+Detail_des_effets!AM65","v":{"$error":"#VALUE!"}},"mm"]
[]
[null,"Nom :",{"$f":"C31","v":"Pièce femelle"},null,null,"Nom :",{"$f":"G31","v":"Pièce femelle"},null,null,"Nom :",{"$f":"K31","v":"Pièce femelle"},null,null,"Nom :",{"$f":"O31","v":"Pièce femelle"},null,null,"Nom :",{"$f":"S31","v":"Pièce femelle"},null,null,"Nom :",{"$f":"W31","v":"Pièce femelle"},null,null,"Nom :",{"$f":"AA31","v":"Pièce femelle"},null,null,"Nom :",{"$f":"AE31","v":"Pièce femelle"},null,null,"Nom :",{"$f":"AI31","v":"Pièce femelle"},null,null,"Nom :",{"$f":"AM31","v":"Pièce femelle"}]
[null,"Au niveau du frettage",{"$nulls":3},"Au niveau du frettage",{"$nulls":3},"Au niveau du frettage",{"$nulls":3},"Au niveau du frettage",{"$nulls":3},"Au niveau du frettage",{"$nulls":3},"Au niveau du frettage",{"$nulls":3},"Au niveau du frettage",{"$nulls":3},"Au niveau du frettage",{"$nulls":3},"Au niveau du frettage",{"$nulls":3},"Au niveau du frettage"]
[null,"Contrainte axiale",{"$f":"Detail_des_effets!C132","v":{"v":277.7977188513082,"d":"277.80"}},"MPa",null,"Contrainte axiale",{"$f":"Detail_des_effets!G132","v":{"v":277.7977188513082,"d":"277.80"}},"MPa",null,"Contrainte axiale",{"$f":"Detail_des_effets!K132","v":{"v":277.7977188513082,"d":"277.80"}},"MPa",null,"Contrainte axiale",{"$f":"Detail_des_effets!O132","v":{"v":277.7977188513082,"d":"277.80"}},"MPa",null,"Contrainte axiale",{"$f":"Detail_des_effets!S132","v":{"v":277.7977188513082,"d":"277.80"}},"MPa",null,"Contrainte axiale",{"$f":"Detail_des_effets!W132","v":{"v":277.7977188513082,"d":"277.80"}},"MPa",null,"Contrainte axiale",{"$f":"Detail_des_effets!AA132","v":{"v":277.7977188513082,"d":"277.80"}},"MPa",null,"Contrainte axiale",{"$f":"Detail_des_effets!AE132","v":{"v":277.7977188513082,"d":"277.80"}},"MPa",null,"Contrainte axiale",{"$f":"Detail_des_effets!AI132","v":{"v":277.7977188513082,"d":"277.80"}},"MPa",null,"Contrainte axiale",{"$f":"Detail_des_effets!AM132","v":{"v":277.7977188513082,"d":"277.80"}},"MPa"]
[null,"Contrainte radiale",{"$f":"Detail_des_effets!C163","v":{"$error":"#VALUE!"}},"MPa",null,"Contrainte radiale",{"$f":"Detail_des_effets!G163","v":{"$error":"#VALUE!"}},"MPa",null,"Contrainte radiale",{"$f":"Detail_des_effets!K163","v":{"$error":"#VALUE!"}},"MPa",null,"Contrainte radiale",{"$f":"Detail_des_effets!O163","v":{"$error":"#VALUE!"}},"MPa",null,"Contrainte radiale",{"$f":"Detail_des_effets!S163","v":{"$error":"#VALUE!"}},"MPa",null,"Contrainte radiale",{"$f":"Detail_des_effets!W163","v":{"$error":"#VALUE!"}},"MPa",null,"Contrainte radiale",{"$f":"Detail_des_effets!AA163","v":{"$error":"#VALUE!"}},"MPa",null,"Contrainte radiale",{"$f":"Detail_des_effets!AE163","v":{"$error":"#VALUE!"}},"MPa",null,"Contrainte radiale",{"$f":"Detail_des_effets!AI163","v":{"$error":"#VALUE!"}},"MPa",null,"Contrainte radiale",{"$f":"Detail_des_effets!AM163","v":{"$error":"#VALUE!"}},"MPa"]
[null,"Contrainte tangentielle",{"$f":"Detail_des_effets!C164","v":{"$error":"#VALUE!"}},"MPa",null,"Contrainte tangentielle",{"$f":"Detail_des_effets!G164","v":{"$error":"#VALUE!"}},"MPa",null,"Contrainte tangentielle",{"$f":"Detail_des_effets!K164","v":{"$error":"#VALUE!"}},"MPa",null,"Contrainte tangentielle",{"$f":"Detail_des_effets!O164","v":{"$error":"#VALUE!"}},"MPa",null,"Contrainte tangentielle",{"$f":"Detail_des_effets!S164","v":{"$error":"#VALUE!"}},"MPa",null,"Contrainte tangentielle",{"$f":"Detail_des_effets!W164","v":{"$error":"#VALUE!"}},"MPa",null,"Contrainte tangentielle",{"$f":"Detail_des_effets!AA164","v":{"$error":"#VALUE!"}},"MPa",null,"Contrainte tangentielle",{"$f":"Detail_des_effets!AE164","v":{"$error":"#VALUE!"}},"MPa",null,"Contrainte tangentielle",{"$f":"Detail_des_effets!AI164","v":{"$error":"#VALUE!"}},"MPa",null,"Contrainte tangentielle",{"$f":"Detail_des_effets!AM164","v":{"$error":"#VALUE!"}},"MPa"]
[null,"Déformée axiale",{"$f":"Detail_des_effets!C133","v":{"v":0.07081047557973628,"d":"0.071"}},"mm",null,"Déformée axiale",{"$f":"Detail_des_effets!G133","v":{"v":0.07081047557973628,"d":"0.071"}},"mm",null,"Déformée axiale",{"$f":"Detail_des_effets!K133","v":{"v":0.07081047557973628,"d":"0.071"}},"mm",null,"Déformée axiale",{"$f":"Detail_des_effets!O133","v":{"v":0.07081047557973628,"d":"0.071"}},"mm",null,"Déformée axiale",{"$f":"Detail_des_effets!S133","v":{"v":0.07081047557973628,"d":"0.071"}},"mm",null,"Déformée axiale",{"$f":"Detail_des_effets!W133","v":{"v":0.07081047557973628,"d":"0.071"}},"mm",null,"Déformée axiale",{"$f":"Detail_des_effets!AA133","v":{"v":0.07081047557973628,"d":"0.071"}},"mm",null,"Déformée axiale",{"$f":"Detail_des_effets!AE133","v":{"v":0.07081047557973628,"d":"0.071"}},"mm",null,"Déformée axiale",{"$f":"Detail_des_effets!AI133","v":{"v":0.07081047557973628,"d":"0.071"}},"mm",null,"Déformée axiale",{"$f":"Detail_des_effets!AM133","v":{"v":0.07081047557973628,"d":"0.071"}},"mm"]
[null,"Déformée radiale",{"$f":"Detail_des_effets!C134+Detail_des_effets!C165","v":{"$error":"#VALUE!"}},"mm",null,"Déformée radiale",{"$f":"Detail_des_effets!G134+Detail_des_effets!G165","v":{"$error":"#VALUE!"}},"mm",null,"Déformée radiale",{"$f":"Detail_des_effets!K134+Detail_des_effets!K165","v":{"$error":"#VALUE!"}},"mm",null,"Déformée radiale",{"$f":"Detail_des_effets!O134+Detail_des_effets!O165","v":{"$error":"#VALUE!"}},"mm",null,"Déformée radiale",{"$f":"Detail_des_effets!S134+Detail_des_effets!S165","v":{"$error":"#VALUE!"}},"mm",null,"Déformée radiale",{"$f":"Detail_des_effets!W134+Detail_des_effets!W165","v":{"$error":"#VALUE!"}},"mm",null,"Déformée radiale",{"$f":"Detail_des_effets!AA134+Detail_des_effets!AA165","v":{"$error":"#VALUE!"}},"mm",null,"Déformée radiale",{"$f":"Detail_des_effets!AE134+Detail_des_effets!AE165","v":{"$error":"#VALUE!"}},"mm",null,"Déformée radiale",{"$f":"Detail_des_effets!AI134+Detail_des_effets!AI165","v":{"$error":"#VALUE!"}},"mm",null,"Déformée radiale",{"$f":"Detail_des_effets!AM134+Detail_des_effets!AM165","v":{"$error":"#VALUE!"}},"mm"]
[null,"Dans la pièce, au diamètre particulier",{"$nulls":3},"Dans la pièce, au diamètre particulier",{"$nulls":3},"Dans la pièce, au diamètre particulier",{"$nulls":3},"Dans la pièce, au diamètre particulier",{"$nulls":3},"Dans la pièce, au diamètre particulier",{"$nulls":3},"Dans la pièce, au diamètre particulier",{"$nulls":3},"Dans la pièce, au diamètre particulier",{"$nulls":3},"Dans la pièce, au diamètre particulier",{"$nulls":3},"Dans la pièce, au diamètre particulier",{"$nulls":3},"Dans la pièce, au diamètre particulier"]
[null,"Contrainte axiale",{"$f":"Detail_des_effets!C136","v":{"v":277.7977188513082,"d":"277.80"}},"MPa",null,"Contrainte axiale",{"$f":"Detail_des_effets!G136","v":{"v":277.7977188513082,"d":"277.80"}},"MPa",null,"Contrainte axiale",{"$f":"Detail_des_effets!K136","v":{"v":277.7977188513082,"d":"277.80"}},"MPa",null,"Contrainte axiale",{"$f":"Detail_des_effets!O136","v":{"v":277.7977188513082,"d":"277.80"}},"MPa",null,"Contrainte axiale",{"$f":"Detail_des_effets!S136","v":{"v":277.7977188513082,"d":"277.80"}},"MPa",null,"Contrainte axiale",{"$f":"Detail_des_effets!W136","v":{"v":277.7977188513082,"d":"277.80"}},"MPa",null,"Contrainte axiale",{"$f":"Detail_des_effets!AA136","v":{"v":277.7977188513082,"d":"277.80"}},"MPa",null,"Contrainte axiale",{"$f":"Detail_des_effets!AE136","v":{"v":277.7977188513082,"d":"277.80"}},"MPa",null,"Contrainte axiale",{"$f":"Detail_des_effets!AI136","v":{"v":277.7977188513082,"d":"277.80"}},"MPa",null,"Contrainte axiale",{"$f":"Detail_des_effets!AM136","v":{"v":277.7977188513082,"d":"277.80"}},"MPa"]
[null,"Contrainte radiale",{"$f":"Detail_des_effets!C167","v":{"$error":"#VALUE!"}},"MPa",null,"Contrainte radiale",{"$f":"Detail_des_effets!G167","v":{"$error":"#VALUE!"}},"MPa",null,"Contrainte radiale",{"$f":"Detail_des_effets!K167","v":{"$error":"#VALUE!"}},"MPa",null,"Contrainte radiale",{"$f":"Detail_des_effets!O167","v":{"$error":"#VALUE!"}},"MPa",null,"Contrainte radiale",{"$f":"Detail_des_effets!S167","v":{"$error":"#VALUE!"}},"MPa",null,"Contrainte radiale",{"$f":"Detail_des_effets!W167","v":{"$error":"#VALUE!"}},"MPa",null,"Contrainte radiale",{"$f":"Detail_des_effets!AA167","v":{"$error":"#VALUE!"}},"MPa",null,"Contrainte radiale",{"$f":"Detail_des_effets!AE167","v":{"$error":"#VALUE!"}},"MPa",null,"Contrainte radiale",{"$f":"Detail_des_effets!AI167","v":{"$error":"#VALUE!"}},"MPa",null,"Contrainte radiale",{"$f":"Detail_des_effets!AM167","v":{"$error":"#VALUE!"}},"MPa"]
[null,"Contrainte tangentielle",{"$f":"Detail_des_effets!C168","v":{"$error":"#VALUE!"}},"MPa",null,"Contrainte tangentielle",{"$f":"Detail_des_effets!G168","v":{"$error":"#VALUE!"}},"MPa",null,"Contrainte tangentielle",{"$f":"Detail_des_effets!K168","v":{"$error":"#VALUE!"}},"MPa",null,"Contrainte tangentielle",{"$f":"Detail_des_effets!O168","v":{"$error":"#VALUE!"}},"MPa",null,"Contrainte tangentielle",{"$f":"Detail_des_effets!S168","v":{"$error":"#VALUE!"}},"MPa",null,"Contrainte tangentielle",{"$f":"Detail_des_effets!W168","v":{"$error":"#VALUE!"}},"MPa",null,"Contrainte tangentielle",{"$f":"Detail_des_effets!AA168","v":{"$error":"#VALUE!"}},"MPa",null,"Contrainte tangentielle",{"$f":"Detail_des_effets!AE168","v":{"$error":"#VALUE!"}},"MPa",null,"Contrainte tangentielle",{"$f":"Detail_des_effets!AI168","v":{"$error":"#VALUE!"}},"MPa",null,"Contrainte tangentielle",{"$f":"Detail_des_effets!AM168","v":{"$error":"#VALUE!"}},"MPa"]
[null,"Déformée axiale",{"$f":"Detail_des_effets!C137","v":{"v":0.07081047557973628,"d":"0.071"}},"mm",null,"Déformée axiale",{"$f":"Detail_des_effets!G137","v":{"v":0.07081047557973628,"d":"0.071"}},"mm",null,"Déformée axiale",{"$f":"Detail_des_effets!K137","v":{"v":0.07081047557973628,"d":"0.071"}},"mm",null,"Déformée axiale",{"$f":"Detail_des_effets!O137","v":{"v":0.07081047557973628,"d":"0.071"}},"mm",null,"Déformée axiale",{"$f":"Detail_des_effets!S137","v":{"v":0.07081047557973628,"d":"0.071"}},"mm",null,"Déformée axiale",{"$f":"Detail_des_effets!W137","v":{"v":0.07081047557973628,"d":"0.071"}},"mm",null,"Déformée axiale",{"$f":"Detail_des_effets!AA137","v":{"v":0.07081047557973628,"d":"0.071"}},"mm",null,"Déformée axiale",{"$f":"Detail_des_effets!AE137","v":{"v":0.07081047557973628,"d":"0.071"}},"mm",null,"Déformée axiale",{"$f":"Detail_des_effets!AI137","v":{"v":0.07081047557973628,"d":"0.071"}},"mm",null,"Déformée axiale",{"$f":"Detail_des_effets!AM137","v":{"v":0.07081047557973628,"d":"0.071"}},"mm"]
[null,"Déformée radiale",{"$f":"Detail_des_effets!C138+Detail_des_effets!C169","v":{"$error":"#VALUE!"}},"mm",null,"Déformée radiale",{"$f":"Detail_des_effets!G138+Detail_des_effets!G169","v":{"$error":"#VALUE!"}},"mm",null,"Déformée radiale",{"$f":"Detail_des_effets!K138+Detail_des_effets!K169","v":{"$error":"#VALUE!"}},"mm",null,"Déformée radiale",{"$f":"Detail_des_effets!O138+Detail_des_effets!O169","v":{"$error":"#VALUE!"}},"mm",null,"Déformée radiale",{"$f":"Detail_des_effets!S138+Detail_des_effets!S169","v":{"$error":"#VALUE!"}},"mm",null,"Déformée radiale",{"$f":"Detail_des_effets!W138+Detail_des_effets!W169","v":{"$error":"#VALUE!"}},"mm",null,"Déformée radiale",{"$f":"Detail_des_effets!AA138+Detail_des_effets!AA169","v":{"$error":"#VALUE!"}},"mm",null,"Déformée radiale",{"$f":"Detail_des_effets!AE138+Detail_des_effets!AE169","v":{"$error":"#VALUE!"}},"mm",null,"Déformée radiale",{"$f":"Detail_des_effets!AI138+Detail_des_effets!AI169","v":{"$error":"#VALUE!"}},"mm",null,"Déformée radiale",{"$f":"Detail_des_effets!AM138+Detail_des_effets!AM169","v":{"$error":"#VALUE!"}},"mm"]
[]
[]
[null,"Résultats des effets conjugués par pièce à la mise en froid"]
[]
[null,"Nom :",{"$f":"C11","v":"Pièce mâle"},null,null,"Nom :",{"$f":"G11","v":"Pièce mâle"},null,null,"Nom :",{"$f":"K11","v":"Pièce mâle"},null,null,"Nom :",{"$f":"O11","v":"Pièce mâle"},null,null,"Nom :",{"$f":"S11","v":"Pièce mâle"},null,null,"Nom :",{"$f":"W11","v":"Pièce mâle"},null,null,"Nom :",{"$f":"AA11","v":"Pièce mâle"},null,null,"Nom :",{"$f":"AE11","v":"Pièce mâle"},null,null,"Nom :",{"$f":"AI11","v":"Pièce mâle"},null,null,"Nom :",{"$f":"AM11","v":"Pièce mâle"}]
[null,"Au niveau du frettage",{"$nulls":3},"Au niveau du frettage",{"$nulls":3},"Au niveau du frettage",{"$nulls":3},"Au niveau du frettage",{"$nulls":3},"Au niveau du frettage",{"$nulls":3},"Au niveau du frettage",{"$nulls":3},"Au niveau du frettage",{"$nulls":3},"Au niveau du frettage",{"$nulls":3},"Au niveau du frettage",{"$nulls":3},"Au niveau du frettage"]
[null,"Contrainte axiale",{"$f":"Detail_des_effets!C38","v":{"v":122.23099629457562,"d":"122.23"}},"MPa",null,"Contrainte axiale",{"$f":"Detail_des_effets!G38","v":{"v":122.23099629457562,"d":"122.23"}},"MPa",null,"Contrainte axiale",{"$f":"Detail_des_effets!K38","v":{"v":122.23099629457562,"d":"122.23"}},"MPa",null,"Contrainte axiale",{"$f":"Detail_des_effets!O38","v":{"v":122.23099629457562,"d":"122.23"}},"MPa",null,"Contrainte axiale",{"$f":"Detail_des_effets!S38","v":{"v":122.23099629457562,"d":"122.23"}},"MPa",null,"Contrainte axiale",{"$f":"Detail_des_effets!W38","v":{"v":122.23099629457562,"d":"122.23"}},"MPa",null,"Contrainte axiale",{"$f":"Detail_des_effets!AA38","v":{"v":122.23099629457562,"d":"122.23"}},"MPa",null,"Contrainte axiale",{"$f":"Detail_des_effets!AE38","v":{"v":122.23099629457562,"d":"122.23"}},"MPa",null,"Contrainte axiale",{"$f":"Detail_des_effets!AI38","v":{"v":122.23099629457562,"d":"122.23"}},"MPa",null,"Contrainte axiale",{"$f":"Detail_des_effets!AM38","v":{"v":122.23099629457562,"d":"122.23"}},"MPa"]
[null,"Contrainte radiale",{"$f":"Detail_des_effets!C18+Detail_des_effets!C70","v":{"$error":"#VALUE!"}},"MPa",null,"Contrainte radiale",{"$f":"Detail_des_effets!G18+Detail_des_effets!G70","v":{"$error":"#VALUE!"}},"MPa",null,"Contrainte radiale",{"$f":"Detail_des_effets!K18+Detail_des_effets!K70","v":{"$error":"#VALUE!"}},"MPa",null,"Contrainte radiale",{"$f":"Detail_des_effets!O18+Detail_des_effets!O70","v":{"$error":"#VALUE!"}},"MPa",null,"Contrainte radiale",{"$f":"Detail_des_effets!S18+Detail_des_effets!S70","v":{"$error":"#VALUE!"}},"MPa",null,"Contrainte radiale",{"$f":"Detail_des_effets!W18+Detail_des_effets!W70","v":{"$error":"#VALUE!"}},"MPa",null,"Contrainte radiale",{"$f":"Detail_des_effets!AA18+Detail_des_effets!AA70","v":{"$error":"#VALUE!"}},"MPa",null,"Contrainte radiale",{"$f":"Detail_des_effets!AE18+Detail_des_effets!AE70","v":{"$error":"#VALUE!"}},"MPa",null,"Contrainte radiale",{"$f":"Detail_des_effets!AI18+Detail_des_effets!AI70","v":{"$error":"#VALUE!"}},"MPa",null,"Contrainte radiale",{"$f":"Detail_des_effets!AM18+Detail_des_effets!AM70","v":{"$error":"#VALUE!"}},"MPa"]
[null,"Contrainte tangentielle",{"$f":"Detail_des_effets!C19+Detail_des_effets!C71","v":{"$error":"#VALUE!"}},"MPa",null,"Contrainte tangentielle",{"$f":"Detail_des_effets!G19+Detail_des_effets!G71","v":{"$error":"#VALUE!"}},"MPa",null,"Contrainte tangentielle",{"$f":"Detail_des_effets!K19+Detail_des_effets!K71","v":{"$error":"#VALUE!"}},"MPa",null,"Contrainte tangentielle",{"$f":"Detail_des_effets!O19+Detail_des_effets!O71","v":{"$error":"#VALUE!"}},"MPa",null,"Contrainte tangentielle",{"$f":"Detail_des_effets!S19+Detail_des_effets!S71","v":{"$error":"#VALUE!"}},"MPa",null,"Contrainte tangentielle",{"$f":"Detail_des_effets!W19+Detail_des_effets!W71","v":{"$error":"#VALUE!"}},"MPa",null,"Contrainte tangentielle",{"$f":"Detail_des_effets!AA19+Detail_des_effets!AA71","v":{"$error":"#VALUE!"}},"MPa",null,"Contrainte tangentielle",{"$f":"Detail_des_effets!AE19+Detail_des_effets!AE71","v":{"$error":"#VALUE!"}},"MPa",null,"Contrainte tangentielle",{"$f":"Detail_des_effets!AI19+Detail_des_effets!AI71","v":{"$error":"#VALUE!"}},"MPa",null,"Contrainte tangentielle",{"$f":"Detail_des_effets!AM19+Detail_des_effets!AM71","v":{"$error":"#VALUE!"}},"MPa"]
[null,"Déformée axiale",{"$f":"Detail_des_effets!C91+Detail_des_effets!C39","v":{"v":-0.10231784224903553,"d":"-0.102"}},"mm",null,"Déformée axiale",{"$f":"Detail_des_effets!G91+Detail_des_effets!G39","v":{"v":-0.10231784224903553,"d":"-0.102"}},"mm",null,"Déformée axiale",{"$f":"Detail_des_effets!K91+Detail_des_effets!K39","v":{"v":-0.10231784224903553,"d":"-0.102"}},"mm",null,"Déformée axiale",{"$f":"Detail_des_effets!O91+Detail_des_effets!O39","v":{"v":-0.10231784224903553,"d":"-0.102"}},"mm",null,"Déformée axiale",{"$f":"Detail_des_effets!S91+Detail_des_effets!S39","v":{"v":-0.10231784224903553,"d":"-0.102"}},"mm",null,"Déformée axiale",{"$f":"Detail_des_effets!W91+Detail_des_effets!W39","v":{"v":-0.10231784224903553,"d":"-0.102"}},"mm",null,"Déformée axiale",{"$f":"Detail_des_effets!AA91+Detail_des_effets!AA39","v":{"v":-0.10231784224903553,"d":"-0.102"}},"mm",null,"Déformée axiale",{"$f":"Detail_des_effets!AE91+Detail_des_effets!AE39","v":{"v":-0.10231784224903553,"d":"-0.102"}},"mm",null,"Déformée axiale",{"$f":"Detail_des_effets!AI91+Detail_des_effets!AI39","v":{"v":-0.10231784224903553,"d":"-0.102"}},"mm",null,"Déformée axiale",{"$f":"Detail_des_effets!AM91+Detail_des_effets!AM39","v":{"v":-0.10231784224903553,"d":"-0.102"}},"mm"]
[null,"Déformée radiale",{"$f":"Detail_des_effets!C92+Detail_des_effets!C40+Detail_des_effets!C72","v":{"$error":"#VALUE!"}},"mm",null,"Déformée radiale",{"$f":"Detail_des_effets!G92+Detail_des_effets!G40+Detail_des_effets!G72","v":{"$error":"#VALUE!"}},"mm",null,"Déformée radiale",{"$f":"Detail_des_effets!K92+Detail_des_effets!K40+Detail_des_effets!K72","v":{"$error":"#VALUE!"}},"mm",null,"Déformée radiale",{"$f":"Detail_des_effets!O92+Detail_des_effets!O40+Detail_des_effets!O72","v":{"$error":"#VALUE!"}},"mm",null,"Déformée radiale",{"$f":"Detail_des_effets!S92+Detail_des_effets!S40+Detail_des_effets!S72","v":{"$error":"#VALUE!"}},"mm",null,"Déformée radiale",{"$f":"Detail_des_effets!W92+Detail_des_effets!W40+Detail_des_effets!W72","v":{"$error":"#VALUE!"}},"mm",null,"Déformée radiale",{"$f":"Detail_des_effets!AA92+Detail_des_effets!AA40+Detail_des_effets!AA72","v":{"$error":"#VALUE!"}},"mm",null,"Déformée radiale",{"$f":"Detail_des_effets!AE92+Detail_des_effets!AE40+Detail_des_effets!AE72","v":{"$error":"#VALUE!"}},"mm",null,"Déformée radiale",{"$f":"Detail_des_effets!AI92+Detail_des_effets!AI40+Detail_des_effets!AI72","v":{"$error":"#VALUE!"}},"mm",null,"Déformée radiale",{"$f":"Detail_des_effets!AM92+Detail_des_effets!AM40+Detail_des_effets!AM72","v":{"$error":"#VALUE!"}},"mm"]
[null,"Dans la pièce, au diamètre particulier",{"$nulls":3},"Dans la pièce, au diamètre particulier",{"$nulls":3},"Dans la pièce, au diamètre particulier",{"$nulls":3},"Dans la pièce, au diamètre particulier",{"$nulls":3},"Dans la pièce, au diamètre particulier",{"$nulls":3},"Dans la pièce, au diamètre particulier",{"$nulls":3},"Dans la pièce, au diamètre particulier",{"$nulls":3},"Dans la pièce, au diamètre particulier",{"$nulls":3},"Dans la pièce, au diamètre particulier",{"$nulls":3},"Dans la pièce, au diamètre particulier"]
[null,"Contrainte axiale",{"$f":"Detail_des_effets!C42","v":{"v":122.23099629457562,"d":"122.23"}},"MPa",null,"Contrainte axiale",{"$f":"Detail_des_effets!G42","v":{"v":122.23099629457562,"d":"122.23"}},"MPa",null,"Contrainte axiale",{"$f":"Detail_des_effets!K42","v":{"v":122.23099629457562,"d":"122.23"}},"MPa",null,"Contrainte axiale",{"$f":"Detail_des_effets!O42","v":{"v":122.23099629457562,"d":"122.23"}},"MPa",null,"Contrainte axiale",{"$f":"Detail_des_effets!S42","v":{"v":122.23099629457562,"d":"122.23"}},"MPa",null,"Contrainte axiale",{"$f":"Detail_des_effets!W42","v":{"v":122.23099629457562,"d":"122.23"}},"MPa",null,"Contrainte axiale",{"$f":"Detail_des_effets!AA42","v":{"v":122.23099629457562,"d":"122.23"}},"MPa",null,"Contrainte axiale",{"$f":"Detail_des_effets!AE42","v":{"v":122.23099629457562,"d":"122.23"}},"MPa",null,"Contrainte axiale",{"$f":"Detail_des_effets!AI42","v":{"v":122.23099629457562,"d":"122.23"}},"MPa",null,"Contrainte axiale",{"$f":"Detail_des_effets!AM42","v":{"v":122.23099629457562,"d":"122.23"}},"MPa"]
[null,"Contrainte radiale",{"$f":"Detail_des_effets!C22+Detail_des_effets!C74","v":{"$error":"#VALUE!"}},"MPa",null,"Contrainte radiale",{"$f":"Detail_des_effets!G22+Detail_des_effets!G74","v":{"$error":"#VALUE!"}},"MPa",null,"Contrainte radiale",{"$f":"Detail_des_effets!K22+Detail_des_effets!K74","v":{"$error":"#VALUE!"}},"MPa",null,"Contrainte radiale",{"$f":"Detail_des_effets!O22+Detail_des_effets!O74","v":{"$error":"#VALUE!"}},"MPa",null,"Contrainte radiale",{"$f":"Detail_des_effets!S22+Detail_des_effets!S74","v":{"$error":"#VALUE!"}},"MPa",null,"Contrainte radiale",{"$f":"Detail_des_effets!W22+Detail_des_effets!W74","v":{"$error":"#VALUE!"}},"MPa",null,"Contrainte radiale",{"$f":"Detail_des_effets!AA22+Detail_des_effets!AA74","v":{"$error":"#VALUE!"}},"MPa",null,"Contrainte radiale",{"$f":"Detail_des_effets!AE22+Detail_des_effets!AE74","v":{"$error":"#VALUE!"}},"MPa",null,"Contrainte radiale",{"$f":"Detail_des_effets!AI22+Detail_des_effets!AI74","v":{"$error":"#VALUE!"}},"MPa",null,"Contrainte radiale",{"$f":"Detail_des_effets!AM22+Detail_des_effets!AM74","v":{"$error":"#VALUE!"}},"MPa"]
[null,"Contrainte tangentielle",{"$f":"Detail_des_effets!C23+Detail_des_effets!C75","v":{"$error":"#VALUE!"}},"MPa",null,"Contrainte tangentielle",{"$f":"Detail_des_effets!G23+Detail_des_effets!G75","v":{"$error":"#VALUE!"}},"MPa",null,"Contrainte tangentielle",{"$f":"Detail_des_effets!K23+Detail_des_effets!K75","v":{"$error":"#VALUE!"}},"MPa",null,"Contrainte tangentielle",{"$f":"Detail_des_effets!O23+Detail_des_effets!O75","v":{"$error":"#VALUE!"}},"MPa",null,"Contrainte tangentielle",{"$f":"Detail_des_effets!S23+Detail_des_effets!S75","v":{"$error":"#VALUE!"}},"MPa",null,"Contrainte tangentielle",{"$f":"Detail_des_effets!W23+Detail_des_effets!W75","v":{"$error":"#VALUE!"}},"MPa",null,"Contrainte tangentielle",{"$f":"Detail_des_effets!AA23+Detail_des_effets!AA75","v":{"$error":"#VALUE!"}},"MPa",null,"Contrainte tangentielle",{"$f":"Detail_des_effets!AE23+Detail_des_effets!AE75","v":{"$error":"#VALUE!"}},"MPa",null,"Contrainte tangentielle",{"$f":"Detail_des_effets!AI23+Detail_des_effets!AI75","v":{"$error":"#VALUE!"}},"MPa",null,"Contrainte tangentielle",{"$f":"Detail_des_effets!AM23+Detail_des_effets!AM75","v":{"$error":"#VALUE!"}},"MPa"]
[null,"Déformée axiale",{"$f":"Detail_des_effets!C94+Detail_des_effets!C43","v":{"v":-0.10231784224903553,"d":"-0.102"}},"mm",null,"Déformée axiale",{"$f":"Detail_des_effets!G94+Detail_des_effets!G43","v":{"v":-0.10231784224903553,"d":"-0.102"}},"mm",null,"Déformée axiale",{"$f":"Detail_des_effets!K94+Detail_des_effets!K43","v":{"v":-0.10231784224903553,"d":"-0.102"}},"mm",null,"Déformée axiale",{"$f":"Detail_des_effets!O94+Detail_des_effets!O43","v":{"v":-0.10231784224903553,"d":"-0.102"}},"mm",null,"Déformée axiale",{"$f":"Detail_des_effets!S94+Detail_des_effets!S43","v":{"v":-0.10231784224903553,"d":"-0.102"}},"mm",null,"Déformée axiale",{"$f":"Detail_des_effets!W94+Detail_des_effets!W43","v":{"v":-0.10231784224903553,"d":"-0.102"}},"mm",null,"Déformée axiale",{"$f":"Detail_des_effets!AA94+Detail_des_effets!AA43","v":{"v":-0.10231784224903553,"d":"-0.102"}},"mm",null,"Déformée axiale",{"$f":"Detail_des_effets!AE94+Detail_des_effets!AE43","v":{"v":-0.10231784224903553,"d":"-0.102"}},"mm",null,"Déformée axiale",{"$f":"Detail_des_effets!AI94+Detail_des_effets!AI43","v":{"v":-0.10231784224903553,"d":"-0.102"}},"mm",null,"Déformée axiale",{"$f":"Detail_des_effets!AM94+Detail_des_effets!AM43","v":{"v":-0.10231784224903553,"d":"-0.102"}},"mm"]
[null,"Déformée radiale",{"$f":"Detail_des_effets!C95+Detail_des_effets!C44+Detail_des_effets!C76","v":{"$error":"#VALUE!"}},"mm",null,"Déformée radiale",{"$f":"Detail_des_effets!G95+Detail_des_effets!G44+Detail_des_effets!G76","v":{"$error":"#VALUE!"}},"mm",null,"Déformée radiale",{"$f":"Detail_des_effets!K95+Detail_des_effets!K44+Detail_des_effets!K76","v":{"$error":"#VALUE!"}},"mm",null,"Déformée radiale",{"$f":"Detail_des_effets!O95+Detail_des_effets!O44+Detail_des_effets!O76","v":{"$error":"#VALUE!"}},"mm",null,"Déformée radiale",{"$f":"Detail_des_effets!S95+Detail_des_effets!S44+Detail_des_effets!S76","v":{"$error":"#VALUE!"}},"mm",null,"Déformée radiale",{"$f":"Detail_des_effets!W95+Detail_des_effets!W44+Detail_des_effets!W76","v":{"$error":"#VALUE!"}},"mm",null,"Déformée radiale",{"$f":"Detail_des_effets!AA95+Detail_des_effets!AA44+Detail_des_effets!AA76","v":{"$error":"#VALUE!"}},"mm",null,"Déformée radiale",{"$f":"Detail_des_effets!AE95+Detail_des_effets!AE44+Detail_des_effets!AE76","v":{"$error":"#VALUE!"}},"mm",null,"Déformée radiale",{"$f":"Detail_des_effets!AI95+Detail_des_effets!AI44+Detail_des_effets!AI76","v":{"$error":"#VALUE!"}},"mm",null,"Déformée radiale",{"$f":"Detail_des_effets!AM95+Detail_des_effets!AM44+Detail_des_effets!AM76","v":{"$error":"#VALUE!"}},"mm"]
[]
[null,"Nom :",{"$f":"C31","v":"Pièce femelle"},null,null,"Nom :",{"$f":"G31","v":"Pièce femelle"},null,null,"Nom :",{"$f":"K31","v":"Pièce femelle"},null,null,"Nom :",{"$f":"O31","v":"Pièce femelle"},null,null,"Nom :",{"$f":"S31","v":"Pièce femelle"},null,null,"Nom :",{"$f":"W31","v":"Pièce femelle"},null,null,"Nom :",{"$f":"AA31","v":"Pièce femelle"},null,null,"Nom :",{"$f":"AE31","v":"Pièce femelle"},null,null,"Nom :",{"$f":"AI31","v":"Pièce femelle"},null,null,"Nom :",{"$f":"AM31","v":"Pièce femelle"}]
[null,"Au niveau du frettage",{"$nulls":3},"Au niveau du frettage",{"$nulls":3},"Au niveau du frettage",{"$nulls":3},"Au niveau du frettage",{"$nulls":3},"Au niveau du frettage",{"$nulls":3},"Au niveau du frettage",{"$nulls":3},"Au niveau du frettage",{"$nulls":3},"Au niveau du frettage",{"$nulls":3},"Au niveau du frettage",{"$nulls":3},"Au niveau du frettage"]
[null,"Contrainte axiale",{"$f":"Detail_des_effets!C142","v":{"v":277.7977188513082,"d":"277.80"}},"MPa",null,"Contrainte axiale",{"$f":"Detail_des_effets!G142","v":{"v":277.7977188513082,"d":"277.80"}},"MPa",null,"Contrainte axiale",{"$f":"Detail_des_effets!K142","v":{"v":277.7977188513082,"d":"277.80"}},"MPa",null,"Contrainte axiale",{"$f":"Detail_des_effets!O142","v":{"v":277.7977188513082,"d":"277.80"}},"MPa",null,"Contrainte axiale",{"$f":"Detail_des_effets!S142","v":{"v":277.7977188513082,"d":"277.80"}},"MPa",null,"Contrainte axiale",{"$f":"Detail_des_effets!W142","v":{"v":277.7977188513082,"d":"277.80"}},"MPa",null,"Contrainte axiale",{"$f":"Detail_des_effets!AA142","v":{"v":277.7977188513082,"d":"277.80"}},"MPa",null,"Contrainte axiale",{"$f":"Detail_des_effets!AE142","v":{"v":277.7977188513082,"d":"277.80"}},"MPa",null,"Contrainte axiale",{"$f":"Detail_des_effets!AI142","v":{"v":277.7977188513082,"d":"277.80"}},"MPa",null,"Contrainte axiale",{"$f":"Detail_des_effets!AM142","v":{"v":277.7977188513082,"d":"277.80"}},"MPa"]
[null,"Contrainte radiale",{"$f":"Detail_des_effets!C122+Detail_des_effets!C174","v":{"$error":"#VALUE!"}},"MPa",null,"Contrainte radiale",{"$f":"Detail_des_effets!G122+Detail_des_effets!G174","v":{"$error":"#VALUE!"}},"MPa",null,"Contrainte radiale",{"$f":"Detail_des_effets!K122+Detail_des_effets!K174","v":{"$error":"#VALUE!"}},"MPa",null,"Contrainte radiale",{"$f":"Detail_des_effets!O122+Detail_des_effets!O174","v":{"$error":"#VALUE!"}},"MPa",null,"Contrainte radiale",{"$f":"Detail_des_effets!S122+Detail_des_effets!S174","v":{"$error":"#VALUE!"}},"MPa",null,"Contrainte radiale",{"$f":"Detail_des_effets!W122+Detail_des_effets!W174","v":{"$error":"#VALUE!"}},"MPa",null,"Contrainte radiale",{"$f":"Detail_des_effets!AA122+Detail_des_effets!AA174","v":{"$error":"#VALUE!"}},"MPa",null,"Contrainte radiale",{"$f":"Detail_des_effets!AE122+Detail_des_effets!AE174","v":{"$error":"#VALUE!"}},"MPa",null,"Contrainte radiale",{"$f":"Detail_des_effets!AI122+Detail_des_effets!AI174","v":{"$error":"#VALUE!"}},"MPa",null,"Contrainte radiale",{"$f":"Detail_des_effets!AM122+Detail_des_effets!AM174","v":{"$error":"#VALUE!"}},"MPa"]
[null,"Contrainte tangentielle",{"$f":"Detail_des_effets!C123+Detail_des_effets!C175","v":{"$error":"#VALUE!"}},"MPa",null,"Contrainte tangentielle",{"$f":"Detail_des_effets!G123+Detail_des_effets!G175","v":{"$error":"#VALUE!"}},"MPa",null,"Contrainte tangentielle",{"$f":"Detail_des_effets!K123+Detail_des_effets!K175","v":{"$error":"#VALUE!"}},"MPa",null,"Contrainte tangentielle",{"$f":"Detail_des_effets!O123+Detail_des_effets!O175","v":{"$error":"#VALUE!"}},"MPa",null,"Contrainte tangentielle",{"$f":"Detail_des_effets!S123+Detail_des_effets!S175","v":{"$error":"#VALUE!"}},"MPa",null,"Contrainte tangentielle",{"$f":"Detail_des_effets!W123+Detail_des_effets!W175","v":{"$error":"#VALUE!"}},"MPa",null,"Contrainte tangentielle",{"$f":"Detail_des_effets!AA123+Detail_des_effets!AA175","v":{"$error":"#VALUE!"}},"MPa",null,"Contrainte tangentielle",{"$f":"Detail_des_effets!AE123+Detail_des_effets!AE175","v":{"$error":"#VALUE!"}},"MPa",null,"Contrainte tangentielle",{"$f":"Detail_des_effets!AI123+Detail_des_effets!AI175","v":{"$error":"#VALUE!"}},"MPa",null,"Contrainte tangentielle",{"$f":"Detail_des_effets!AM123+Detail_des_effets!AM175","v":{"$error":"#VALUE!"}},"MPa"]
[null,"Déformée axiale",{"$f":"Detail_des_effets!C195+Detail_des_effets!C143","v":{"v":-0.06511342094417163,"d":"-0.065"}},"mm",null,"Déformée axiale",{"$f":"Detail_des_effets!G195+Detail_des_effets!G143","v":{"v":-0.06511342094417163,"d":"-0.065"}},"mm",null,"Déformée axiale",{"$f":"Detail_des_effets!K195+Detail_des_effets!K143","v":{"v":-0.06511342094417163,"d":"-0.065"}},"mm",null,"Déformée axiale",{"$f":"Detail_des_effets!O195+Detail_des_effets!O143","v":{"v":-0.06511342094417163,"d":"-0.065"}},"mm",null,"Déformée axiale",{"$f":"Detail_des_effets!S195+Detail_des_effets!S143","v":{"v":-0.06511342094417163,"d":"-0.065"}},"mm",null,"Déformée axiale",{"$f":"Detail_des_effets!W195+Detail_des_effets!W143","v":{"v":-0.06511342094417163,"d":"-0.065"}},"mm",null,"Déformée axiale",{"$f":"Detail_des_effets!AA195+Detail_des_effets!AA143","v":{"v":-0.06511342094417163,"d":"-0.065"}},"mm",null,"Déformée axiale",{"$f":"Detail_des_effets!AE195+Detail_des_effets!AE143","v":{"v":-0.06511342094417163,"d":"-0.065"}},"mm",null,"Déformée axiale",{"$f":"Detail_des_effets!AI195+Detail_des_effets!AI143","v":{"v":-0.06511342094417163,"d":"-0.065"}},"mm",null,"Déformée axiale",{"$f":"Detail_des_effets!AM195+Detail_des_effets!AM143","v":{"v":-0.06511342094417163,"d":"-0.065"}},"mm"]
[null,"Déformée radiale",{"$f":"Detail_des_effets!C196+Detail_des_effets!C176+Detail_des_effets!C144","v":{"$error":"#VALUE!"}},"mm",null,"Déformée radiale",{"$f":"Detail_des_effets!G196+Detail_des_effets!G176+Detail_des_effets!G144","v":{"$error":"#VALUE!"}},"mm",null,"Déformée radiale",{"$f":"Detail_des_effets!K196+Detail_des_effets!K176+Detail_des_effets!K144","v":{"$error":"#VALUE!"}},"mm",null,"Déformée radiale",{"$f":"Detail_des_effets!O196+Detail_des_effets!O176+Detail_des_effets!O144","v":{"$error":"#VALUE!"}},"mm",null,"Déformée radiale",{"$f":"Detail_des_effets!S196+Detail_des_effets!S176+Detail_des_effets!S144","v":{"$error":"#VALUE!"}},"mm",null,"Déformée radiale",{"$f":"Detail_des_effets!W196+Detail_des_effets!W176+Detail_des_effets!W144","v":{"$error":"#VALUE!"}},"mm",null,"Déformée radiale",{"$f":"Detail_des_effets!AA196+Detail_des_effets!AA176+Detail_des_effets!AA144","v":{"$error":"#VALUE!"}},"mm",null,"Déformée radiale",{"$f":"Detail_des_effets!AE196+Detail_des_effets!AE176+Detail_des_effets!AE144","v":{"$error":"#VALUE!"}},"mm",null,"Déformée radiale",{"$f":"Detail_des_effets!AI196+Detail_des_effets!AI176+Detail_des_effets!AI144","v":{"$error":"#VALUE!"}},"mm",null,"Déformée radiale",{"$f":"Detail_des_effets!AM196+Detail_des_effets!AM176+Detail_des_effets!AM144","v":{"$error":"#VALUE!"}},"mm"]
[null,"Dans la pièce, au diamètre particulier",{"$nulls":3},"Dans la pièce, au diamètre particulier",{"$nulls":3},"Dans la pièce, au diamètre particulier",{"$nulls":3},"Dans la pièce, au diamètre particulier",{"$nulls":3},"Dans la pièce, au diamètre particulier",{"$nulls":3},"Dans la pièce, au diamètre particulier",{"$nulls":3},"Dans la pièce, au diamètre particulier",{"$nulls":3},"Dans la pièce, au diamètre particulier",{"$nulls":3},"Dans la pièce, au diamètre particulier",{"$nulls":3},"Dans la pièce, au diamètre particulier"]
[null,"Contrainte axiale",{"$f":"Detail_des_effets!C146","v":{"v":277.7977188513082,"d":"277.80"}},"MPa",null,"Contrainte axiale",{"$f":"Detail_des_effets!G146","v":{"v":277.7977188513082,"d":"277.80"}},"MPa",null,"Contrainte axiale",{"$f":"Detail_des_effets!K146","v":{"v":277.7977188513082,"d":"277.80"}},"MPa",null,"Contrainte axiale",{"$f":"Detail_des_effets!O146","v":{"v":277.7977188513082,"d":"277.80"}},"MPa",null,"Contrainte axiale",{"$f":"Detail_des_effets!S146","v":{"v":277.7977188513082,"d":"277.80"}},"MPa",null,"Contrainte axiale",{"$f":"Detail_des_effets!W146","v":{"v":277.7977188513082,"d":"277.80"}},"MPa",null,"Contrainte axiale",{"$f":"Detail_des_effets!AA146","v":{"v":277.7977188513082,"d":"277.80"}},"MPa",null,"Contrainte axiale",{"$f":"Detail_des_effets!AE146","v":{"v":277.7977188513082,"d":"277.80"}},"MPa",null,"Contrainte axiale",{"$f":"Detail_des_effets!AI146","v":{"v":277.7977188513082,"d":"277.80"}},"MPa",null,"Contrainte axiale",{"$f":"Detail_des_effets!AM146","v":{"v":277.7977188513082,"d":"277.80"}},"MPa"]
[null,"Contrainte radiale",{"$f":"C126","v":{"$error":"#VALUE!"}},"MPa",null,"Contrainte radiale",{"$f":"G126","v":{"$error":"#VALUE!"}},"MPa",null,"Contrainte radiale",{"$f":"K126","v":{"$error":"#VALUE!"}},"MPa",null,"Contrainte radiale",{"$f":"O126","v":{"$error":"#VALUE!"}},"MPa",null,"Contrainte radiale",{"$f":"S126","v":{"$error":"#VALUE!"}},"MPa",null,"Contrainte radiale",{"$f":"W126","v":{"$error":"#VALUE!"}},"MPa",null,"Contrainte radiale",{"$f":"AA126","v":{"$error":"#VALUE!"}},"MPa",null,"Contrainte radiale",{"$f":"AE126","v":{"$error":"#VALUE!"}},"MPa",null,"Contrainte radiale",{"$f":"AI126","v":{"$error":"#VALUE!"}},"MPa",null,"Contrainte radiale",{"$f":"AM126","v":{"$error":"#VALUE!"}},"MPa"]
[null,"Contrainte tangentielle",{"$f":"Detail_des_effets!C127+Detail_des_effets!C179","v":{"$error":"#VALUE!"}},"MPa",null,"Contrainte tangentielle",{"$f":"Detail_des_effets!G127+Detail_des_effets!G179","v":{"$error":"#VALUE!"}},"MPa",null,"Contrainte tangentielle",{"$f":"Detail_des_effets!K127+Detail_des_effets!K179","v":{"$error":"#VALUE!"}},"MPa",null,"Contrainte tangentielle",{"$f":"Detail_des_effets!O127+Detail_des_effets!O179","v":{"$error":"#VALUE!"}},"MPa",null,"Contrainte tangentielle",{"$f":"Detail_des_effets!S127+Detail_des_effets!S179","v":{"$error":"#VALUE!"}},"MPa",null,"Contrainte tangentielle",{"$f":"Detail_des_effets!W127+Detail_des_effets!W179","v":{"$error":"#VALUE!"}},"MPa",null,"Contrainte tangentielle",{"$f":"Detail_des_effets!AA127+Detail_des_effets!AA179","v":{"$error":"#VALUE!"}},"MPa",null,"Contrainte tangentielle",{"$f":"Detail_des_effets!AE127+Detail_des_effets!AE179","v":{"$error":"#VALUE!"}},"MPa",null,"Contrainte tangentielle",{"$f":"Detail_des_effets!AI127+Detail_des_effets!AI179","v":{"$error":"#VALUE!"}},"MPa",null,"Contrainte tangentielle",{"$f":"Detail_des_effets!AM127+Detail_des_effets!AM179","v":{"$error":"#VALUE!"}},"MPa"]
[null,"Déformée axiale",{"$f":"Detail_des_effets!C198+Detail_des_effets!C147","v":{"v":-0.06511342094417163,"d":"-0.065"}},"mm",null,"Déformée axiale",{"$f":"Detail_des_effets!G198+Detail_des_effets!G147","v":{"v":-0.06511342094417163,"d":"-0.065"}},"mm",null,"Déformée axiale",{"$f":"Detail_des_effets!K198+Detail_des_effets!K147","v":{"v":-0.06511342094417163,"d":"-0.065"}},"mm",null,"Déformée axiale",{"$f":"Detail_des_effets!O198+Detail_des_effets!O147","v":{"v":-0.06511342094417163,"d":"-0.065"}},"mm",null,"Déformée axiale",{"$f":"Detail_des_effets!S198+Detail_des_effets!S147","v":{"v":-0.06511342094417163,"d":"-0.065"}},"mm",null,"Déformée axiale",{"$f":"Detail_des_effets!W198+Detail_des_effets!W147","v":{"v":-0.06511342094417163,"d":"-0.065"}},"mm",null,"Déformée axiale",{"$f":"Detail_des_effets!AA198+Detail_des_effets!AA147","v":{"v":-0.06511342094417163,"d":"-0.065"}},"mm",null,"Déformée axiale",{"$f":"Detail_des_effets!AE198+Detail_des_effets!AE147","v":{"v":-0.06511342094417163,"d":"-0.065"}},"mm",null,"Déformée axiale",{"$f":"Detail_des_effets!AI198+Detail_des_effets!AI147","v":{"v":-0.06511342094417163,"d":"-0.065"}},"mm",null,"Déformée axiale",{"$f":"Detail_des_effets!AM198+Detail_des_effets!AM147","v":{"v":-0.06511342094417163,"d":"-0.065"}},"mm"]
[null,"Déformée radiale",{"$f":"Detail_des_effets!C199+Detail_des_effets!C180+Detail_des_effets!C148","v":{"$error":"#VALUE!"}},"mm",null,"Déformée radiale",{"$f":"Detail_des_effets!G199+Detail_des_effets!G180+Detail_des_effets!G148","v":{"$error":"#VALUE!"}},"mm",null,"Déformée radiale",{"$f":"Detail_des_effets!K199+Detail_des_effets!K180+Detail_des_effets!K148","v":{"$error":"#VALUE!"}},"mm",null,"Déformée radiale",{"$f":"Detail_des_effets!O199+Detail_des_effets!O180+Detail_des_effets!O148","v":{"$error":"#VALUE!"}},"mm",null,"Déformée radiale",{"$f":"Detail_des_effets!S199+Detail_des_effets!S180+Detail_des_effets!S148","v":{"$error":"#VALUE!"}},"mm",null,"Déformée radiale",{"$f":"Detail_des_effets!W199+Detail_des_effets!W180+Detail_des_effets!W148","v":{"$error":"#VALUE!"}},"mm",null,"Déformée radiale",{"$f":"Detail_des_effets!AA199+Detail_des_effets!AA180+Detail_des_effets!AA148","v":{"$error":"#VALUE!"}},"mm",null,"Déformée radiale",{"$f":"Detail_des_effets!AE199+Detail_des_effets!AE180+Detail_des_effets!AE148","v":{"$error":"#VALUE!"}},"mm",null,"Déformée radiale",{"$f":"Detail_des_effets!AI199+Detail_des_effets!AI180+Detail_des_effets!AI148","v":{"$error":"#VALUE!"}},"mm",null,"Déformée radiale",{"$f":"Detail_des_effets!AM199+Detail_des_effets!AM180+Detail_des_effets!AM148","v":{"$error":"#VALUE!"}},"mm"]
[]
[]
[null,"Résultats des effets conjugués par pièce en fonctionnement"]
[]
[null,"Nom :",{"$f":"C11","v":"Pièce mâle"},null,null,"Nom :",{"$f":"G11","v":"Pièce mâle"},null,null,"Nom :",{"$f":"K11","v":"Pièce mâle"},null,null,"Nom :",{"$f":"O11","v":"Pièce mâle"},null,null,"Nom :",{"$f":"S11","v":"Pièce mâle"},null,null,"Nom :",{"$f":"W11","v":"Pièce mâle"},null,null,"Nom :",{"$f":"AA11","v":"Pièce mâle"},null,null,"Nom :",{"$f":"AE11","v":"Pièce mâle"},null,null,"Nom :",{"$f":"AI11","v":"Pièce mâle"},null,null,"Nom :",{"$f":"AM11","v":"Pièce mâle"}]
[null,"Au niveau du frettage",{"$nulls":3},"Au niveau du frettage",{"$nulls":3},"Au niveau du frettage",{"$nulls":3},"Au niveau du frettage",{"$nulls":3},"Au niveau du frettage",{"$nulls":3},"Au niveau du frettage",{"$nulls":3},"Au niveau du frettage",{"$nulls":3},"Au niveau du frettage",{"$nulls":3},"Au niveau du frettage",{"$nulls":3},"Au niveau du frettage"]
[null,"Contrainte axiale",{"$f":"Detail_des_effets!C48","v":{"v":122.23099629457562,"d":"122.23"}},"MPa",null,"Contrainte axiale",{"$f":"Detail_des_effets!G48","v":{"v":122.23099629457562,"d":"122.23"}},"MPa",null,"Contrainte axiale",{"$f":"Detail_des_effets!K48","v":{"v":122.23099629457562,"d":"122.23"}},"MPa",null,"Contrainte axiale",{"$f":"Detail_des_effets!O48","v":{"v":122.23099629457562,"d":"122.23"}},"MPa",null,"Contrainte axiale",{"$f":"Detail_des_effets!S48","v":{"v":122.23099629457562,"d":"122.23"}},"MPa",null,"Contrainte axiale",{"$f":"Detail_des_effets!W48","v":{"v":122.23099629457562,"d":"122.23"}},"MPa",null,"Contrainte axiale",{"$f":"Detail_des_effets!AA48","v":{"v":122.23099629457562,"d":"122.23"}},"MPa",null,"Contrainte axiale",{"$f":"Detail_des_effets!AE48","v":{"v":122.23099629457562,"d":"122.23"}},"MPa",null,"Contrainte axiale",{"$f":"Detail_des_effets!AI48","v":{"v":122.23099629457562,"d":"122.23"}},"MPa",null,"Contrainte axiale",{"$f":"Detail_des_effets!AM48","v":{"v":122.23099629457562,"d":"122.23"}},"MPa"]
[null,"Contrainte radiale",{"$f":"Detail_des_effets!C8+Detail_des_effets!C18+Detail_des_effets!C81","v":{"$error":"#VALUE!"}},"MPa",null,"Contrainte radiale",{"$f":"Detail_des_effets!G8+Detail_des_effets!G18+Detail_des_effets!G81","v":{"$error":"#VALUE!"}},"MPa",null,"Contrainte radiale",{"$f":"Detail_des_effets!K8+Detail_des_effets!K18+Detail_des_effets!K81","v":{"$error":"#VALUE!"}},"MPa",null,"Contrainte radiale",{"$f":"Detail_des_effets!O8+Detail_des_effets!O18+Detail_des_effets!O81","v":{"$error":"#VALUE!"}},"MPa",null,"Contrainte radiale",{"$f":"Detail_des_effets!S8+Detail_des_effets!S18+Detail_des_effets!S81","v":{"$error":"#VALUE!"}},"MPa",null,"Contrainte radiale",{"$f":"Detail_des_effets!W8+Detail_des_effets!W18+Detail_des_effets!W81","v":{"$error":"#VALUE!"}},"MPa",null,"Contrainte radiale",{"$f":"Detail_des_effets!AA8+Detail_des_effets!AA18+Detail_des_effets!AA81","v":{"$error":"#VALUE!"}},"MPa",null,"Contrainte radiale",{"$f":"Detail_des_effets!AE8+Detail_des_effets!AE18+Detail_des_effets!AE81","v":{"$error":"#VALUE!"}},"MPa",null,"Contrainte radiale",{"$f":"Detail_des_effets!AI8+Detail_des_effets!AI18+Detail_des_effets!AI81","v":{"$error":"#VALUE!"}},"MPa",null,"Contrainte radiale",{"$f":"Detail_des_effets!AM8+Detail_des_effets!AM18+Detail_des_effets!AM81","v":{"$error":"#VALUE!"}},"MPa"]
[null,"Contrainte tangentielle",{"$f":"Detail_des_effets!C9+Detail_des_effets!C19+Detail_des_effets!C82","v":{"$error":"#VALUE!"}},"MPa",null,"Contrainte tangentielle",{"$f":"Detail_des_effets!G9+Detail_des_effets!G19+Detail_des_effets!G82","v":{"$error":"#VALUE!"}},"MPa",null,"Contrainte tangentielle",{"$f":"Detail_des_effets!K9+Detail_des_effets!K19+Detail_des_effets!K82","v":{"$error":"#VALUE!"}},"MPa",null,"Contrainte tangentielle",{"$f":"Detail_des_effets!O9+Detail_des_effets!O19+Detail_des_effets!O82","v":{"$error":"#VALUE!"}},"MPa",null,"Contrainte tangentielle",{"$f":"Detail_des_effets!S9+Detail_des_effets!S19+Detail_des_effets!S82","v":{"$error":"#VALUE!"}},"MPa",null,"Contrainte tangentielle",{"$f":"Detail_des_effets!W9+Detail_des_effets!W19+Detail_des_effets!W82","v":{"$error":"#VALUE!"}},"MPa",null,"Contrainte tangentielle",{"$f":"Detail_des_effets!AA9+Detail_des_effets!AA19+Detail_des_effets!AA82","v":{"$error":"#VALUE!"}},"MPa",null,"Contrainte tangentielle",{"$f":"Detail_des_effets!AE9+Detail_des_effets!AE19+Detail_des_effets!AE82","v":{"$error":"#VALUE!"}},"MPa",null,"Contrainte tangentielle",{"$f":"Detail_des_effets!AI9+Detail_des_effets!AI19+Detail_des_effets!AI82","v":{"$error":"#VALUE!"}},"MPa",null,"Contrainte tangentielle",{"$f":"Detail_des_effets!AM9+Detail_des_effets!AM19+Detail_des_effets!AM82","v":{"$error":"#VALUE!"}},"MPa"]
[null,"Déformée axiale",{"$f":"Detail_des_effets!C49+Detail_des_effets!C99","v":{"v":-0.07606356375184702,"d":"-0.076"}},"mm",null,"Déformée axiale",{"$f":"Detail_des_effets!G49+Detail_des_effets!G99","v":{"v":-0.07606356375184702,"d":"-0.076"}},"mm",null,"Déformée axiale",{"$f":"Detail_des_effets!K49+Detail_des_effets!K99","v":{"v":-0.07606356375184702,"d":"-0.076"}},"mm",null,"Déformée axiale",{"$f":"Detail_des_effets!O49+Detail_des_effets!O99","v":{"v":-0.07606356375184702,"d":"-0.076"}},"mm",null,"Déformée axiale",{"$f":"Detail_des_effets!S49+Detail_des_effets!S99","v":{"v":-0.07606356375184702,"d":"-0.076"}},"mm",null,"Déformée axiale",{"$f":"Detail_des_effets!W49+Detail_des_effets!W99","v":{"v":-0.07606356375184702,"d":"-0.076"}},"mm",null,"Déformée axiale",{"$f":"Detail_des_effets!AA49+Detail_des_effets!AA99","v":{"v":-0.07606356375184702,"d":"-0.076"}},"mm",null,"Déformée axiale",{"$f":"Detail_des_effets!AE49+Detail_des_effets!AE99","v":{"v":-0.07606356375184702,"d":"-0.076"}},"mm",null,"Déformée axiale",{"$f":"Detail_des_effets!AI49+Detail_des_effets!AI99","v":{"v":-0.07606356375184702,"d":"-0.076"}},"mm",null,"Déformée axiale",{"$f":"Detail_des_effets!AM49+Detail_des_effets!AM99","v":{"v":-0.07606356375184702,"d":"-0.076"}},"mm"]
[null,"Déformée radiale",{"$f":"Detail_des_effets!C10+Detail_des_effets!C20+Detail_des_effets!C50+Detail_des_effets!C83","v":{"$error":"#VALUE!"}},"mm",null,"Déformée radiale",{"$f":"Detail_des_effets!G10+Detail_des_effets!G20+Detail_des_effets!G50+Detail_des_effets!G83","v":{"$error":"#VALUE!"}},"mm",null,"Déformée radiale",{"$f":"Detail_des_effets!K10+Detail_des_effets!K20+Detail_des_effets!K50+Detail_des_effets!K83","v":{"$error":"#VALUE!"}},"mm",null,"Déformée radiale",{"$f":"Detail_des_effets!O10+Detail_des_effets!O20+Detail_des_effets!O50+Detail_des_effets!O83","v":{"$error":"#VALUE!"}},"mm",null,"Déformée radiale",{"$f":"Detail_des_effets!S10+Detail_des_effets!S20+Detail_des_effets!S50+Detail_des_effets!S83","v":{"$error":"#VALUE!"}},"mm",null,"Déformée radiale",{"$f":"Detail_des_effets!W10+Detail_des_effets!W20+Detail_des_effets!W50+Detail_des_effets!W83","v":{"$error":"#VALUE!"}},"mm",null,"Déformée radiale",{"$f":"Detail_des_effets!AA10+Detail_des_effets!AA20+Detail_des_effets!AA50+Detail_des_effets!AA83","v":{"$error":"#VALUE!"}},"mm",null,"Déformée radiale",{"$f":"Detail_des_effets!AE10+Detail_des_effets!AE20+Detail_des_effets!AE50+Detail_des_effets!AE83","v":{"$error":"#VALUE!"}},"mm",null,"Déformée radiale",{"$f":"Detail_des_effets!AI10+Detail_des_effets!AI20+Detail_des_effets!AI50+Detail_des_effets!AI83","v":{"$error":"#VALUE!"}},"mm",null,"Déformée radiale",{"$f":"Detail_des_effets!AM10+Detail_des_effets!AM20+Detail_des_effets!AM50+Detail_des_effets!AM83","v":{"$error":"#VALUE!"}},"mm"]
[null,"Dans la pièce, au diamètre particulier",{"$nulls":3},"Dans la pièce, au diamètre particulier",{"$nulls":3},"Dans la pièce, au diamètre particulier",{"$nulls":3},"Dans la pièce, au diamètre particulier",{"$nulls":3},"Dans la pièce, au diamètre particulier",{"$nulls":3},"Dans la pièce, au diamètre particulier",{"$nulls":3},"Dans la pièce, au diamètre particulier",{"$nulls":3},"Dans la pièce, au diamètre particulier",{"$nulls":3},"Dans la pièce, au diamètre particulier",{"$nulls":3},"Dans la pièce, au diamètre particulier"]
[null,"Contrainte axiale",{"$f":"Detail_des_effets!C52","v":{"v":122.23099629457562,"d":"122.23"}},"MPa",null,"Contrainte axiale",{"$f":"Detail_des_effets!G52","v":{"v":122.23099629457562,"d":"122.23"}},"MPa",null,"Contrainte axiale",{"$f":"Detail_des_effets!K52","v":{"v":122.23099629457562,"d":"122.23"}},"MPa",null,"Contrainte axiale",{"$f":"Detail_des_effets!O52","v":{"v":122.23099629457562,"d":"122.23"}},"MPa",null,"Contrainte axiale",{"$f":"Detail_des_effets!S52","v":{"v":122.23099629457562,"d":"122.23"}},"MPa",null,"Contrainte axiale",{"$f":"Detail_des_effets!W52","v":{"v":122.23099629457562,"d":"122.23"}},"MPa",null,"Contrainte axiale",{"$f":"Detail_des_effets!AA52","v":{"v":122.23099629457562,"d":"122.23"}},"MPa",null,"Contrainte axiale",{"$f":"Detail_des_effets!AE52","v":{"v":122.23099629457562,"d":"122.23"}},"MPa",null,"Contrainte axiale",{"$f":"Detail_des_effets!AI52","v":{"v":122.23099629457562,"d":"122.23"}},"MPa",null,"Contrainte axiale",{"$f":"Detail_des_effets!AM52","v":{"v":122.23099629457562,"d":"122.23"}},"MPa"]
[null,"Contrainte radiale",{"$f":"Detail_des_effets!C12+Detail_des_effets!C22+Detail_des_effets!C85","v":{"$error":"#VALUE!"}},"MPa",null,"Contrainte radiale",{"$f":"Detail_des_effets!G12+Detail_des_effets!G22+Detail_des_effets!G85","v":{"$error":"#VALUE!"}},"MPa",null,"Contrainte radiale",{"$f":"Detail_des_effets!K12+Detail_des_effets!K22+Detail_des_effets!K85","v":{"$error":"#VALUE!"}},"MPa",null,"Contrainte radiale",{"$f":"Detail_des_effets!O12+Detail_des_effets!O22+Detail_des_effets!O85","v":{"$error":"#VALUE!"}},"MPa",null,"Contrainte radiale",{"$f":"Detail_des_effets!S12+Detail_des_effets!S22+Detail_des_effets!S85","v":{"$error":"#VALUE!"}},"MPa",null,"Contrainte radiale",{"$f":"Detail_des_effets!W12+Detail_des_effets!W22+Detail_des_effets!W85","v":{"$error":"#VALUE!"}},"MPa",null,"Contrainte radiale",{"$f":"Detail_des_effets!AA12+Detail_des_effets!AA22+Detail_des_effets!AA85","v":{"$error":"#VALUE!"}},"MPa",null,"Contrainte radiale",{"$f":"Detail_des_effets!AE12+Detail_des_effets!AE22+Detail_des_effets!AE85","v":{"$error":"#VALUE!"}},"MPa",null,"Contrainte radiale",{"$f":"Detail_des_effets!AI12+Detail_des_effets!AI22+Detail_des_effets!AI85","v":{"$error":"#VALUE!"}},"MPa",null,"Contrainte radiale",{"$f":"Detail_des_effets!AM12+Detail_des_effets!AM22+Detail_des_effets!AM85","v":{"$error":"#VALUE!"}},"MPa"]
[null,"Contrainte tangentielle",{"$f":"Detail_des_effets!C13+Detail_des_effets!C23+Detail_des_effets!C86","v":{"$error":"#VALUE!"}},"MPa",null,"Contrainte tangentielle",{"$f":"Detail_des_effets!G13+Detail_des_effets!G23+Detail_des_effets!G86","v":{"$error":"#VALUE!"}},"MPa",null,"Contrainte tangentielle",{"$f":"Detail_des_effets!K13+Detail_des_effets!K23+Detail_des_effets!K86","v":{"$error":"#VALUE!"}},"MPa",null,"Contrainte tangentielle",{"$f":"Detail_des_effets!O13+Detail_des_effets!O23+Detail_des_effets!O86","v":{"$error":"#VALUE!"}},"MPa",null,"Contrainte tangentielle",{"$f":"Detail_des_effets!S13+Detail_des_effets!S23+Detail_des_effets!S86","v":{"$error":"#VALUE!"}},"MPa",null,"Contrainte tangentielle",{"$f":"Detail_des_effets!W13+Detail_des_effets!W23+Detail_des_effets!W86","v":{"$error":"#VALUE!"}},"MPa",null,"Contrainte tangentielle",{"$f":"Detail_des_effets!AA13+Detail_des_effets!AA23+Detail_des_effets!AA86","v":{"$error":"#VALUE!"}},"MPa",null,"Contrainte tangentielle",{"$f":"Detail_des_effets!AE13+Detail_des_effets!AE23+Detail_des_effets!AE86","v":{"$error":"#VALUE!"}},"MPa",null,"Contrainte tangentielle",{"$f":"Detail_des_effets!AI13+Detail_des_effets!AI23+Detail_des_effets!AI86","v":{"$error":"#VALUE!"}},"MPa",null,"Contrainte tangentielle",{"$f":"Detail_des_effets!AM13+Detail_des_effets!AM23+Detail_des_effets!AM86","v":{"$error":"#VALUE!"}},"MPa"]
[null,"Déformée axiale",{"$f":"Detail_des_effets!C53+Detail_des_effets!C102","v":{"v":-0.07606356375184702,"d":"-0.076"}},"mm",null,"Déformée axiale",{"$f":"Detail_des_effets!G53+Detail_des_effets!G102","v":{"v":-0.07606356375184702,"d":"-0.076"}},"mm",null,"Déformée axiale",{"$f":"Detail_des_effets!K53+Detail_des_effets!K102","v":{"v":-0.07606356375184702,"d":"-0.076"}},"mm",null,"Déformée axiale",{"$f":"Detail_des_effets!O53+Detail_des_effets!O102","v":{"v":-0.07606356375184702,"d":"-0.076"}},"mm",null,"Déformée axiale",{"$f":"Detail_des_effets!S53+Detail_des_effets!S102","v":{"v":-0.07606356375184702,"d":"-0.076"}},"mm",null,"Déformée axiale",{"$f":"Detail_des_effets!W53+Detail_des_effets!W102","v":{"v":-0.07606356375184702,"d":"-0.076"}},"mm",null,"Déformée axiale",{"$f":"Detail_des_effets!AA53+Detail_des_effets!AA102","v":{"v":-0.07606356375184702,"d":"-0.076"}},"mm",null,"Déformée axiale",{"$f":"Detail_des_effets!AE53+Detail_des_effets!AE102","v":{"v":-0.07606356375184702,"d":"-0.076"}},"mm",null,"Déformée axiale",{"$f":"Detail_des_effets!AI53+Detail_des_effets!AI102","v":{"v":-0.07606356375184702,"d":"-0.076"}},"mm",null,"Déformée axiale",{"$f":"Detail_des_effets!AM53+Detail_des_effets!AM102","v":{"v":-0.07606356375184702,"d":"-0.076"}},"mm"]
[null,"Déformée radiale",{"$f":"Detail_des_effets!C14+Detail_des_effets!C24+Detail_des_effets!C50+Detail_des_effets!C83+Detail_des_effets!C100","v":{"$error":"#VALUE!"}},"mm",null,"Déformée radiale",{"$f":"Detail_des_effets!G14+Detail_des_effets!G24+Detail_des_effets!G50+Detail_des_effets!G83+Detail_des_effets!G100","v":{"$error":"#VALUE!"}},"mm",null,"Déformée radiale",{"$f":"Detail_des_effets!K14+Detail_des_effets!K24+Detail_des_effets!K50+Detail_des_effets!K83+Detail_des_effets!K100","v":{"$error":"#VALUE!"}},"mm",null,"Déformée radiale",{"$f":"Detail_des_effets!O14+Detail_des_effets!O24+Detail_des_effets!O50+Detail_des_effets!O83+Detail_des_effets!O100","v":{"$error":"#VALUE!"}},"mm",null,"Déformée radiale",{"$f":"Detail_des_effets!S14+Detail_des_effets!S24+Detail_des_effets!S50+Detail_des_effets!S83+Detail_des_effets!S100","v":{"$error":"#VALUE!"}},"mm",null,"Déformée radiale",{"$f":"Detail_des_effets!W14+Detail_des_effets!W24+Detail_des_effets!W50+Detail_des_effets!W83+Detail_des_effets!W100","v":{"$error":"#VALUE!"}},"mm",null,"Déformée radiale",{"$f":"Detail_des_effets!AA14+Detail_des_effets!AA24+Detail_des_effets!AA50+Detail_des_effets!AA83+Detail_des_effets!AA100","v":{"$error":"#VALUE!"}},"mm",null,"Déformée radiale",{"$f":"Detail_des_effets!AE14+Detail_des_effets!AE24+Detail_des_effets!AE50+Detail_des_effets!AE83+Detail_des_effets!AE100","v":{"$error":"#VALUE!"}},"mm",null,"Déformée radiale",{"$f":"Detail_des_effets!AI14+Detail_des_effets!AI24+Detail_des_effets!AI50+Detail_des_effets!AI83+Detail_des_effets!AI100","v":{"$error":"#VALUE!"}},"mm",null,"Déformée radiale",{"$f":"Detail_des_effets!AM14+Detail_des_effets!AM24+Detail_des_effets!AM50+Detail_des_effets!AM83+Detail_des_effets!AM100","v":{"$error":"#VALUE!"}},"mm"]
[]
[null,"Nom :",{"$f":"C31","v":"Pièce femelle"},null,null,"Nom :",{"$f":"G31","v":"Pièce femelle"},null,null,"Nom :",{"$f":"K31","v":"Pièce femelle"},null,null,"Nom :",{"$f":"O31","v":"Pièce femelle"},null,null,"Nom :",{"$f":"S31","v":"Pièce femelle"},null,null,"Nom :",{"$f":"W31","v":"Pièce femelle"},null,null,"Nom :",{"$f":"AA31","v":"Pièce femelle"},null,null,"Nom :",{"$f":"AE31","v":"Pièce femelle"},null,null,"Nom :",{"$f":"AI31","v":"Pièce femelle"},null,null,"Nom :",{"$f":"AM31","v":"Pièce femelle"}]
[null,"Au niveau du frettage",{"$nulls":3},"Au niveau du frettage",{"$nulls":3},"Au niveau du frettage",{"$nulls":3},"Au niveau du frettage",{"$nulls":3},"Au niveau du frettage",{"$nulls":3},"Au niveau du frettage",{"$nulls":3},"Au niveau du frettage",{"$nulls":3},"Au niveau du frettage",{"$nulls":3},"Au niveau du frettage",{"$nulls":3},"Au niveau du frettage"]
[null,"Contrainte axiale",{"$f":"Detail_des_effets!C152","v":{"v":277.7977188513082,"d":"277.80"}},"MPa",null,"Contrainte axiale",{"$f":"Detail_des_effets!G152","v":{"v":277.7977188513082,"d":"277.80"}},"MPa",null,"Contrainte axiale",{"$f":"Detail_des_effets!K152","v":{"v":277.7977188513082,"d":"277.80"}},"MPa",null,"Contrainte axiale",{"$f":"Detail_des_effets!O152","v":{"v":277.7977188513082,"d":"277.80"}},"MPa",null,"Contrainte axiale",{"$f":"Detail_des_effets!S152","v":{"v":277.7977188513082,"d":"277.80"}},"MPa",null,"Contrainte axiale",{"$f":"Detail_des_effets!W152","v":{"v":277.7977188513082,"d":"277.80"}},"MPa",null,"Contrainte axiale",{"$f":"Detail_des_effets!AA152","v":{"v":277.7977188513082,"d":"277.80"}},"MPa",null,"Contrainte axiale",{"$f":"Detail_des_effets!AE152","v":{"v":277.7977188513082,"d":"277.80"}},"MPa",null,"Contrainte axiale",{"$f":"Detail_des_effets!AI152","v":{"v":277.7977188513082,"d":"277.80"}},"MPa",null,"Contrainte axiale",{"$f":"Detail_des_effets!AM152","v":{"v":277.7977188513082,"d":"277.80"}},"MPa"]
[null,"Contrainte radiale",{"$f":"Detail_des_effets!C112+Detail_des_effets!C122+Detail_des_effets!C185","v":{"$error":"#VALUE!"}},"MPa",null,"Contrainte radiale",{"$f":"Detail_des_effets!G112+Detail_des_effets!G122+Detail_des_effets!G185","v":{"$error":"#VALUE!"}},"MPa",null,"Contrainte radiale",{"$f":"Detail_des_effets!K112+Detail_des_effets!K122+Detail_des_effets!K185","v":{"$error":"#VALUE!"}},"MPa",null,"Contrainte radiale",{"$f":"Detail_des_effets!O112+Detail_des_effets!O122+Detail_des_effets!O185","v":{"$error":"#VALUE!"}},"MPa",null,"Contrainte radiale",{"$f":"Detail_des_effets!S112+Detail_des_effets!S122+Detail_des_effets!S185","v":{"$error":"#VALUE!"}},"MPa",null,"Contrainte radiale",{"$f":"Detail_des_effets!W112+Detail_des_effets!W122+Detail_des_effets!W185","v":{"$error":"#VALUE!"}},"MPa",null,"Contrainte radiale",{"$f":"Detail_des_effets!AA112+Detail_des_effets!AA122+Detail_des_effets!AA185","v":{"$error":"#VALUE!"}},"MPa",null,"Contrainte radiale",{"$f":"Detail_des_effets!AE112+Detail_des_effets!AE122+Detail_des_effets!AE185","v":{"$error":"#VALUE!"}},"MPa",null,"Contrainte radiale",{"$f":"Detail_des_effets!AI112+Detail_des_effets!AI122+Detail_des_effets!AI185","v":{"$error":"#VALUE!"}},"MPa",null,"Contrainte radiale",{"$f":"Detail_des_effets!AM112+Detail_des_effets!AM122+Detail_des_effets!AM185","v":{"$error":"#VALUE!"}},"MPa"]
[null,"Contrainte tangentielle",{"$f":"Detail_des_effets!C113+Detail_des_effets!C123+Detail_des_effets!C186","v":{"$error":"#VALUE!"}},"MPa",null,"Contrainte tangentielle",{"$f":"Detail_des_effets!G113+Detail_des_effets!G123+Detail_des_effets!G186","v":{"$error":"#VALUE!"}},"MPa",null,"Contrainte tangentielle",{"$f":"Detail_des_effets!K113+Detail_des_effets!K123+Detail_des_effets!K186","v":{"$error":"#VALUE!"}},"MPa",null,"Contrainte tangentielle",{"$f":"Detail_des_effets!O113+Detail_des_effets!O123+Detail_des_effets!O186","v":{"$error":"#VALUE!"}},"MPa",null,"Contrainte tangentielle",{"$f":"Detail_des_effets!S113+Detail_des_effets!S123+Detail_des_effets!S186","v":{"$error":"#VALUE!"}},"MPa",null,"Contrainte tangentielle",{"$f":"Detail_des_effets!W113+Detail_des_effets!W123+Detail_des_effets!W186","v":{"$error":"#VALUE!"}},"MPa",null,"Contrainte tangentielle",{"$f":"Detail_des_effets!AA113+Detail_des_effets!AA123+Detail_des_effets!AA186","v":{"$error":"#VALUE!"}},"MPa",null,"Contrainte tangentielle",{"$f":"Detail_des_effets!AE113+Detail_des_effets!AE123+Detail_des_effets!AE186","v":{"$error":"#VALUE!"}},"MPa",null,"Contrainte tangentielle",{"$f":"Detail_des_effets!AI113+Detail_des_effets!AI123+Detail_des_effets!AI186","v":{"$error":"#VALUE!"}},"MPa",null,"Contrainte tangentielle",{"$f":"Detail_des_effets!AM113+Detail_des_effets!AM123+Detail_des_effets!AM186","v":{"$error":"#VALUE!"}},"MPa"]
[null,"Déformée axiale",{"$f":"Detail_des_effets!C153+Detail_des_effets!C203","v":{"v":-0.038309866934197745,"d":"-0.038"}},"mm",null,"Déformée axiale",{"$f":"Detail_des_effets!G153+Detail_des_effets!G203","v":{"v":-0.038309866934197745,"d":"-0.038"}},"mm",null,"Déformée axiale",{"$f":"Detail_des_effets!K153+Detail_des_effets!K203","v":{"v":-0.038309866934197745,"d":"-0.038"}},"mm",null,"Déformée axiale",{"$f":"Detail_des_effets!O153+Detail_des_effets!O203","v":{"v":-0.038309866934197745,"d":"-0.038"}},"mm",null,"Déformée axiale",{"$f":"Detail_des_effets!S153+Detail_des_effets!S203","v":{"v":-0.038309866934197745,"d":"-0.038"}},"mm",null,"Déformée axiale",{"$f":"Detail_des_effets!W153+Detail_des_effets!W203","v":{"v":-0.038309866934197745,"d":"-0.038"}},"mm",null,"Déformée axiale",{"$f":"Detail_des_effets!AA153+Detail_des_effets!AA203","v":{"v":-0.038309866934197745,"d":"-0.038"}},"mm",null,"Déformée axiale",{"$f":"Detail_des_effets!AE153+Detail_des_effets!AE203","v":{"v":-0.038309866934197745,"d":"-0.038"}},"mm",null,"Déformée axiale",{"$f":"Detail_des_effets!AI153+Detail_des_effets!AI203","v":{"v":-0.038309866934197745,"d":"-0.038"}},"mm",null,"Déformée axiale",{"$f":"Detail_des_effets!AM153+Detail_des_effets!AM203","v":{"v":-0.038309866934197745,"d":"-0.038"}},"mm"]
[null,"Déformée radiale",{"$f":"Detail_des_effets!C114+Detail_des_effets!C124+Detail_des_effets!C154+Detail_des_effets!C187+Detail_des_effets!C204","v":{"$error":"#VALUE!"}},"mm",null,"Déformée radiale",{"$f":"Detail_des_effets!G114+Detail_des_effets!G124+Detail_des_effets!G154+Detail_des_effets!G187+Detail_des_effets!G204","v":{"$error":"#VALUE!"}},"mm",null,"Déformée radiale",{"$f":"Detail_des_effets!K114+Detail_des_effets!K124+Detail_des_effets!K154+Detail_des_effets!K187+Detail_des_effets!K204","v":{"$error":"#VALUE!"}},"mm",null,"Déformée radiale",{"$f":"Detail_des_effets!O114+Detail_des_effets!O124+Detail_des_effets!O154+Detail_des_effets!O187+Detail_des_effets!O204","v":{"$error":"#VALUE!"}},"mm",null,"Déformée radiale",{"$f":"Detail_des_effets!S114+Detail_des_effets!S124+Detail_des_effets!S154+Detail_des_effets!S187+Detail_des_effets!S204","v":{"$error":"#VALUE!"}},"mm",null,"Déformée radiale",{"$f":"Detail_des_effets!W114+Detail_des_effets!W124+Detail_des_effets!W154+Detail_des_effets!W187+Detail_des_effets!W204","v":{"$error":"#VALUE!"}},"mm",null,"Déformée radiale",{"$f":"Detail_des_effets!AA114+Detail_des_effets!AA124+Detail_des_effets!AA154+Detail_des_effets!AA187+Detail_des_effets!AA204","v":{"$error":"#VALUE!"}},"mm",null,"Déformée radiale",{"$f":"Detail_des_effets!AE114+Detail_des_effets!AE124+Detail_des_effets!AE154+Detail_des_effets!AE187+Detail_des_effets!AE204","v":{"$error":"#VALUE!"}},"mm",null,"Déformée radiale",{"$f":"Detail_des_effets!AI114+Detail_des_effets!AI124+Detail_des_effets!AI154+Detail_des_effets!AI187+Detail_des_effets!AI204","v":{"$error":"#VALUE!"}},"mm",null,"Déformée radiale",{"$f":"Detail_des_effets!AM114+Detail_des_effets!AM124+Detail_des_effets!AM154+Detail_des_effets!AM187+Detail_des_effets!AM204","v":{"$error":"#VALUE!"}},"mm"]
[null,"Dans la pièce, au diamètre particulier",{"$nulls":3},"Dans la pièce, au diamètre particulier",{"$nulls":3},"Dans la pièce, au diamètre particulier",{"$nulls":3},"Dans la pièce, au diamètre particulier",{"$nulls":3},"Dans la pièce, au diamètre particulier",{"$nulls":3},"Dans la pièce, au diamètre particulier",{"$nulls":3},"Dans la pièce, au diamètre particulier",{"$nulls":3},"Dans la pièce, au diamètre particulier",{"$nulls":3},"Dans la pièce, au diamètre particulier",{"$nulls":3},"Dans la pièce, au diamètre particulier"]
[null,"Contrainte axiale",{"$f":"Detail_des_effets!C152","v":{"v":277.7977188513082,"d":"277.80"}},"MPa",null,"Contrainte axiale",{"$f":"Detail_des_effets!G152","v":{"v":277.7977188513082,"d":"277.80"}},"MPa",null,"Contrainte axiale",{"$f":"Detail_des_effets!K152","v":{"v":277.7977188513082,"d":"277.80"}},"MPa",null,"Contrainte axiale",{"$f":"Detail_des_effets!O152","v":{"v":277.7977188513082,"d":"277.80"}},"MPa",null,"Contrainte axiale",{"$f":"Detail_des_effets!S152","v":{"v":277.7977188513082,"d":"277.80"}},"MPa",null,"Contrainte axiale",{"$f":"Detail_des_effets!W152","v":{"v":277.7977188513082,"d":"277.80"}},"MPa",null,"Contrainte axiale",{"$f":"Detail_des_effets!AA152","v":{"v":277.7977188513082,"d":"277.80"}},"MPa",null,"Contrainte axiale",{"$f":"Detail_des_effets!AE152","v":{"v":277.7977188513082,"d":"277.80"}},"MPa",null,"Contrainte axiale",{"$f":"Detail_des_effets!AI152","v":{"v":277.7977188513082,"d":"277.80"}},"MPa",null,"Contrainte axiale",{"$f":"Detail_des_effets!AM152","v":{"v":277.7977188513082,"d":"277.80"}},"MPa"]
[null,"Contrainte radiale",{"$f":"Detail_des_effets!C116+Detail_des_effets!C126+Detail_des_effets!C185","v":{"$error":"#VALUE!"}},"MPa",null,"Contrainte radiale",{"$f":"Detail_des_effets!G116+Detail_des_effets!G126+Detail_des_effets!G185","v":{"$error":"#VALUE!"}},"MPa",null,"Contrainte radiale",{"$f":"Detail_des_effets!K116+Detail_des_effets!K126+Detail_des_effets!K185","v":{"$error":"#VALUE!"}},"MPa",null,"Contrainte radiale",{"$f":"Detail_des_effets!O116+Detail_des_effets!O126+Detail_des_effets!O185","v":{"$error":"#VALUE!"}},"MPa",null,"Contrainte radiale",{"$f":"Detail_des_effets!S116+Detail_des_effets!S126+Detail_des_effets!S185","v":{"$error":"#VALUE!"}},"MPa",null,"Contrainte radiale",{"$f":"Detail_des_effets!W116+Detail_des_effets!W126+Detail_des_effets!W185","v":{"$error":"#VALUE!"}},"MPa",null,"Contrainte radiale",{"$f":"Detail_des_effets!AA116+Detail_des_effets!AA126+Detail_des_effets!AA185","v":{"$error":"#VALUE!"}},"MPa",null,"Contrainte radiale",{"$f":"Detail_des_effets!AE116+Detail_des_effets!AE126+Detail_des_effets!AE185","v":{"$error":"#VALUE!"}},"MPa",null,"Contrainte radiale",{"$f":"Detail_des_effets!AI116+Detail_des_effets!AI126+Detail_des_effets!AI185","v":{"$error":"#VALUE!"}},"MPa",null,"Contrainte radiale",{"$f":"Detail_des_effets!AM116+Detail_des_effets!AM126+Detail_des_effets!AM185","v":{"$error":"#VALUE!"}},"MPa"]
[null,"Contrainte tangentielle",{"$f":"Detail_des_effets!C117+Detail_des_effets!C127+Detail_des_effets!C186","v":{"$error":"#VALUE!"}},"MPa",null,"Contrainte tangentielle",{"$f":"Detail_des_effets!G117+Detail_des_effets!G127+Detail_des_effets!G186","v":{"$error":"#VALUE!"}},"MPa",null,"Contrainte tangentielle",{"$f":"Detail_des_effets!K117+Detail_des_effets!K127+Detail_des_effets!K186","v":{"$error":"#VALUE!"}},"MPa",null,"Contrainte tangentielle",{"$f":"Detail_des_effets!O117+Detail_des_effets!O127+Detail_des_effets!O186","v":{"$error":"#VALUE!"}},"MPa",null,"Contrainte tangentielle",{"$f":"Detail_des_effets!S117+Detail_des_effets!S127+Detail_des_effets!S186","v":{"$error":"#VALUE!"}},"MPa",null,"Contrainte tangentielle",{"$f":"Detail_des_effets!W117+Detail_des_effets!W127+Detail_des_effets!W186","v":{"$error":"#VALUE!"}},"MPa",null,"Contrainte tangentielle",{"$f":"Detail_des_effets!AA117+Detail_des_effets!AA127+Detail_des_effets!AA186","v":{"$error":"#VALUE!"}},"MPa",null,"Contrainte tangentielle",{"$f":"Detail_des_effets!AE117+Detail_des_effets!AE127+Detail_des_effets!AE186","v":{"$error":"#VALUE!"}},"MPa",null,"Contrainte tangentielle",{"$f":"Detail_des_effets!AI117+Detail_des_effets!AI127+Detail_des_effets!AI186","v":{"$error":"#VALUE!"}},"MPa",null,"Contrainte tangentielle",{"$f":"Detail_des_effets!AM117+Detail_des_effets!AM127+Detail_des_effets!AM186","v":{"$error":"#VALUE!"}},"MPa"]
[null,"Déformée axiale",{"$f":"Detail_des_effets!C203+Detail_des_effets!C153","v":{"v":-0.038309866934197745,"d":"-0.038"}},"mm",null,"Déformée axiale",{"$f":"Detail_des_effets!G203+Detail_des_effets!G153","v":{"v":-0.038309866934197745,"d":"-0.038"}},"mm",null,"Déformée axiale",{"$f":"Detail_des_effets!K203+Detail_des_effets!K153","v":{"v":-0.038309866934197745,"d":"-0.038"}},"mm",null,"Déformée axiale",{"$f":"Detail_des_effets!O203+Detail_des_effets!O153","v":{"v":-0.038309866934197745,"d":"-0.038"}},"mm",null,"Déformée axiale",{"$f":"Detail_des_effets!S203+Detail_des_effets!S153","v":{"v":-0.038309866934197745,"d":"-0.038"}},"mm",null,"Déformée axiale",{"$f":"Detail_des_effets!W203+Detail_des_effets!W153","v":{"v":-0.038309866934197745,"d":"-0.038"}},"mm",null,"Déformée axiale",{"$f":"Detail_des_effets!AA203+Detail_des_effets!AA153","v":{"v":-0.038309866934197745,"d":"-0.038"}},"mm",null,"Déformée axiale",{"$f":"Detail_des_effets!AE203+Detail_des_effets!AE153","v":{"v":-0.038309866934197745,"d":"-0.038"}},"mm",null,"Déformée axiale",{"$f":"Detail_des_effets!AI203+Detail_des_effets!AI153","v":{"v":-0.038309866934197745,"d":"-0.038"}},"mm",null,"Déformée axiale",{"$f":"Detail_des_effets!AM203+Detail_des_effets!AM153","v":{"v":-0.038309866934197745,"d":"-0.038"}},"mm"]
[null,"Déformée radiale",{"$f":"Detail_des_effets!C118+Detail_des_effets!C128+Detail_des_effets!C158+Detail_des_effets!C191+Detail_des_effets!C207","v":{"$error":"#VALUE!"}},"mm",null,"Déformée radiale",{"$f":"Detail_des_effets!G118+Detail_des_effets!G128+Detail_des_effets!G158+Detail_des_effets!G191+Detail_des_effets!G207","v":{"$error":"#VALUE!"}},"mm",null,"Déformée radiale",{"$f":"Detail_des_effets!K118+Detail_des_effets!K128+Detail_des_effets!K158+Detail_des_effets!K191+Detail_des_effets!K207","v":{"$error":"#VALUE!"}},"mm",null,"Déformée radiale",{"$f":"Detail_des_effets!O118+Detail_des_effets!O128+Detail_des_effets!O158+Detail_des_effets!O191+Detail_des_effets!O207","v":{"$error":"#VALUE!"}},"mm",null,"Déformée radiale",{"$f":"Detail_des_effets!S118+Detail_des_effets!S128+Detail_des_effets!S158+Detail_des_effets!S191+Detail_des_effets!S207","v":{"$error":"#VALUE!"}},"mm",null,"Déformée radiale",{"$f":"Detail_des_effets!W118+Detail_des_effets!W128+Detail_des_effets!W158+Detail_des_effets!W191+Detail_des_effets!W207","v":{"$error":"#VALUE!"}},"mm",null,"Déformée radiale",{"$f":"Detail_des_effets!AA118+Detail_des_effets!AA128+Detail_des_effets!AA158+Detail_des_effets!AA191+Detail_des_effets!AA207","v":{"$error":"#VALUE!"}},"mm",null,"Déformée radiale",{"$f":"Detail_des_effets!AE118+Detail_des_effets!AE128+Detail_des_effets!AE158+Detail_des_effets!AE191+Detail_des_effets!AE207","v":{"$error":"#VALUE!"}},"mm",null,"Déformée radiale",{"$f":"Detail_des_effets!AI118+Detail_des_effets!AI128+Detail_des_effets!AI158+Detail_des_effets!AI191+Detail_des_effets!AI207","v":{"$error":"#VALUE!"}},"mm",null,"Déformée radiale",{"$f":"Detail_des_effets!AM118+Detail_des_effets!AM128+Detail_des_effets!AM158+Detail_des_effets!AM191+Detail_des_effets!AM207","v":{"$error":"#VALUE!"}},"mm"]
[]
[]
[]
[]
[]
["Effort d'emmanchement au montage",null,{"$f":"IF((C55*Detail_des_effets!C161*PI()*Empilage!C15*MIN(Empilage!C13,Empilage!C33))<=0,0,C55*Detail_des_effets!C161*PI()*Empilage!C15*MIN(Empilage!C13,Empilage!C33))","v":{"$error":"#VALUE!"}},"N","Effort d'emmanchement au montage",null,{"$f":"IF((G55*Detail_des_effets!G161*PI()*Empilage!G15*MIN(Empilage!G13,Empilage!G33))<=0,0,G55*Detail_des_effets!G161*PI()*Empilage!G15*MIN(Empilage!G13,Empilage!G33))","v":{"$error":"#VALUE!"}},"N","Effort d'emmanchement au montage",null,{"$f":"IF((K55*Detail_des_effets!K161*PI()*Empilage!K15*MIN(Empilage!K13,Empilage!K33))<=0,0,K55*Detail_des_effets!K161*PI()*Empilage!K15*MIN(Empilage!K13,Empilage!K33))","v":{"$error":"#VALUE!"}},"N","Effort d'emmanchement au montage",null,{"$f":"IF((O55*Detail_des_effets!O161*PI()*Empilage!O15*MIN(Empilage!O13,Empilage!O33))<=0,0,O55*Detail_des_effets!O161*PI()*Empilage!O15*MIN(Empilage!O13,Empilage!O33))","v":{"$error":"#VALUE!"}},"N","Effort d'emmanchement au montage",null,{"$f":"IF((S55*Detail_des_effets!S161*PI()*Empilage!S15*MIN(Empilage!S13,Empilage!S33))<=0,0,S55*Detail_des_effets!S161*PI()*Empilage!S15*MIN(Empilage!S13,Empilage!S33))","v":{"$error":"#VALUE!"}},"N","Effort d'emmanchement au montage",null,{"$f":"IF((W55*Detail_des_effets!W161*PI()*Empilage!W15*MIN(Empilage!W13,Empilage!W33))<=0,0,W55*Detail_des_effets!W161*PI()*Empilage!W15*MIN(Empilage!W13,Empilage!W33))","v":{"$error":"#VALUE!"}},"N","Effort d'emmanchement au montage",null,{"$f":"IF((AA55*Detail_des_effets!AA161*PI()*Empilage!AA15*MIN(Empilage!AA13,Empilage!AA33))<=0,0,AA55*Detail_des_effets!AA161*PI()*Empilage!AA15*MIN(Empilage!AA13,Empilage!AA33))","v":{"$error":"#VALUE!"}},"N","Effort d'emmanchement au montage",null,{"$f":"IF((AE55*Detail_des_effets!AE161*PI()*Empilage!AE15*MIN(Empilage!AE13,Empilage!AE33))<=0,0,AE55*Detail_des_effets!AE161*PI()*Empilage!AE15*MIN(Empilage!AE13,Empilage!AE33))","v":{"$error":"#VALUE!"}},"N","Effort d'emmanchement au montage",null,{"$f":"IF((AI55*Detail_des_effets!AI161*PI()*Empilage!AI15*MIN(Empilage!AI13,Empilage!AI33))<=0,0,AI55*Detail_des_effets!AI161*PI()*Empilage!AI15*MIN(Empilage!AI13,Empilage!AI33))","v":{"$error":"#VALUE!"}},"N","Effort d'emmanchement au montage",null,{"$f":"IF((AM55*Detail_des_effets!AM161*PI()*Empilage!AM15*MIN(Empilage!AM13,Empilage!AM33))<=0,0,AM55*Detail_des_effets!AM161*PI()*Empilage!AM15*MIN(Empilage!AM13,Empilage!AM33))","v":{"$error":"#VALUE!"}},"N"]
["Pression effective en fonctionnement",null,"Empilage!/Empilage!/(Constantes_de_frettage!-Constantes_de_frettage!) * 0.001","MPa","Pression effective en fonctionnement",null,"Empilage!/Empilage!/(Constantes_de_frettage!-Constantes_de_frettage!) * 0.001","MPa","Pression effective en fonctionnement",null,"Empilage!/Empilage!/(Constantes_de_frettage!-Constantes_de_frettage!) * 0.001","MPa","Pression effective en fonctionnement",null,"Empilage!/Empilage!/(Constantes_de_frettage!-Constantes_de_frettage!) * 0.001","MPa","Pression effective en fonctionnement",null,"Empilage!/Empilage!/(Constantes_de_frettage!-Constantes_de_frettage!) * 0.001","MPa","Pression effective en fonctionnement",null,"Empilage!/Empilage!/(Constantes_de_frettage!-Constantes_de_frettage!) * 0.001","MPa","Pression effective en fonctionnement",null,"Empilage!/Empilage!/(Constantes_de_frettage!-Constantes_de_frettage!) * 0.001","MPa","Pression effective en fonctionnement",null,"Empilage!/Empilage!/(Constantes_de_frettage!-Constantes_de_frettage!) * 0.001","MPa","Pression effective en fonctionnement",null,"Empilage!/Empilage!/(Constantes_de_frettage!-Constantes_de_frettage!) * 0.001","MPa","Pression effective en fonctionnement",null,"Empilage!/Empilage!/(Constantes_de_frettage!-Constantes_de_frettage!) * 0.001","MPa"]
["Jeu/frettage effectif en fonctionnement",null,{"$f":"IF((C29+(Detail_des_effets!C10+Detail_des_effets!C20+Detail_des_effets!C50+Detail_des_effets!C100-Detail_des_effets!C114-Detail_des_effets!C124-Detail_des_effets!C154-Detail_des_effets!C204)*1000)>0,C29+(Detail_des_effets!C10+Detail_des_effets!C20+Detail_des_effets!C50+Detail_des_effets!C100-Detail_des_effets!C114-Detail_des_effets!C124-Detail_des_effets!C154-Detail_des_effets!C204)*1000,0)","v":{"v":175.5480098120168,"d":"175.5"}},"micron","Jeu/frettage effectif en fonctionnement",null,{"$f":"IF((G29+(Detail_des_effets!G10+Detail_des_effets!G20+Detail_des_effets!G50+Detail_des_effets!G100-Detail_des_effets!G114-Detail_des_effets!G124-Detail_des_effets!G154-Detail_des_effets!G204)*1000)>0,G29+(Detail_des_effets!G10+Detail_des_effets!G20+Detail_des_effets!G50+Detail_des_effets!G100-Detail_des_effets!G114-Detail_des_effets!G124-Detail_des_effets!G154-Detail_des_effets!G204)*1000,0)","v":{"v":175.5480098120168,"d":"175.5"}},"micron","Jeu/frettage effectif en fonctionnement",null,{"$f":"IF((K29+(Detail_des_effets!K10+Detail_des_effets!K20+Detail_des_effets!K50+Detail_des_effets!K100-Detail_des_effets!K114-Detail_des_effets!K124-Detail_des_effets!K154-Detail_des_effets!K204)*1000)>0,K29+(Detail_des_effets!K10+Detail_des_effets!K20+Detail_des_effets!K50+Detail_des_effets!K100-Detail_des_effets!K114-Detail_des_effets!K124-Detail_des_effets!K154-Detail_des_effets!K204)*1000,0)","v":{"v":175.5480098120168,"d":"175.5"}},"micron","Jeu/frettage effectif en fonctionnement",null,{"$f":"IF((O29+(Detail_des_effets!O10+Detail_des_effets!O20+Detail_des_effets!O50+Detail_des_effets!O100-Detail_des_effets!O114-Detail_des_effets!O124-Detail_des_effets!O154-Detail_des_effets!O204)*1000)>0,O29+(Detail_des_effets!O10+Detail_des_effets!O20+Detail_des_effets!O50+Detail_des_effets!O100-Detail_des_effets!O114-Detail_des_effets!O124-Detail_des_effets!O154-Detail_des_effets!O204)*1000,0)","v":{"v":175.5480098120168,"d":"175.5"}},"micron","Jeu/frettage effectif en fonctionnement",null,{"$f":"IF((S29+(Detail_des_effets!S10+Detail_des_effets!S20+Detail_des_effets!S50+Detail_des_effets!S100-Detail_des_effets!S114-Detail_des_effets!S124-Detail_des_effets!S154-Detail_des_effets!S204)*1000)>0,S29+(Detail_des_effets!S10+Detail_des_effets!S20+Detail_des_effets!S50+Detail_des_effets!S100-Detail_des_effets!S114-Detail_des_effets!S124-Detail_des_effets!S154-Detail_des_effets!S204)*1000,0)","v":{"v":175.5480098120168,"d":"175.5"}},"micron","Jeu/frettage effectif en fonctionnement",null,{"$f":"IF((W29+(Detail_des_effets!W10+Detail_des_effets!W20+Detail_des_effets!W50+Detail_des_effets!W100-Detail_des_effets!W114-Detail_des_effets!W124-Detail_des_effets!W154-Detail_des_effets!W204)*1000)>0,W29+(Detail_des_effets!W10+Detail_des_effets!W20+Detail_des_effets!W50+Detail_des_effets!W100-Detail_des_effets!W114-Detail_des_effets!W124-Detail_des_effets!W154-Detail_des_effets!W204)*1000,0)","v":{"v":175.5480098120168,"d":"175.5"}},"micron","Jeu/frettage effectif en fonctionnement",null,{"$f":"IF((AA29+(Detail_des_effets!AA10+Detail_des_effets!AA20+Detail_des_effets!AA50+Detail_des_effets!AA100-Detail_des_effets!AA114-Detail_des_effets!AA124-Detail_des_effets!AA154-Detail_des_effets!AA204)*1000)>0,AA29+(Detail_des_effets!AA10+Detail_des_effets!AA20+Detail_des_effets!AA50+Detail_des_effets!AA100-Detail_des_effets!AA114-Detail_des_effets!AA124-Detail_des_effets!AA154-Detail_des_effets!AA204)*1000,0)","v":{"v":175.5480098120168,"d":"175.5"}},"micron","Jeu/frettage effectif en fonctionnement",null,{"$f":"IF((AE29+(Detail_des_effets!AE10+Detail_des_effets!AE20+Detail_des_effets!AE50+Detail_des_effets!AE100-Detail_des_effets!AE114-Detail_des_effets!AE124-Detail_des_effets!AE154-Detail_des_effets!AE204)*1000)>0,AE29+(Detail_des_effets!AE10+Detail_des_effets!AE20+Detail_des_effets!AE50+Detail_des_effets!AE100-Detail_des_effets!AE114-Detail_des_effets!AE124-Detail_des_effets!AE154-Detail_des_effets!AE204)*1000,0)","v":{"v":175.5480098120168,"d":"175.5"}},"micron","Jeu/frettage effectif en fonctionnement",null,{"$f":"IF((AI29+(Detail_des_effets!AI10+Detail_des_effets!AI20+Detail_des_effets!AI50+Detail_des_effets!AI100-Detail_des_effets!AI114-Detail_des_effets!AI124-Detail_des_effets!AI154-Detail_des_effets!AI204)*1000)>0,AI29+(Detail_des_effets!AI10+Detail_des_effets!AI20+Detail_des_effets!AI50+Detail_des_effets!AI100-Detail_des_effets!AI114-Detail_des_effets!AI124-Detail_des_effets!AI154-Detail_des_effets!AI204)*1000,0)","v":{"v":175.5480098120168,"d":"175.5"}},"micron","Jeu/frettage effectif en fonctionnement",null,{"$f":"IF((AM29+(Detail_des_effets!AM10+Detail_des_effets!AM20+Detail_des_effets!AM50+Detail_des_effets!AM100-Detail_des_effets!AM114-Detail_des_effets!AM124-Detail_des_effets!AM154-Detail_des_effets!AM204)*1000)>0,AM29+(Detail_des_effets!AM10+Detail_des_effets!AM20+Detail_des_effets!AM50+Detail_des_effets!AM100-Detail_des_effets!AM114-Detail_des_effets!AM124-Detail_des_effets!AM154-Detail_des_effets!AM204)*1000,0)","v":{"v":175.5480098120168,"d":"175.5"}},"micron"]
["Effet de fond",null,{"$f":"C42","v":{"v":0,"d":"0.0"}},"N","Effet de fond",null,{"$f":"G42","v":{"v":0,"d":"0.0"}},"N","Effet de fond",null,{"$f":"K42","v":{"v":0,"d":"0.0"}},"N","Effet de fond",null,{"$f":"O42","v":{"v":0,"d":"0.0"}},"N","Effet de fond",null,{"$f":"S42","v":{"v":0,"d":"0.0"}},"N","Effet de fond",null,{"$f":"W42","v":{"v":0,"d":"0.0"}},"N","Effet de fond",null,{"$f":"AA42","v":{"v":0,"d":"0.0"}},"N","Effet de fond",null,{"$f":"AE42","v":{"v":0,"d":"0.0"}},"N","Effet de fond",null,{"$f":"AI42","v":{"v":0,"d":"0.0"}},"N","Effet de fond",null,{"$f":"AM42","v":{"v":0,"d":"0.0"}},"N"]
["Résultat jeu/frette",null,{"$f":"IF(C29<=0,\"Attention frettage non désiré\",IF(C199=0,\"Incertain\",IF(C199>0,\"Maintien frette assuré\",\"Défrettage\")))","v":"Maintien frette assuré"},null,"Résultat jeu/frette",null,{"$f":"IF(G29<=0,\"Attention frettage non désiré\",IF(G199=0,\"Incertain\",IF(G199>0,\"Maintien frette assuré\",\"Défrettage\")))","v":"Maintien frette assuré"},null,"Résultat jeu/frette",null,{"$f":"IF(K29<=0,\"Attention frettage non désiré\",IF(K199=0,\"Incertain\",IF(K199>0,\"Maintien frette assuré\",\"Défrettage\")))","v":"Maintien frette assuré"},null,"Résultat jeu/frette",null,{"$f":"IF(O29<=0,\"Attention frettage non désiré\",IF(O199=0,\"Incertain\",IF(O199>0,\"Maintien frette assuré\",\"Défrettage\")))","v":"Maintien frette assuré"},null,"Résultat jeu/frette",null,{"$f":"IF(S29<=0,\"Attention frettage non désiré\",IF(S199=0,\"Incertain\",IF(S199>0,\"Maintien frette assuré\",\"Défrettage\")))","v":"Maintien frette assuré"},null,"Résultat jeu/frette",null,{"$f":"IF(W29<=0,\"Attention frettage non désiré\",IF(W199=0,\"Incertain\",IF(W199>0,\"Maintien frette assuré\",\"Défrettage\")))","v":"Maintien frette assuré"},null,"Résultat jeu/frette",null,{"$f":"IF(AA29<=0,\"Attention frettage non désiré\",IF(AA199=0,\"Incertain\",IF(AA199>0,\"Maintien frette assuré\",\"Défrettage\")))","v":"Maintien frette assuré"},null,"Résultat jeu/frette",null,{"$f":"IF(AE29<=0,\"Attention frettage non désiré\",IF(AE199=0,\"Incertain\",IF(AE199>0,\"Maintien frette assuré\",\"Défrettage\")))","v":"Maintien frette assuré"},null,"Résultat jeu/frette",null,{"$f":"IF(AI29<=0,\"Attention frettage non désiré\",IF(AI199=0,\"Incertain\",IF(AI199>0,\"Maintien frette assuré\",\"Défrettage\")))","v":"Maintien frette assuré"},null,"Résultat jeu/frette",null,{"$f":"IF(AM29<=0,\"Attention frettage non désiré\",IF(AM199=0,\"Incertain\",IF(AM199>0,\"Maintien frette assuré\",\"Défrettage\")))","v":"Maintien frette assuré"}]
["Effort d'emmanchement en fonctionnement",null,{"$f":"C55*Detail_des_effets!C183*PI()*Empilage!C15*MIN(Empilage!C13,Empilage!C33)","v":{"$error":"#VALUE!"}},"N","Effort d'emmanchement en fonctionnement",null,{"$f":"G55*Detail_des_effets!G183*PI()*Empilage!G15*MIN(Empilage!G13,Empilage!G33)","v":{"$error":"#VALUE!"}},"N","Effort d'emmanchement en fonctionnement",null,{"$f":"K55*Detail_des_effets!K183*PI()*Empilage!K15*MIN(Empilage!K13,Empilage!K33)","v":{"$error":"#VALUE!"}},"N","Effort d'emmanchement en fonctionnement",null,{"$f":"O55*Detail_des_effets!O183*PI()*Empilage!O15*MIN(Empilage!O13,Empilage!O33)","v":{"$error":"#VALUE!"}},"N","Effort d'emmanchement en fonctionnement",null,{"$f":"S55*Detail_des_effets!S183*PI()*Empilage!S15*MIN(Empilage!S13,Empilage!S33)","v":{"$error":"#VALUE!"}},"N","Effort d'emmanchement en fonctionnement",null,{"$f":"W55*Detail_des_effets!W183*PI()*Empilage!W15*MIN(Empilage!W13,Empilage!W33)","v":{"$error":"#VALUE!"}},"N","Effort d'emmanchement en fonctionnement",null,{"$f":"AA55*Detail_des_effets!AA183*PI()*Empilage!AA15*MIN(Empilage!AA13,Empilage!AA33)","v":{"$error":"#VALUE!"}},"N","Effort d'emmanchement en fonctionnement",null,{"$f":"AE55*Detail_des_effets!AE183*PI()*Empilage!AE15*MIN(Empilage!AE13,Empilage!AE33)","v":{"$error":"#VALUE!"}},"N","Effort d'emmanchement en fonctionnement",null,{"$f":"AI55*Detail_des_effets!AI183*PI()*Empilage!AI15*MIN(Empilage!AI13,Empilage!AI33)","v":{"$error":"#VALUE!"}},"N","Effort d'emmanchement en fonctionnement",null,{"$f":"AM55*Detail_des_effets!AM183*PI()*Empilage!AM15*MIN(Empilage!AM13,Empilage!AM33)","v":{"$error":"#VALUE!"}},"N"]
[]
["Effort maximum d'emmanchement d'un empilage axial en série (montage) :",{"$nulls":4},{"$f":"SUMPRODUCT(197:197)","v":{"$error":"#VALUE!"}},"N"]
["Effort maximum d'emmanchement d'un empilage axial en parallèle (montage) :",{"$nulls":4},{"$f":"MAX(197:197)","v":{"$error":"#VALUE!"}},"N"]
[]
["Effort maximum d'emmanchement d'un empilage axial en série (fonc.) :",{"$nulls":4},{"$f":"SUMPRODUCT(202:202)","v":{"$error":"#VALUE!"}},"N"]
["Effort maximum d'emmanchement d'un empilage axial en parallèle (fonc.) :",{"$nulls":4},{"$f":"MAX(202:202)","v":{"$error":"#VALUE!"}},"N"]
[]
[]
[]
[{"$nulls":5},"VARIATION D'EFFORT DU AU SERRAGE A L'ALLONGEMENT AU MONTAGE"]
[]
[null,null,"Montage nominal",null,"Montage Effort -5%",null,null,"Montage Effort +5%"]
["Re mini Tirant Montage",null,{"$f":"VLOOKUP(C12,Matériaux!$C$4:$AB$15,24)","v":{"v":100.6992686,"d":"101"}},"daN/mm2",0.95,null,null,1.05]
["Sigma Maxi fut Montage (0,85 Re)",null,{"$f":"C215*0.85","v":{"v":85.59437831,"d":"86"}},"daN/mm2",null,{"$f":"F217/C21","v":{"v":81.3146593945,"d":"81"}},"daN/mm2",null,{"$f":"I217/C21","v":{"v":89.87409722550001,"d":"90"}},"daN/mm2","soit",{"$f":"I216/C215","v":{"v":0.8925000000000001,"d":"0.893"}},"% de Re ","Marge mini au montage",null,{"$f":"(C215-I216)/C215%","v":{"v":10.749999999999988,"d":"10.8"}},"%"]
["F  Maxi Tirant Montage (0,85 Re)",null,{"$f":"C21*C216","v":{"v":32999.322378003264,"d":"32999"}},"daN",null,{"$f":"F218*C60","v":{"v":31349.3562591031,"d":"31349"}},"daN",null,{"$f":"I218*C60","v":{"v":34649.28849690343,"d":"34649"}},"daN"]
["Delta L Tirant au montage",null,{"$f":"C217/C60","v":{"v":0.2181795682176611,"d":"0.218"}},"mm",null,{"$f":"C218*E215","v":{"v":0.20727058980677804,"d":"0.207"}},"mm",null,{"$f":"C218*H215","v":{"v":0.22908854662854417,"d":"0.229"}},"mm"]
["Effort résiduel après montage",null,{"$f":"(C217/C60)/(1/C60+1/C62)","v":{"v":9428.377822286646,"d":"9428"}},"daN",null,{"$f":"(F217/C60)/(1/C60+1/C62)","v":{"v":8956.958931172314,"d":"8957"}},"daN",null,{"$f":"(I217/C60)/(1/C60+1/C62)","v":{"v":9899.79671340098,"d":"9900"}},"daN"]
["Delta_L Tirant après Montage",null,{"$f":"C219/C60","v":{"v":0.06233701949076031,"d":"0.062"}},"mm",null,{"$f":"F219/C60","v":{"v":0.05922016851622229,"d":"0.059"}},"mm",null,{"$f":"I219/C60","v":{"v":0.06545387046529832,"d":"0.065"}},"mm"]
["Delta_L Serrées après Montage",null,{"$f":"-(C219/C62)","v":{"v":-0.1558425487269008,"d":"-0.156"}},"mm",null,{"$f":"-(F219/C62)","v":{"v":-0.14805042129055576,"d":"-0.148"}},"mm",null,{"$f":"-(I219/C62)","v":{"v":-0.16363467616324587,"d":"-0.164"}},"mm"]
["Sigma Maxi fut après Montage",null,{"$f":"C219/C21","v":{"v":24.455536659999996,"d":"24.46"}},"daN/mm2",null,{"$f":"F219/C21","v":{"v":23.232759827,"d":"23.23"}},"daN/mm2",null,{"$f":"I219/C21","v":{"v":25.678313493,"d":"25.68"}},"daN/mm2",null,null,"Marge mini après montage",null,null,{"$f":"(C215-I222)/C215%","v":{"v":74.49999999999999,"d":"74.5"}},"%"]
["Vérification Delta L",null,{"$f":"IF(C220-C221=C218,\"OK\",\"ERREUR\")","v":"OK"},null,null,{"$f":"IF(F220-F221=F218,\"OK\",\"ERREUR\")","v":"OK"},null,null,{"$f":"IF(I220-I221=I218,\"OK\",\"ERREUR\")","v":"OK"}]
[]
[{"$nulls":5},"VARIATION D'EFFORT DU AU SERRAGE A L'ALLONGEMENT EN MEF"]
[]
[null,null,"Montage nominal en MeF",null,"Montage Effort -5%",null,null,"Montage Effort +5%"]
["Effort fictif résiduel après Montage",null,{"$f":"(C233/C68)/((1/C68)+(1/C71))","v":{"v":1579.1642844990963,"d":"1579"}},"daN",null,{"$f":"(F233/C68)/(1/C68+1/C71)","v":{"v":1500.2060702741414,"d":"1500"}},"daN",null,{"$f":"(I233/C68)/(1/C68+1/C71)","v":{"v":1658.1224987240512,"d":"1658"}},"daN"]
["Variation de serrage en MeF",null,{"$f":"((C70-C67)*C66)/(1/C68+1/C71)","v":0},"daN"]
["Effort en fin de mise en froid ",null,{"$f":"C228+C229","v":{"v":1579.1642844990963,"d":"1579"}},"daN","mini",{"$f":"(C228*0.95)+C229","v":{"v":1500.2060702741414,"d":"1500"}},"daN","maxi",{"$f":"(C228*1.05)+C229","v":{"v":1658.1224987240512,"d":"1658"}},"daN"]
["Re mini Tirant MeF",null,{"$f":"VLOOKUP(C12,Matériaux!$C$4:$AB$15,25)","v":{"v":125.29159999999999,"d":"125"}},"daN/mm2",0.95,null,null,1.05]
["Sigma Maxi fut MeF (0,85 Re)",null,{"$f":"C231*0.85","v":{"v":106.49785999999999,"d":"106"}},"daN/mm2",null,{"$f":"F233/C21","v":{"v":101.17296699999999,"d":"101"}},"daN/mm2",null,{"$f":"I233/C21","v":{"v":111.82275299999999,"d":"112"}},"daN/mm2","soit",{"$f":"I232/C231","v":{"v":0.8925000000000001,"d":"0.893"}},"% de Re","Marge mini au montage",null,{"$f":"(C231-I232)/C215%","v":{"v":13.375317603846028,"d":"13.4"}},"%"]
["F Maxi Tirant MeF (0,85 Re)",null,{"$f":"C21*C232","v":{"v":41058.271396976495,"d":"41058"}},"daN",null,{"$f":"F234*C68","v":{"v":39005.35782712767,"d":"39005"}},"daN",null,{"$f":"I234*C68","v":{"v":43111.18496682532,"d":"43111"}},"daN"]
["Delta L Tirant MeF",null,{"$f":"C233/C68","v":{"v":0.025469401080050826,"d":"0.025"}},"mm",null,{"$f":"C234*E231","v":{"v":0.024195931026048285,"d":"0.024"}},"mm",null,{"$f":"C234*H231","v":{"v":0.026742871134053367,"d":"0.027"}},"mm"]
["Delta L Tirant après MeF",null,{"$f":"C228/C68","v":{"v":9.7959234923272439E-4,"d":"0.001"}},"mm",null,{"$f":"F228/C68","v":{"v":9.306127317710881E-4,"d":"0.001"}},"mm",null,{"$f":"I228/C68","v":{"v":1.0285719666943607E-3,"d":"0.001"}},"mm"]
["Delta_L Serrées après MeF",null,{"$f":"-(C228/C71)","v":{"v":-0.024489808730818106,"d":"-0.024"}},"mm",null,{"$f":"-(F228/C71)","v":{"v":-0.0232653182942772,"d":"-0.023"}},"mm",null,{"$f":"-(I228/C71)","v":{"v":-0.025714299167359015,"d":"-0.026"}},"mm"]
["Sigma Maxi fut après MeF",null,{"$f":"C228/C21","v":{"v":4.096071538461539,"d":"4.10"}},"daN/mm2",null,{"$f":"F228/C21","v":{"v":3.8912679615384618,"d":"3.89"}},"daN/mm2",null,{"$f":"I228/C21","v":{"v":4.300875115384616,"d":"4.30"}},"daN/mm2",null,null,"Marge mini après montage",null,null,{"$f":"(C231-I237)/C231%","v":{"v":96.5673076923077,"d":"96.6"}},"%"]
["Vérification Delta L",null,{"$f":"IF(C235-C236=C234,\"OK\",\"ERREUR\")","v":"OK"},null,null,{"$f":"IF(F235-F236=F234,\"OK\",\"ERREUR\")","v":"OK"},null,null,{"$f":"IF(I235-I236=I234,\"OK\",\"ERREUR\")","v":"OK"}]
[]
[]
[{"$nulls":5},"VARIATION D'EFFORT DU AU SERRAGE A L'ALLONGEMENT EN FONCTIONNEMENT"]
[]
[null,null,"Montage nominal en fonctionnement",null,"Montage Effort -5%",null,null,"Montage Effort +5%"]
["Effort fictif résiduel après MeF",null,{"$f":"(C249/C77)/((1/C77)+(1/C80))","v":{"v":1467.5566448868676,"d":"1468"}},"daN",null,{"$f":"(F249/C77)/(1/C77+1/C80)","v":{"v":1394.1788126425245,"d":"1394"}},"daN",null,{"$f":"(I249/C77)/(1/C77+1/C80)","v":{"v":1540.9344771312112,"d":"1541"}},"daN"]
["Variation de serrage en fonctionnement",null,{"$f":"((C79-C76)*C75)/(1/C77+1/C80)","v":0},"daN"]
["Effort en fonctionnement",null,{"$f":"C244+C245","v":{"v":1467.5566448868676,"d":"1468"}},"daN","mini",{"$f":"(C244*0.95)+C245","v":{"v":1394.1788126425242,"d":"1394"}},"daN","maxi",{"$f":"(C244*1.05)+C245","v":{"v":1540.934477131211,"d":"1541"}},"daN"]
["Re mini Tirant fonctionnement",null,{"$f":"VLOOKUP(C12,Matériaux!$C$4:$AB$15,26)","v":{"v":116.4366,"d":"116"}},"daN/mm2",0.95,null,null,1.05]
["Sigma Maxi fut fonctionnement (0,85 Re)",null,{"$f":"C247*0.85","v":{"v":98.97111,"d":"99"}},"daN/mm2",null,{"$f":"F249/C21","v":{"v":94.0225545,"d":"94"}},"daN/mm2",null,{"$f":"I249/C21","v":{"v":103.91966550000001,"d":"104"}},"daN/mm2","soit",{"$f":"I248/C247","v":{"v":0.8925000000000001,"d":"0.893"}},"% de Re","Marge mini au montage",null,{"$f":"(C247-I248)/C231%","v":{"v":9.990242362616481,"d":"10.0"}},"%"]
["F Maxi Tirant fonctionnement (0,85 Re)",null,{"$f":"C21*C248","v":{"v":38156.472767058556,"d":"38156"}},"daN",null,{"$f":"F250*C77","v":{"v":36248.64912870563,"d":"36249"}},"daN",null,{"$f":"I250*C77","v":{"v":40064.296405411485,"d":"40064"}},"daN"]
["Delta L Tirant fonctionnement",null,{"$f":"C249/C77","v":{"v":0.024018795403262204,"d":"0.024"}},"mm",null,{"$f":"C250*E247","v":{"v":0.022817855633099092,"d":"0.023"}},"mm",null,{"$f":"C250*H247","v":{"v":0.025219735173425316,"d":"0.025"}},"mm"]
["Delta L Tirant après fonctionnement",null,{"$f":"C244/C77","v":{"v":9.2379982320239253E-4,"d":"0.001"}},"mm",null,{"$f":"F244/C77","v":{"v":8.7760983204227309E-4,"d":"0.001"}},"mm",null,{"$f":"I244/C77","v":{"v":9.6998981436251231E-4,"d":"0.001"}},"mm"]
["Delta_L Serrées après fonctionnement",null,{"$f":"-(C244/C80)","v":{"v":-0.02309499558005981,"d":"-0.023"}},"mm",null,{"$f":"-(F244/C80)","v":{"v":-0.021940245801056822,"d":"-0.022"}},"mm",null,{"$f":"-(I244/C80)","v":{"v":-0.0242497453590628,"d":"-0.024"}},"mm"]
["Sigma Maxi fut après fonctionnement",null,{"$f":"C244/C21","v":{"v":3.806581153846154,"d":"3.81"}},"daN/mm2",null,{"$f":"F244/C21","v":{"v":3.616252096153847,"d":"3.62"}},"daN/mm2",null,{"$f":"I244/C21","v":{"v":3.9969102115384625,"d":"4.00"}},"daN/mm2",null,null,"Marge mini après montage",null,null,{"$f":"(C247-I253)/C247%","v":{"v":96.5673076923077,"d":"96.6"}},"%"]
["Vérification Delta L",null,{"$f":"IF(C251-C252=C250,\"OK\",\"ERREUR\")","v":"OK"},null,null,{"$f":"IF(F251-F252=F250,\"OK\",\"ERREUR\")","v":"OK"},null,null,{"$f":"IF(I251-I252=I250,\"OK\",\"ERREUR\")","v":"OK"}]

{"sheet":"Detail_des_effets","index":2,"n_rows":207,"n_cols":40,"rows_kept":207,"merged":[[3,2,3,3],[3,6,3,7],[3,10,3,11],[3,14,3,15],[3,18,3,19],[3,22,3,23],[3,26,3,27],[3,30,3,31],[3,34,3,35],[3,38,3,39],[4,1,5,3],[4,5,5,7],[4,9,5,11],[4,13,5,15],[4,17,5,19],[4,21,5,23],[4,25,5,27],[4,29,5,31],[4,33,5,35],[4,37,5,39],[6,1,6,3],[6,5,6,7],[6,9,6,11],[6,13,6,15],[6,17,6,19],[6,21,6,23],[6,25,6,27],[6,29,6,31],[6,33,6,35],[6,37,6,39],[14,1,15,3],[14,5,15,7],[14,9,15,11],[14,13,15,15],[14,17,15,19],[14,21,15,23],[14,25,15,27],[14,29,15,31],[14,33,15,35],[14,37,15,39],[16,1,16,3],[16,5,16,7],[16,9,16,11],[16,13,16,15],[16,17,16,19],[16,21,16,23],[16,25,16,27],[16,29,16,31],[16,33,16,35],[16,37,16,39],[24,1,25,3],[24,5,25,7],[24,9,25,11],[24,13,25,15],[24,17,25,19],[24,21,25,23],[24,25,25,27],[24,29,25,31],[24,33,25,35],[24,37,25,39],[26,1,26,3],[26,5,26,7],[26,9,26,11],[26,13,26,15],[26,17,26,19],[26,21,26,23],[26,25,26,27],[26,29,26,31],[26,33,26,35],[26,37,26,39],[34,1,35,3],[34,5,35,7],[34,9,35,11],[34,13,35,15],[34,17,35,19],[34,21,35,23],[34,25,35,27],[34,29,35,31],[34,33,35,35],[34,37,35,39],[36,1,36,3],[36,5,36,7],[36,9,36,11],[36,13,36,15],[36,17,36,19],[36,21,36,23],[36,25,36,27],[36,29,36,31],[36,33,36,35],[36,37,36,39],[44,1,45,3],[44,5,45,7],[44,9,45,11],[44,13,45,15],[44,17,45,19],[44,21,45,23],[44,25,45,27],[44,29,45,31],[44,33,45,35],[44,37,45,39],[46,1,46,3],[46,5,46,7],[46,9,46,11],[46,13,46,15],[46,17,46,19],[46,21,46,23],[46,25,46,27],[46,29,46,31],[46,33,46,35],[46,37,46,39],[54,1,55,3],[54,5,55,7],[54,9,55,11],[54,13,55,15],[54,17,55,19],[54,21,55,23],[54,25,55,27],[54,29,55,31],[54,33,55,35],[54,37,55,39],[57,1,57,3],[57,5,57,7],[57,9,57,11],[57,13,57,15],[57,17,57,19],[57,21,57,23],[57,25,57,27],[57,29,57,31],[57,33,57,35],[57,37,57,39],[65,1,66,3],[65,5,66,7],[65,9,66,11],[65,13,66,15],[65,17,66,19],[65,21,66,23],[65,25,66,27],[65,29,66,31],[65,33,66,35],[65,37,66,39],[68,1,68,3],[68,5,68,7],[68,9,68,11],[68,13,68,15],[68,17,68,19],[68,21,68,23],[68,25,68,27],[68,29,68,31],[68,33,68,35],[68,37,68,39],[76,1,77,3],[76,5,77,7],[76,9,77,11],[76,13,77,15],[76,17,77,19],[76,21,77,23],[76,25,77,27],[76,29,77,31],[76,33,77,35],[76,37,77,39],[79,1,79,3],[79,5,79,7],[79,9,79,11],[79,13,79,15],[79,17,79,19],[79,21,79,23],[79,25,79,27],[79,29,79,31],[79,33,79,35],[79,37,79,39],[87,1,88,3],[87,5,88,7],[87,9,88,11],[87,13,88,15],[87,17,88,19],[87,21,88,23],[87,25,88,27],[87,29,88,31],[87,33,88,35],[87,37,88,39],[89,1,89,3],[89,5,89,7],[89,9,89,11],[89,13,89,15],[89,17,89,19],[89,21,89,23],[89,25,89,27],[89,29,89,31],[89,33,89,35],[89,37,89,39],[95,1,96,3],[95,5,96,7],[95,9,96,11],[95,13,96,15],[95,17,96,19],[95,21,96,23],[95,25,96,27],[95,29,96,31],[95,33,96,35],[95,37,96,39],[97,1,97,3],[97,5,97,7],[97,9,97,11],[97,13,97,15],[97,17,97,19],[97,21,97,23],[97,25,97,27],[97,29,97,31],[97,33,97,35],[97,37,97,39],[107,2,107,3],[107,6,107,7],[107,10,107,11],[107,14,107,15],[107,18,107,19],[107,22,107,23],[107,26,107,27],[107,30,107,31],[107,34,107,35],[107,38,107,39],[108,1,109,3],[108,5,109,7],[108,9,109,11],[108,13,109,15],[108,17,109,19],[108,21,109,23],[108,25,109,27],[108,29,109,31],[108,33,109,35],[108,37,109,39],[110,1,110,3],[110,5,110,7],[110,9,110,11],[110,13,110,15],[110,17,110,19],[110,21,110,23],[110,25,110,27],[110,29,110,31],[110,33,110,35],[110,37,110,39],[118,1,119,3],[118,5,119,7],[118,9,119,11],[118,13,119,15],[118,17,119,19],[118,21,119,23],[118,25,119,27],[118,29,119,31],[118,33,119,35],[118,37,119,39],[120,1,120,3],[120,5,120,7],[120,9,120,11],[120,13,120,15],[120,17,120,19],[120,21,120,23],[120,25,120,27],[120,29,120,31],[120,33,120,35],[120,37,120,39],[128,1,129,3],[128,5,129,7],[128,9,129,11],[128,13,129,15],[128,17,129,19],[128,21,129,23],[128,25,129,27],[128,29,129,31],[128,33,129,35],[128,37,129,39],[130,1,130,3],[130,5,130,7],[130,9,130,11],[130,13,130,15],[130,17,130,19],[130,21,130,23],[130,25,130,27],[130,29,130,31],[130,33,130,35],[130,37,130,39],[138,1,139,3],[138,5,139,7],[138,9,139,11],[138,13,139,15],[138,17,139,19],[138,21,139,23],[138,25,139,27],[138,29,139,31],[138,33,139,35],[138,37,139,39],[140,1,140,3],[140,5,140,7],[140,9,140,11],[140,13,140,15],[140,17,140,19],[140,21,140,23],[140,25,140,27],[140,29,140,31],[140,33,140,35],[140,37,140,39],[148,1,149,3],[148,5,149,7],[148,9,149,11],[148,13,149,15],[148,17,149,19],[148,21,149,23],[148,25,149,27],[148,29,149,31],[148,33,149,35],[148,37,149,39],[150,1,150,3],[150,5,150,7],[150,9,150,11],[150,13,150,15],[150,17,150,19],[150,21,150,23],[150,25,150,27],[150,29,150,31],[150,33,150,35],[150,37,150,39],[158,1,159,3],[158,5,159,7],[158,9,159,11],[158,13,159,15],[158,17,159,19],[158,21,159,23],[158,25,159,27],[158,29,159,31],[158,33,159,35],[158,37,159,39],[161,1,161,3],[161,5,161,7],[161,9,161,11],[161,13,161,15],[161,17,161,19],[161,21,161,23],[161,25,161,27],[161,29,161,31],[161,33,161,35],[161,37,161,39],[169,1,170,3],[169,5,170,7],[169,9,170,11],[169,13,170,15],[169,17,170,19],[169,21,170,23],[169,25,170,27],[169,29,170,31],[169,33,170,35],[169,37,170,39],[172,1,172,3],[172,5,172,7],[172,9,172,11],[172,13,172,15],[172,17,172,19],[172,21,172,23],[172,25,172,27],[172,29,172,31],[172,33,172,35],[172,37,172,39],[180,1,181,3],[180,5,181,7],[180,9,181,11],[180,13,181,15],[180,17,181,19],[180,21,181,23],[180,25,181,27],[180,29,181,31],[180,33,181,35],[180,37,181,39],[183,1,183,3],[183,5,183,7],[183,9,183,11],[183,13,183,15],[183,17,183,19],[183,21,183,23],[183,25,183,27],[183,29,183,31],[183,33,183,35],[183,37,183,39],[191,1,192,3],[191,5,192,7],[191,9,192,11],[191,13,192,15],[191,17,192,19],[191,21,192,23],[191,25,192,27],[191,29,192,31],[191,33,192,35],[191,37,192,39],[193,1,193,3],[193,5,193,7],[193,9,193,11],[193,13,193,15],[193,17,193,19],[193,21,193,23],[193,25,193,27],[193,29,193,31],[193,33,193,35],[193,37,193,39],[199,1,200,3],[199,5,200,7],[199,9,200,11],[199,13,200,15],[199,17,200,19],[199,21,200,23],[199,25,200,27],[199,29,200,31],[199,33,200,35],[199,37,200,39],[201,1,201,3],[201,5,201,7],[201,9,201,11],[201,13,201,15],[201,17,201,19],[201,21,201,23],[201,25,201,27],[201,29,201,31],[201,33,201,35],[201,37,201,39]]}
["Détails des différents effets mécaniques et thermique"]
[]
[]
[null,"Nom :",{"$f":"Empilage!C11","v":"Pièce mâle"},null,null,"Nom :",{"$f":"Empilage!G11","v":"Pièce mâle"},null,null,"Nom :",{"$f":"Empilage!K11","v":"Pièce mâle"},null,null,"Nom :",{"$f":"Empilage!O11","v":"Pièce mâle"},null,null,"Nom :",{"$f":"Empilage!S11","v":"Pièce mâle"},null,null,"Nom :",{"$f":"Empilage!W11","v":"Pièce mâle"},null,null,"Nom :",{"$f":"Empilage!AA11","v":"Pièce mâle"},null,null,"Nom :",{"$f":"Empilage!AE11","v":"Pièce mâle"},null,null,"Nom :",{"$f":"Empilage!AI11","v":"Pièce mâle"},null,null,"Nom :",{"$f":"Empilage!AM11","v":"Pièce mâle"}]
[null,"Effet de la centrifugation seule",{"$nulls":3},"Effet de la centrifugation seule",{"$nulls":3},"Effet de la centrifugation seule",{"$nulls":3},"Effet de la centrifugation seule",{"$nulls":3},"Effet de la centrifugation seule",{"$nulls":3},"Effet de la centrifugation seule",{"$nulls":3},"Effet de la centrifugation seule",{"$nulls":3},"Effet de la centrifugation seule",{"$nulls":3},"Effet de la centrifugation seule",{"$nulls":3},"Effet de la centrifugation seule"]
[]
[null,"Au niveau du frettage",{"$nulls":3},"Au niveau du frettage",{"$nulls":3},"Au niveau du frettage",{"$nulls":3},"Au niveau du frettage",{"$nulls":3},"Au niveau du frettage",{"$nulls":3},"Au niveau du frettage",{"$nulls":3},"Au niveau du frettage",{"$nulls":3},"Au niveau du frettage",{"$nulls":3},"Au niveau du frettage",{"$nulls":3},"Au niveau du frettage"]
[null,"Contrainte radiale",{"$f":"0","v":{"v":0,"d":"0.00"}},"MPa",null,"Contrainte radiale",{"$f":"0","v":{"v":0,"d":"0.00"}},"MPa",null,"Contrainte radiale",{"$f":"0","v":{"v":0,"d":"0.00"}},"MPa",null,"Contrainte radiale",{"$f":"0","v":{"v":0,"d":"0.00"}},"MPa",null,"Contrainte radiale",{"$f":"0","v":{"v":0,"d":"0.00"}},"MPa",null,"Contrainte radiale",{"$f":"0","v":{"v":0,"d":"0.00"}},"MPa",null,"Contrainte radiale",{"$f":"0","v":{"v":0,"d":"0.00"}},"MPa",null,"Contrainte radiale",{"$f":"0","v":{"v":0,"d":"0.00"}},"MPa",null,"Contrainte radiale",{"$f":"0","v":{"v":0,"d":"0.00"}},"MPa",null,"Contrainte radiale",{"$f":"0","v":{"v":0,"d":"0.00"}},"MPa"]
[null,"Contrainte tangentielle",{"$f":"10^-12*Empilage!C28*Empilage!$D$87^2/16*((3+Empilage!C27)*Empilage!C16^2+(1-Empilage!C27)*Empilage!C15^2)","v":{"v":2.2943379686585694,"d":"2.29"}},"MPa",null,"Contrainte tangentielle",{"$f":"10^-12*Empilage!G28*Empilage!$D$87^2/16*((3+Empilage!G27)*Empilage!G16^2+(1-Empilage!G27)*Empilage!G15^2)","v":{"v":2.2943379686585694,"d":"2.29"}},"MPa",null,"Contrainte tangentielle",{"$f":"10^-12*Empilage!K28*Empilage!$D$87^2/16*((3+Empilage!K27)*Empilage!K16^2+(1-Empilage!K27)*Empilage!K15^2)","v":{"v":2.2943379686585694,"d":"2.29"}},"MPa",null,"Contrainte tangentielle",{"$f":"10^-12*Empilage!O28*Empilage!$D$87^2/16*((3+Empilage!O27)*Empilage!O16^2+(1-Empilage!O27)*Empilage!O15^2)","v":{"v":2.2943379686585694,"d":"2.29"}},"MPa",null,"Contrainte tangentielle",{"$f":"10^-12*Empilage!S28*Empilage!$D$87^2/16*((3+Empilage!S27)*Empilage!S16^2+(1-Empilage!S27)*Empilage!S15^2)","v":{"v":2.2943379686585694,"d":"2.29"}},"MPa",null,"Contrainte tangentielle",{"$f":"10^-12*Empilage!W28*Empilage!$D$87^2/16*((3+Empilage!W27)*Empilage!W16^2+(1-Empilage!W27)*Empilage!W15^2)","v":{"v":2.2943379686585694,"d":"2.29"}},"MPa",null,"Contrainte tangentielle",{"$f":"10^-12*Empilage!AA28*Empilage!$D$87^2/16*((3+Empilage!AA27)*Empilage!AA16^2+(1-Empilage!AA27)*Empilage!AA15^2)","v":{"v":2.2943379686585694,"d":"2.29"}},"MPa",null,"Contrainte tangentielle",{"$f":"10^-12*Empilage!AE28*Empilage!$D$87^2/16*((3+Empilage!AE27)*Empilage!AE16^2+(1-Empilage!AE27)*Empilage!AE15^2)","v":{"v":2.2943379686585694,"d":"2.29"}},"MPa",null,"Contrainte tangentielle",{"$f":"10^-12*Empilage!AI28*Empilage!$D$87^2/16*((3+Empilage!AI27)*Empilage!AI16^2+(1-Empilage!AI27)*Empilage!AI15^2)","v":{"v":2.2943379686585694,"d":"2.29"}},"MPa",null,"Contrainte tangentielle",{"$f":"10^-12*Empilage!AM28*Empilage!$D$87^2/16*((3+Empilage!AM27)*Empilage!AM16^2+(1-Empilage!AM27)*Empilage!AM15^2)","v":{"v":2.2943379686585694,"d":"2.29"}},"MPa"]
[null,"Déformée radiale",{"$f":"(Empilage!C15/Empilage!C20*Detail_des_effets!C9)*10^-1","v":{"v":2.6413719856168539E-4,"d":"0.000"}},"mm au diamètre",null,"Déformée radiale",{"$f":"(Empilage!G15/Empilage!G20*Detail_des_effets!G9)*10^-1","v":{"v":2.6413719856168539E-4,"d":"0.000"}},"mm au diamètre",null,"Déformée radiale",{"$f":"(Empilage!K15/Empilage!K20*Detail_des_effets!K9)*10^-1","v":{"v":2.6413719856168539E-4,"d":"0.000"}},"mm au diamètre",null,"Déformée radiale",{"$f":"(Empilage!O15/Empilage!O20*Detail_des_effets!O9)*10^-1","v":{"v":2.6413719856168539E-4,"d":"0.000"}},"mm au diamètre",null,"Déformée radiale",{"$f":"(Empilage!S15/Empilage!S20*Detail_des_effets!S9)*10^-1","v":{"v":2.6413719856168539E-4,"d":"0.000"}},"mm au diamètre",null,"Déformée radiale",{"$f":"(Empilage!W15/Empilage!W20*Detail_des_effets!W9)*10^-1","v":{"v":2.6413719856168539E-4,"d":"0.000"}},"mm au diamètre",null,"Déformée radiale",{"$f":"(Empilage!AA15/Empilage!AA20*Detail_des_effets!AA9)*10^-1","v":{"v":2.6413719856168539E-4,"d":"0.000"}},"mm au diamètre",null,"Déformée radiale",{"$f":"(Empilage!AE15/Empilage!AE20*Detail_des_effets!AE9)*10^-1","v":{"v":2.6413719856168539E-4,"d":"0.000"}},"mm au diamètre",null,"Déformée radiale",{"$f":"(Empilage!AI15/Empilage!AI20*Detail_des_effets!AI9)*10^-1","v":{"v":2.6413719856168539E-4,"d":"0.000"}},"mm au diamètre",null,"Déformée radiale",{"$f":"(Empilage!AM15/Empilage!AM20*Detail_des_effets!AM9)*10^-1","v":{"v":2.6413719856168539E-4,"d":"0.000"}},"mm au diamètre"]
[null,"Dans la pièce, au diamètre particulier",{"$f":"Empilage!C$17","v":{"v":20,"d":"20.00"}},"mm",null,"Dans la pièce, au diamètre particulier",{"$f":"Empilage!G$17","v":{"v":20,"d":"20.00"}},"mm",null,"Dans la pièce, au diamètre particulier",{"$f":"Empilage!K$17","v":{"v":20,"d":"20.00"}},"mm",null,"Dans la pièce, au diamètre particulier",{"$f":"Empilage!O$17","v":{"v":20,"d":"20.00"}},"mm",null,"Dans la pièce, au diamètre particulier",{"$f":"Empilage!S$17","v":{"v":20,"d":"20.00"}},"mm",null,"Dans la pièce, au diamètre particulier",{"$f":"Empilage!W$17","v":{"v":20,"d":"20.00"}},"mm",null,"Dans la pièce, au diamètre particulier",{"$f":"Empilage!AA$17","v":{"v":20,"d":"20.00"}},"mm",null,"Dans la pièce, au diamètre particulier",{"$f":"Empilage!AE$17","v":{"v":20,"d":"20.00"}},"mm",null,"Dans la pièce, au diamètre particulier",{"$f":"Empilage!AI$17","v":{"v":20,"d":"20.00"}},"mm",null,"Dans la pièce, au diamètre particulier",{"$f":"Empilage!AM$17","v":{"v":20,"d":"20.00"}},"mm"]
[null,"Contrainte radiale",{"$f":"10^-12*(3+Empilage!C27)/32*Empilage!C28*Empilage!$D$87^2*(Empilage!C16^2+Empilage!C15^2-(Empilage!C16*Empilage!C15/Detail_des_effets!C11)^2-Detail_des_effets!C11^2)","v":{"v":1.8798506840491256,"d":"1.88"}},"MPa",null,"Contrainte radiale",{"$f":"10^-12*(3+Empilage!G27)/32*Empilage!G28*Empilage!$D$87^2*(Empilage!G16^2+Empilage!G15^2-(Empilage!G16*Empilage!G15/Detail_des_effets!G11)^2-Detail_des_effets!G11^2)","v":{"v":1.8798506840491256,"d":"1.88"}},"MPa",null,"Contrainte radiale",{"$f":"10^-12*(3+Empilage!K27)/32*Empilage!K28*Empilage!$D$87^2*(Empilage!K16^2+Empilage!K15^2-(Empilage!K16*Empilage!K15/Detail_des_effets!K11)^2-Detail_des_effets!K11^2)","v":{"v":1.8798506840491256,"d":"1.88"}},"MPa",null,"Contrainte radiale",{"$f":"10^-12*(3+Empilage!O27)/32*Empilage!O28*Empilage!$D$87^2*(Empilage!O16^2+Empilage!O15^2-(Empilage!O16*Empilage!O15/Detail_des_effets!O11)^2-Detail_des_effets!O11^2)","v":{"v":1.8798506840491256,"d":"1.88"}},"MPa",null,"Contrainte radiale",{"$f":"10^-12*(3+Empilage!S27)/32*Empilage!S28*Empilage!$D$87^2*(Empilage!S16^2+Empilage!S15^2-(Empilage!S16*Empilage!S15/Detail_des_effets!S11)^2-Detail_des_effets!S11^2)","v":{"v":1.8798506840491256,"d":"1.88"}},"MPa",null,"Contrainte radiale",{"$f":"10^-12*(3+Empilage!W27)/32*Empilage!W28*Empilage!$D$87^2*(Empilage!W16^2+Empilage!W15^2-(Empilage!W16*Empilage!W15/Detail_des_effets!W11)^2-Detail_des_effets!W11^2)","v":{"v":1.8798506840491256,"d":"1.88"}},"MPa",null,"Contrainte radiale",{"$f":"10^-12*(3+Empilage!AA27)/32*Empilage!AA28*Empilage!$D$87^2*(Empilage!AA16^2+Empilage!AA15^2-(Empilage!AA16*Empilage!AA15/Detail_des_effets!AA11)^2-Detail_des_effets!AA11^2)","v":{"v":1.8798506840491256,"d":"1.88"}},"MPa",null,"Contrainte radiale",{"$f":"10^-12*(3+Empilage!AE27)/32*Empilage!AE28*Empilage!$D$87^2*(Empilage!AE16^2+Empilage!AE15^2-(Empilage!AE16*Empilage!AE15/Detail_des_effets!AE11)^2-Detail_des_effets!AE11^2)","v":{"v":1.8798506840491256,"d":"1.88"}},"MPa",null,"Contrainte radiale",{"$f":"10^-12*(3+Empilage!AI27)/32*Empilage!AI28*Empilage!$D$87^2*(Empilage!AI16^2+Empilage!AI15^2-(Empilage!AI16*Empilage!AI15/Detail_des_effets!AI11)^2-Detail_des_effets!AI11^2)","v":{"v":1.8798506840491256,"d":"1.88"}},"MPa",null,"Contrainte radiale",{"$f":"10^-12*(3+Empilage!AM27)/32*Empilage!AM28*Empilage!$D$87^2*(Empilage!AM16^2+Empilage!AM15^2-(Empilage!AM16*Empilage!AM15/Detail_des_effets!AM11)^2-Detail_des_effets!AM11^2)","v":{"v":1.8798506840491256,"d":"1.88"}},"MPa"]
[null,"Contrainte tangentielle",{"$f":"10^-12*Empilage!C28/32*Empilage!$D$87^2*((3+Empilage!C27)*(Empilage!C16^2+Empilage!C15^2+(Empilage!C16*Empilage!C15/Detail_des_effets!C11)^2)-(1+3*Empilage!C27)*Detail_des_effets!C11^2)","v":{"v":3.3482269839906103,"d":"3.35"}},"MPa",null,"Contrainte tangentielle",{"$f":"10^-12*Empilage!G28/32*Empilage!$D$87^2*((3+Empilage!G27)*(Empilage!G16^2+Empilage!G15^2+(Empilage!G16*Empilage!G15/Detail_des_effets!G11)^2)-(1+3*Empilage!G27)*Detail_des_effets!G11^2)","v":{"v":3.3482269839906103,"d":"3.35"}},"MPa",null,"Contrainte tangentielle",{"$f":"10^-12*Empilage!K28/32*Empilage!$D$87^2*((3+Empilage!K27)*(Empilage!K16^2+Empilage!K15^2+(Empilage!K16*Empilage!K15/Detail_des_effets!K11)^2)-(1+3*Empilage!K27)*Detail_des_effets!K11^2)","v":{"v":3.3482269839906103,"d":"3.35"}},"MPa",null,"Contrainte tangentielle",{"$f":"10^-12*Empilage!O28/32*Empilage!$D$87^2*((3+Empilage!O27)*(Empilage!O16^2+Empilage!O15^2+(Empilage!O16*Empilage!O15/Detail_des_effets!O11)^2)-(1+3*Empilage!O27)*Detail_des_effets!O11^2)","v":{"v":3.3482269839906103,"d":"3.35"}},"MPa",null,"Contrainte tangentielle",{"$f":"10^-12*Empilage!S28/32*Empilage!$D$87^2*((3+Empilage!S27)*(Empilage!S16^2+Empilage!S15^2+(Empilage!S16*Empilage!S15/Detail_des_effets!S11)^2)-(1+3*Empilage!S27)*Detail_des_effets!S11^2)","v":{"v":3.3482269839906103,"d":"3.35"}},"MPa",null,"Contrainte tangentielle",{"$f":"10^-12*Empilage!W28/32*Empilage!$D$87^2*((3+Empilage!W27)*(Empilage!W16^2+Empilage!W15^2+(Empilage!W16*Empilage!W15/Detail_des_effets!W11)^2)-(1+3*Empilage!W27)*Detail_des_effets!W11^2)","v":{"v":3.3482269839906103,"d":"3.35"}},"MPa",null,"Contrainte tangentielle",{"$f":"10^-12*Empilage!AA28/32*Empilage!$D$87^2*((3+Empilage!AA27)*(Empilage!AA16^2+Empilage!AA15^2+(Empilage!AA16*Empilage!AA15/Detail_des_effets!AA11)^2)-(1+3*Empilage!AA27)*Detail_des_effets!AA11^2)","v":{"v":3.3482269839906103,"d":"3.35"}},"MPa",null,"Contrainte tangentielle",{"$f":"10^-12*Empilage!AE28/32*Empilage!$D$87^2*((3+Empilage!AE27)*(Empilage!AE16^2+Empilage!AE15^2+(Empilage!AE16*Empilage!AE15/Detail_des_effets!AE11)^2)-(1+3*Empilage!AE27)*Detail_des_effets!AE11^2)","v":{"v":3.3482269839906103,"d":"3.35"}},"MPa",null,"Contrainte tangentielle",{"$f":"10^-12*Empilage!AI28/32*Empilage!$D$87^2*((3+Empilage!AI27)*(Empilage!AI16^2+Empilage!AI15^2+(Empilage!AI16*Empilage!AI15/Detail_des_effets!AI11)^2)-(1+3*Empilage!AI27)*Detail_des_effets!AI11^2)","v":{"v":3.3482269839906103,"d":"3.35"}},"MPa",null,"Contrainte tangentielle",{"$f":"10^-12*Empilage!AM28/32*Empilage!$D$87^2*((3+Empilage!AM27)*(Empilage!AM16^2+Empilage!AM15^2+(Empilage!AM16*Empilage!AM15/Detail_des_effets!AM11)^2)-(1+3*Empilage!AM27)*Detail_des_effets!AM11^2)","v":{"v":3.3482269839906103,"d":"3.35"}},"MPa"]
[null,"Déformée radiale",{"$f":"(C11/Empilage!C20*(Detail_des_effets!C13-Empilage!C27*Detail_des_effets!C12))*10^-1","v":{"v":2.5997753413797235E-4,"d":"0.000"}},"mm au diamètre",null,"Déformée radiale",{"$f":"(G11/Empilage!G20*(Detail_des_effets!G13-Empilage!G27*Detail_des_effets!G12))*10^-1","v":{"v":2.5997753413797235E-4,"d":"0.000"}},"mm au diamètre",null,"Déformée radiale",{"$f":"(K11/Empilage!K20*(Detail_des_effets!K13-Empilage!K27*Detail_des_effets!K12))*10^-1","v":{"v":2.5997753413797235E-4,"d":"0.000"}},"mm au diamètre",null,"Déformée radiale",{"$f":"(O11/Empilage!O20*(Detail_des_effets!O13-Empilage!O27*Detail_des_effets!O12))*10^-1","v":{"v":2.5997753413797235E-4,"d":"0.000"}},"mm au diamètre",null,"Déformée radiale",{"$f":"(S11/Empilage!S20*(Detail_des_effets!S13-Empilage!S27*Detail_des_effets!S12))*10^-1","v":{"v":2.5997753413797235E-4,"d":"0.000"}},"mm au diamètre",null,"Déformée radiale",{"$f":"(W11/Empilage!W20*(Detail_des_effets!W13-Empilage!W27*Detail_des_effets!W12))*10^-1","v":{"v":2.5997753413797235E-4,"d":"0.000"}},"mm au diamètre",null,"Déformée radiale",{"$f":"(AA11/Empilage!AA20*(Detail_des_effets!AA13-Empilage!AA27*Detail_des_effets!AA12))*10^-1","v":{"v":2.5997753413797235E-4,"d":"0.000"}},"mm au diamètre",null,"Déformée radiale",{"$f":"(AE11/Empilage!AE20*(Detail_des_effets!AE13-Empilage!AE27*Detail_des_effets!AE12))*10^-1","v":{"v":2.5997753413797235E-4,"d":"0.000"}},"mm au diamètre",null,"Déformée radiale",{"$f":"(AI11/Empilage!AI20*(Detail_des_effets!AI13-Empilage!AI27*Detail_des_effets!AI12))*10^-1","v":{"v":2.5997753413797235E-4,"d":"0.000"}},"mm au diamètre",null,"Déformée radiale",{"$f":"(AM11/Empilage!AM20*(Detail_des_effets!AM13-Empilage!AM27*Detail_des_effets!AM12))*10^-1","v":{"v":2.5997753413797235E-4,"d":"0.000"}},"mm au diamètre"]
[null,"Effet de la pression seule",{"$nulls":3},"Effet de la pression seule",{"$nulls":3},"Effet de la pression seule",{"$nulls":3},"Effet de la pression seule",{"$nulls":3},"Effet de la pression seule",{"$nulls":3},"Effet de la pression seule",{"$nulls":3},"Effet de la pression seule",{"$nulls":3},"Effet de la pression seule",{"$nulls":3},"Effet de la pression seule",{"$nulls":3},"Effet de la pression seule"]
[]
[null,"Au niveau du frettage",{"$nulls":3},"Au niveau du frettage",{"$nulls":3},"Au niveau du frettage",{"$nulls":3},"Au niveau du frettage",{"$nulls":3},"Au niveau du frettage",{"$nulls":3},"Au niveau du frettage",{"$nulls":3},"Au niveau du frettage",{"$nulls":3},"Au niveau du frettage",{"$nulls":3},"Au niveau du frettage",{"$nulls":3},"Au niveau du frettage"]
[null,"Contrainte radiale",{"$f":"-Empilage!$D$89/10","v":{"v":-2,"d":"-2.00"}},"MPa",null,"Contrainte radiale",{"$f":"-Empilage!$D$89/10","v":{"v":-2,"d":"-2.00"}},"MPa",null,"Contrainte radiale",{"$f":"-Empilage!$D$89/10","v":{"v":-2,"d":"-2.00"}},"MPa",null,"Contrainte radiale",{"$f":"-Empilage!$D$89/10","v":{"v":-2,"d":"-2.00"}},"MPa",null,"Contrainte radiale",{"$f":"-Empilage!$D$89/10","v":{"v":-2,"d":"-2.00"}},"MPa",null,"Contrainte radiale",{"$f":"-Empilage!$D$89/10","v":{"v":-2,"d":"-2.00"}},"MPa",null,"Contrainte radiale",{"$f":"-Empilage!$D$89/10","v":{"v":-2,"d":"-2.00"}},"MPa",null,"Contrainte radiale",{"$f":"-Empilage!$D$89/10","v":{"v":-2,"d":"-2.00"}},"MPa",null,"Contrainte radiale",{"$f":"-Empilage!$D$89/10","v":{"v":-2,"d":"-2.00"}},"MPa",null,"Contrainte radiale",{"$f":"-Empilage!$D$89/10","v":{"v":-2,"d":"-2.00"}},"MPa"]
[null,"Contrainte tangentielle",{"$f":"(2*Empilage!C16^2*Empilage!$D$88-(Empilage!C16^2+Empilage!C15^2)*Empilage!$D$89)/(Empilage!C15^2-Empilage!C16^2)/10","v":{"v":-2,"d":"-2.00"}},"MPa",null,"Contrainte tangentielle",{"$f":"(2*Empilage!G16^2*Empilage!$D$88-(Empilage!G16^2+Empilage!G15^2)*Empilage!$D$89)/(Empilage!G15^2-Empilage!G16^2)/10","v":{"v":-2,"d":"-2.00"}},"MPa",null,"Contrainte tangentielle",{"$f":"(2*Empilage!K16^2*Empilage!$D$88-(Empilage!K16^2+Empilage!K15^2)*Empilage!$D$89)/(Empilage!K15^2-Empilage!K16^2)/10","v":{"v":-2,"d":"-2.00"}},"MPa",null,"Contrainte tangentielle",{"$f":"(2*Empilage!O16^2*Empilage!$D$88-(Empilage!O16^2+Empilage!O15^2)*Empilage!$D$89)/(Empilage!O15^2-Empilage!O16^2)/10","v":{"v":-2,"d":"-2.00"}},"MPa",null,"Contrainte tangentielle",{"$f":"(2*Empilage!S16^2*Empilage!$D$88-(Empilage!S16^2+Empilage!S15^2)*Empilage!$D$89)/(Empilage!S15^2-Empilage!S16^2)/10","v":{"v":-2,"d":"-2.00"}},"MPa",null,"Contrainte tangentielle",{"$f":"(2*Empilage!W16^2*Empilage!$D$88-(Empilage!W16^2+Empilage!W15^2)*Empilage!$D$89)/(Empilage!W15^2-Empilage!W16^2)/10","v":{"v":-2,"d":"-2.00"}},"MPa",null,"Contrainte tangentielle",{"$f":"(2*Empilage!AA16^2*Empilage!$D$88-(Empilage!AA16^2+Empilage!AA15^2)*Empilage!$D$89)/(Empilage!AA15^2-Empilage!AA16^2)/10","v":{"v":-2,"d":"-2.00"}},"MPa",null,"Contrainte tangentielle",{"$f":"(2*Empilage!AE16^2*Empilage!$D$88-(Empilage!AE16^2+Empilage!AE15^2)*Empilage!$D$89)/(Empilage!AE15^2-Empilage!AE16^2)/10","v":{"v":-2,"d":"-2.00"}},"MPa",null,"Contrainte tangentielle",{"$f":"(2*Empilage!AI16^2*Empilage!$D$88-(Empilage!AI16^2+Empilage!AI15^2)*Empilage!$D$89)/(Empilage!AI15^2-Empilage!AI16^2)/10","v":{"v":-2,"d":"-2.00"}},"MPa",null,"Contrainte tangentielle",{"$f":"(2*Empilage!AM16^2*Empilage!$D$88-(Empilage!AM16^2+Empilage!AM15^2)*Empilage!$D$89)/(Empilage!AM15^2-Empilage!AM16^2)/10","v":{"v":-2,"d":"-2.00"}},"MPa"]
[null,"Déformée radiale",{"$f":"(Empilage!C15/Empilage!C20*(Detail_des_effets!C19-Empilage!C27*Detail_des_effets!C18))*10^-1","v":{"v":-1.658898889321701E-4,"d":"-0.000"}},"mm au diamètre",null,"Déformée radiale",{"$f":"(Empilage!G15/Empilage!G20*(Detail_des_effets!G19-Empilage!G27*Detail_des_effets!G18))*10^-1","v":{"v":-1.658898889321701E-4,"d":"-0.000"}},"mm au diamètre",null,"Déformée radiale",{"$f":"(Empilage!K15/Empilage!K20*(Detail_des_effets!K19-Empilage!K27*Detail_des_effets!K18))*10^-1","v":{"v":-1.658898889321701E-4,"d":"-0.000"}},"mm au diamètre",null,"Déformée radiale",{"$f":"(Empilage!O15/Empilage!O20*(Detail_des_effets!O19-Empilage!O27*Detail_des_effets!O18))*10^-1","v":{"v":-1.658898889321701E-4,"d":"-0.000"}},"mm au diamètre",null,"Déformée radiale",{"$f":"(Empilage!S15/Empilage!S20*(Detail_des_effets!S19-Empilage!S27*Detail_des_effets!S18))*10^-1","v":{"v":-1.658898889321701E-4,"d":"-0.000"}},"mm au diamètre",null,"Déformée radiale",{"$f":"(Empilage!W15/Empilage!W20*(Detail_des_effets!W19-Empilage!W27*Detail_des_effets!W18))*10^-1","v":{"v":-1.658898889321701E-4,"d":"-0.000"}},"mm au diamètre",null,"Déformée radiale",{"$f":"(Empilage!AA15/Empilage!AA20*(Detail_des_effets!AA19-Empilage!AA27*Detail_des_effets!AA18))*10^-1","v":{"v":-1.658898889321701E-4,"d":"-0.000"}},"mm au diamètre",null,"Déformée radiale",{"$f":"(Empilage!AE15/Empilage!AE20*(Detail_des_effets!AE19-Empilage!AE27*Detail_des_effets!AE18))*10^-1","v":{"v":-1.658898889321701E-4,"d":"-0.000"}},"mm au diamètre",null,"Déformée radiale",{"$f":"(Empilage!AI15/Empilage!AI20*(Detail_des_effets!AI19-Empilage!AI27*Detail_des_effets!AI18))*10^-1","v":{"v":-1.658898889321701E-4,"d":"-0.000"}},"mm au diamètre",null,"Déformée radiale",{"$f":"(Empilage!AM15/Empilage!AM20*(Detail_des_effets!AM19-Empilage!AM27*Detail_des_effets!AM18))*10^-1","v":{"v":-1.658898889321701E-4,"d":"-0.000"}},"mm au diamètre"]
[null,"Dans la pièce, au diamètre particulier",{"$f":"Empilage!C$17","v":{"v":20,"d":"20.00"}},"mm",null,"Dans la pièce, au diamètre particulier",{"$f":"Empilage!G$17","v":{"v":20,"d":"20.00"}},"mm",null,"Dans la pièce, au diamètre particulier",{"$f":"Empilage!K$17","v":{"v":20,"d":"20.00"}},"mm",null,"Dans la pièce, au diamètre particulier",{"$f":"Empilage!O$17","v":{"v":20,"d":"20.00"}},"mm",null,"Dans la pièce, au diamètre particulier",{"$f":"Empilage!S$17","v":{"v":20,"d":"20.00"}},"mm",null,"Dans la pièce, au diamètre particulier",{"$f":"Empilage!W$17","v":{"v":20,"d":"20.00"}},"mm",null,"Dans la pièce, au diamètre particulier",{"$f":"Empilage!AA$17","v":{"v":20,"d":"20.00"}},"mm",null,"Dans la pièce, au diamètre particulier",{"$f":"Empilage!AE$17","v":{"v":20,"d":"20.00"}},"mm",null,"Dans la pièce, au diamètre particulier",{"$f":"Empilage!AI$17","v":{"v":20,"d":"20.00"}},"mm",null,"Dans la pièce, au diamètre particulier",{"$f":"Empilage!AM$17","v":{"v":20,"d":"20.00"}},"mm"]
[null,"Contrainte radiale",{"$f":"(C$21^2*(Empilage!C16^2*Empilage!$D$88-Empilage!C15^2*Empilage!$D$89)-(Empilage!$D$88-Empilage!$D$89)*Empilage!C16^2*Empilage!C15^2)/(Detail_des_effets!C$21^2*(Empilage!C15^2-Empilage!C16^2))/10","v":{"v":-2,"d":"-2.00"}},"MPa",null,"Contrainte radiale",{"$f":"(G$21^2*(Empilage!G16^2*Empilage!$D$88-Empilage!G15^2*Empilage!$D$89)-(Empilage!$D$88-Empilage!$D$89)*Empilage!G16^2*Empilage!G15^2)/(Detail_des_effets!G$21^2*(Empilage!G15^2-Empilage!G16^2))/10","v":{"v":-2,"d":"-2.00"}},"MPa",null,"Contrainte radiale",{"$f":"(K$21^2*(Empilage!K16^2*Empilage!$D$88-Empilage!K15^2*Empilage!$D$89)-(Empilage!$D$88-Empilage!$D$89)*Empilage!K16^2*Empilage!K15^2)/(Detail_des_effets!K$21^2*(Empilage!K15^2-Empilage!K16^2))/10","v":{"v":-2,"d":"-2.00"}},"MPa",null,"Contrainte radiale",{"$f":"(O$21^2*(Empilage!O16^2*Empilage!$D$88-Empilage!O15^2*Empilage!$D$89)-(Empilage!$D$88-Empilage!$D$89)*Empilage!O16^2*Empilage!O15^2)/(Detail_des_effets!O$21^2*(Empilage!O15^2-Empilage!O16^2))/10","v":{"v":-2,"d":"-2.00"}},"MPa",null,"Contrainte radiale",{"$f":"(S$21^2*(Empilage!S16^2*Empilage!$D$88-Empilage!S15^2*Empilage!$D$89)-(Empilage!$D$88-Empilage!$D$89)*Empilage!S16^2*Empilage!S15^2)/(Detail_des_effets!S$21^2*(Empilage!S15^2-Empilage!S16^2))/10","v":{"v":-2,"d":"-2.00"}},"MPa",null,"Contrainte radiale",{"$f":"(W$21^2*(Empilage!W16^2*Empilage!$D$88-Empilage!W15^2*Empilage!$D$89)-(Empilage!$D$88-Empilage!$D$89)*Empilage!W16^2*Empilage!W15^2)/(Detail_des_effets!W$21^2*(Empilage!W15^2-Empilage!W16^2))/10","v":{"v":-2,"d":"-2.00"}},"MPa",null,"Contrainte radiale",{"$f":"(AA$21^2*(Empilage!AA16^2*Empilage!$D$88-Empilage!AA15^2*Empilage!$D$89)-(Empilage!$D$88-Empilage!$D$89)*Empilage!AA16^2*Empilage!AA15^2)/(Detail_des_effets!AA$21^2*(Empilage!AA15^2-Empilage!AA16^2))/10","v":{"v":-2,"d":"-2.00"}},"MPa",null,"Contrainte radiale",{"$f":"(AE$21^2*(Empilage!AE16^2*Empilage!$D$88-Empilage!AE15^2*Empilage!$D$89)-(Empilage!$D$88-Empilage!$D$89)*Empilage!AE16^2*Empilage!AE15^2)/(Detail_des_effets!AE$21^2*(Empilage!AE15^2-Empilage!AE16^2))/10","v":{"v":-2,"d":"-2.00"}},"MPa",null,"Contrainte radiale",{"$f":"(AI$21^2*(Empilage!AI16^2*Empilage!$D$88-Empilage!AI15^2*Empilage!$D$89)-(Empilage!$D$88-Empilage!$D$89)*Empilage!AI16^2*Empilage!AI15^2)/(Detail_des_effets!AI$21^2*(Empilage!AI15^2-Empilage!AI16^2))/10","v":{"v":-2,"d":"-2.00"}},"MPa",null,"Contrainte radiale",{"$f":"(AM$21^2*(Empilage!AM16^2*Empilage!$D$88-Empilage!AM15^2*Empilage!$D$89)-(Empilage!$D$88-Empilage!$D$89)*Empilage!AM16^2*Empilage!AM15^2)/(Detail_des_effets!AM$21^2*(Empilage!AM15^2-Empilage!AM16^2))/10","v":{"v":-2,"d":"-2.00"}},"MPa"]
[null,"Contrainte tangentielle",{"$f":"(C$21^2*(Empilage!C16^2*Empilage!$D$88-Empilage!C15^2*Empilage!$D$89)+(Empilage!$D$88-Empilage!$D$89)*Empilage!C16^2*Empilage!C15^2)/(Detail_des_effets!C$21^2*(Empilage!C15^2-Empilage!C16^2))/10","v":{"v":-2,"d":"-2.00"}},"MPa",null,"Contrainte tangentielle",{"$f":"(G$21^2*(Empilage!G16^2*Empilage!$D$88-Empilage!G15^2*Empilage!$D$89)+(Empilage!$D$88-Empilage!$D$89)*Empilage!G16^2*Empilage!G15^2)/(Detail_des_effets!G$21^2*(Empilage!G15^2-Empilage!G16^2))/10","v":{"v":-2,"d":"-2.00"}},"MPa",null,"Contrainte tangentielle",{"$f":"(K$21^2*(Empilage!K16^2*Empilage!$D$88-Empilage!K15^2*Empilage!$D$89)+(Empilage!$D$88-Empilage!$D$89)*Empilage!K16^2*Empilage!K15^2)/(Detail_des_effets!K$21^2*(Empilage!K15^2-Empilage!K16^2))/10","v":{"v":-2,"d":"-2.00"}},"MPa",null,"Contrainte tangentielle",{"$f":"(O$21^2*(Empilage!O16^2*Empilage!$D$88-Empilage!O15^2*Empilage!$D$89)+(Empilage!$D$88-Empilage!$D$89)*Empilage!O16^2*Empilage!O15^2)/(Detail_des_effets!O$21^2*(Empilage!O15^2-Empilage!O16^2))/10","v":{"v":-2,"d":"-2.00"}},"MPa",null,"Contrainte tangentielle",{"$f":"(S$21^2*(Empilage!S16^2*Empilage!$D$88-Empilage!S15^2*Empilage!$D$89)+(Empilage!$D$88-Empilage!$D$89)*Empilage!S16^2*Empilage!S15^2)/(Detail_des_effets!S$21^2*(Empilage!S15^2-Empilage!S16^2))/10","v":{"v":-2,"d":"-2.00"}},"MPa",null,"Contrainte tangentielle",{"$f":"(W$21^2*(Empilage!W16^2*Empilage!$D$88-Empilage!W15^2*Empilage!$D$89)+(Empilage!$D$88-Empilage!$D$89)*Empilage!W16^2*Empilage!W15^2)/(Detail_des_effets!W$21^2*(Empilage!W15^2-Empilage!W16^2))/10","v":{"v":-2,"d":"-2.00"}},"MPa",null,"Contrainte tangentielle",{"$f":"(AA$21^2*(Empilage!AA16^2*Empilage!$D$88-Empilage!AA15^2*Empilage!$D$89)+(Empilage!$D$88-Empilage!$D$89)*Empilage!AA16^2*Empilage!AA15^2)/(Detail_des_effets!AA$21^2*(Empilage!AA15^2-Empilage!AA16^2))/10","v":{"v":-2,"d":"-2.00"}},"MPa",null,"Contrainte tangentielle",{"$f":"(AE$21^2*(Empilage!AE16^2*Empilage!$D$88-Empilage!AE15^2*Empilage!$D$89)+(Empilage!$D$88-Empilage!$D$89)*Empilage!AE16^2*Empilage!AE15^2)/(Detail_des_effets!AE$21^2*(Empilage!AE15^2-Empilage!AE16^2))/10","v":{"v":-2,"d":"-2.00"}},"MPa",null,"Contrainte tangentielle",{"$f":"(AI$21^2*(Empilage!AI16^2*Empilage!$D$88-Empilage!AI15^2*Empilage!$D$89)+(Empilage!$D$88-Empilage!$D$89)*Empilage!AI16^2*Empilage!AI15^2)/(Detail_des_effets!AI$21^2*(Empilage!AI15^2-Empilage!AI16^2))/10","v":{"v":-2,"d":"-2.00"}},"MPa",null,"Contrainte tangentielle",{"$f":"(AM$21^2*(Empilage!AM16^2*Empilage!$D$88-Empilage!AM15^2*Empilage!$D$89)+(Empilage!$D$88-Empilage!$D$89)*Empilage!AM16^2*Empilage!AM15^2)/(Detail_des_effets!AM$21^2*(Empilage!AM15^2-Empilage!AM16^2))/10","v":{"v":-2,"d":"-2.00"}},"MPa"]
[null,"Déformée radiale",{"$f":"((C$21/Empilage!C$20)*(Detail_des_effets!C23-Empilage!C$27*Detail_des_effets!C22))*10^-1","v":{"v":-1.327119111457361E-4,"d":"-0.000"}},"mm au diamètre",null,"Déformée radiale",{"$f":"((G$21/Empilage!G$20)*(Detail_des_effets!G23-Empilage!G$27*Detail_des_effets!G22))*10^-1","v":{"v":-1.327119111457361E-4,"d":"-0.000"}},"mm au diamètre",null,"Déformée radiale",{"$f":"((K$21/Empilage!K$20)*(Detail_des_effets!K23-Empilage!K$27*Detail_des_effets!K22))*10^-1","v":{"v":-1.327119111457361E-4,"d":"-0.000"}},"mm au diamètre",null,"Déformée radiale",{"$f":"((O$21/Empilage!O$20)*(Detail_des_effets!O23-Empilage!O$27*Detail_des_effets!O22))*10^-1","v":{"v":-1.327119111457361E-4,"d":"-0.000"}},"mm au diamètre",null,"Déformée radiale",{"$f":"((S$21/Empilage!S$20)*(Detail_des_effets!S23-Empilage!S$27*Detail_des_effets!S22))*10^-1","v":{"v":-1.327119111457361E-4,"d":"-0.000"}},"mm au diamètre",null,"Déformée radiale",{"$f":"((W$21/Empilage!W$20)*(Detail_des_effets!W23-Empilage!W$27*Detail_des_effets!W22))*10^-1","v":{"v":-1.327119111457361E-4,"d":"-0.000"}},"mm au diamètre",null,"Déformée radiale",{"$f":"((AA$21/Empilage!AA$20)*(Detail_des_effets!AA23-Empilage!AA$27*Detail_des_effets!AA22))*10^-1","v":{"v":-1.327119111457361E-4,"d":"-0.000"}},"mm au diamètre",null,"Déformée radiale",{"$f":"((AE$21/Empilage!AE$20)*(Detail_des_effets!AE23-Empilage!AE$27*Detail_des_effets!AE22))*10^-1","v":{"v":-1.327119111457361E-4,"d":"-0.000"}},"mm au diamètre",null,"Déformée radiale",{"$f":"((AI$21/Empilage!AI$20)*(Detail_des_effets!AI23-Empilage!AI$27*Detail_des_effets!AI22))*10^-1","v":{"v":-1.327119111457361E-4,"d":"-0.000"}},"mm au diamètre",null,"Déformée radiale",{"$f":"((AM$21/Empilage!AM$20)*(Detail_des_effets!AM23-Empilage!AM$27*Detail_des_effets!AM22))*10^-1","v":{"v":-1.327119111457361E-4,"d":"-0.000"}},"mm au diamètre"]
[null,"Effet de l'effort axial seul en montage",{"$nulls":3},"Effet de l'effort axial seul en montage",{"$nulls":3},"Effet de l'effort axial seul en montage",{"$nulls":3},"Effet de l'effort axial seul en montage",{"$nulls":3},"Effet de l'effort axial seul en montage",{"$nulls":3},"Effet de l'effort axial seul en montage",{"$nulls":3},"Effet de l'effort axial seul en montage",{"$nulls":3},"Effet de l'effort axial seul en montage",{"$nulls":3},"Effet de l'effort axial seul en montage",{"$nulls":3},"Effet de l'effort axial seul en montage"]
[]
[null,"Au niveau du frettage",{"$nulls":3},"Au niveau du frettage",{"$nulls":3},"Au niveau du frettage",{"$nulls":3},"Au niveau du frettage",{"$nulls":3},"Au niveau du frettage",{"$nulls":3},"Au niveau du frettage",{"$nulls":3},"Au niveau du frettage",{"$nulls":3},"Au niveau du frettage",{"$nulls":3},"Au niveau du frettage",{"$nulls":3},"Au niveau du frettage"]
[null,"Contrainte axiale",{"$f":"Empilage!$D$92*10/((PI()/4)*(Empilage!C$15^2-Empilage!C$16^2))","v":{"v":122.23099629457562,"d":"122"}},"MPa",null,"Contrainte axiale",{"$f":"Empilage!$D$92*10/((PI()/4)*(Empilage!G$15^2-Empilage!G$16^2))","v":{"v":122.23099629457562,"d":"122"}},"MPa",null,"Contrainte axiale",{"$f":"Empilage!$D$92*10/((PI()/4)*(Empilage!K$15^2-Empilage!K$16^2))","v":{"v":122.23099629457562,"d":"122"}},"MPa",null,"Contrainte axiale",{"$f":"Empilage!$D$92*10/((PI()/4)*(Empilage!O$15^2-Empilage!O$16^2))","v":{"v":122.23099629457562,"d":"122"}},"MPa",null,"Contrainte axiale",{"$f":"Empilage!$D$92*10/((PI()/4)*(Empilage!S$15^2-Empilage!S$16^2))","v":{"v":122.23099629457562,"d":"122"}},"MPa",null,"Contrainte axiale",{"$f":"Empilage!$D$92*10/((PI()/4)*(Empilage!W$15^2-Empilage!W$16^2))","v":{"v":122.23099629457562,"d":"122"}},"MPa",null,"Contrainte axiale",{"$f":"Empilage!$D$92*10/((PI()/4)*(Empilage!AA$15^2-Empilage!AA$16^2))","v":{"v":122.23099629457562,"d":"122"}},"MPa",null,"Contrainte axiale",{"$f":"Empilage!$D$92*10/((PI()/4)*(Empilage!AE$15^2-Empilage!AE$16^2))","v":{"v":122.23099629457562,"d":"122"}},"MPa",null,"Contrainte axiale",{"$f":"Empilage!$D$92*10/((PI()/4)*(Empilage!AI$15^2-Empilage!AI$16^2))","v":{"v":122.23099629457562,"d":"122"}},"MPa",null,"Contrainte axiale",{"$f":"Empilage!$D$92*10/((PI()/4)*(Empilage!AM$15^2-Empilage!AM$16^2))","v":{"v":122.23099629457562,"d":"122"}},"MPa"]
[null,"Déformée axiale",{"$f":"(C$28/Empilage!C$18*Empilage!C$13)*10^-1","v":{"v":0.031156609255083963,"d":"0.031"}},"mm",null,"Déformée axiale",{"$f":"(G$28/Empilage!G$18*Empilage!G$13)*10^-1","v":{"v":0.031156609255083963,"d":"0.031"}},"mm",null,"Déformée axiale",{"$f":"(K$28/Empilage!K$18*Empilage!K$13)*10^-1","v":{"v":0.031156609255083963,"d":"0.031"}},"mm",null,"Déformée axiale",{"$f":"(O$28/Empilage!O$18*Empilage!O$13)*10^-1","v":{"v":0.031156609255083963,"d":"0.031"}},"mm",null,"Déformée axiale",{"$f":"(S$28/Empilage!S$18*Empilage!S$13)*10^-1","v":{"v":0.031156609255083963,"d":"0.031"}},"mm",null,"Déformée axiale",{"$f":"(W$28/Empilage!W$18*Empilage!W$13)*10^-1","v":{"v":0.031156609255083963,"d":"0.031"}},"mm",null,"Déformée axiale",{"$f":"(AA$28/Empilage!AA$18*Empilage!AA$13)*10^-1","v":{"v":0.031156609255083963,"d":"0.031"}},"mm",null,"Déformée axiale",{"$f":"(AE$28/Empilage!AE$18*Empilage!AE$13)*10^-1","v":{"v":0.031156609255083963,"d":"0.031"}},"mm",null,"Déformée axiale",{"$f":"(AI$28/Empilage!AI$18*Empilage!AI$13)*10^-1","v":{"v":0.031156609255083963,"d":"0.031"}},"mm",null,"Déformée axiale",{"$f":"(AM$28/Empilage!AM$18*Empilage!AM$13)*10^-1","v":{"v":0.031156609255083963,"d":"0.031"}},"mm"]
[null,"Déformée radiale",{"$f":"(-Empilage!C$27/Empilage!C$18*Empilage!C$15*Detail_des_effets!C$28)*10^-1","v":{"v":-4.13145715488811E-3,"d":"-0.004"}},"mm au diamètre",null,"Déformée radiale",{"$f":"(-Empilage!G$27/Empilage!G$18*Empilage!G$15*Detail_des_effets!G$28)*10^-1","v":{"v":-4.13145715488811E-3,"d":"-0.004"}},"mm au diamètre",null,"Déformée radiale",{"$f":"(-Empilage!K$27/Empilage!K$18*Empilage!K$15*Detail_des_effets!K$28)*10^-1","v":{"v":-4.13145715488811E-3,"d":"-0.004"}},"mm au diamètre",null,"Déformée radiale",{"$f":"(-Empilage!O$27/Empilage!O$18*Empilage!O$15*Detail_des_effets!O$28)*10^-1","v":{"v":-4.13145715488811E-3,"d":"-0.004"}},"mm au diamètre",null,"Déformée radiale",{"$f":"(-Empilage!S$27/Empilage!S$18*Empilage!S$15*Detail_des_effets!S$28)*10^-1","v":{"v":-4.13145715488811E-3,"d":"-0.004"}},"mm au diamètre",null,"Déformée radiale",{"$f":"(-Empilage!W$27/Empilage!W$18*Empilage!W$15*Detail_des_effets!W$28)*10^-1","v":{"v":-4.13145715488811E-3,"d":"-0.004"}},"mm au diamètre",null,"Déformée radiale",{"$f":"(-Empilage!AA$27/Empilage!AA$18*Empilage!AA$15*Detail_des_effets!AA$28)*10^-1","v":{"v":-4.13145715488811E-3,"d":"-0.004"}},"mm au diamètre",null,"Déformée radiale",{"$f":"(-Empilage!AE$27/Empilage!AE$18*Empilage!AE$15*Detail_des_effets!AE$28)*10^-1","v":{"v":-4.13145715488811E-3,"d":"-0.004"}},"mm au diamètre",null,"Déformée radiale",{"$f":"(-Empilage!AI$27/Empilage!AI$18*Empilage!AI$15*Detail_des_effets!AI$28)*10^-1","v":{"v":-4.13145715488811E-3,"d":"-0.004"}},"mm au diamètre",null,"Déformée radiale",{"$f":"(-Empilage!AM$27/Empilage!AM$18*Empilage!AM$15*Detail_des_effets!AM$28)*10^-1","v":{"v":-4.13145715488811E-3,"d":"-0.004"}},"mm au diamètre"]
[null,"Dans la pièce, au diamètre particulier",{"$f":"Empilage!C$17","v":{"v":20,"d":"20.00"}},"mm",null,"Dans la pièce, au diamètre particulier",{"$f":"Empilage!G$17","v":{"v":20,"d":"20.00"}},"mm",null,"Dans la pièce, au diamètre particulier",{"$f":"Empilage!K$17","v":{"v":20,"d":"20.00"}},"mm",null,"Dans la pièce, au diamètre particulier",{"$f":"Empilage!O$17","v":{"v":20,"d":"20.00"}},"mm",null,"Dans la pièce, au diamètre particulier",{"$f":"Empilage!S$17","v":{"v":20,"d":"20.00"}},"mm",null,"Dans la pièce, au diamètre particulier",{"$f":"Empilage!W$17","v":{"v":20,"d":"20.00"}},"mm",null,"Dans la pièce, au diamètre particulier",{"$f":"Empilage!AA$17","v":{"v":20,"d":"20.00"}},"mm",null,"Dans la pièce, au diamètre particulier",{"$f":"Empilage!AE$17","v":{"v":20,"d":"20.00"}},"mm",null,"Dans la pièce, au diamètre particulier",{"$f":"Empilage!AI$17","v":{"v":20,"d":"20.00"}},"mm",null,"Dans la pièce, au diamètre particulier",{"$f":"Empilage!AM$17","v":{"v":20,"d":"20.00"}},"mm"]
[null,"Contrainte axiale",{"$f":"Empilage!$D$92*10/((PI()/4)*(Empilage!C$15^2-Empilage!C$16^2))","v":{"v":122.23099629457562,"d":"122"}},"MPa",null,"Contrainte axiale",{"$f":"Empilage!$D$92*10/((PI()/4)*(Empilage!G$15^2-Empilage!G$16^2))","v":{"v":122.23099629457562,"d":"122"}},"MPa",null,"Contrainte axiale",{"$f":"Empilage!$D$92*10/((PI()/4)*(Empilage!K$15^2-Empilage!K$16^2))","v":{"v":122.23099629457562,"d":"122"}},"MPa",null,"Contrainte axiale",{"$f":"Empilage!$D$92*10/((PI()/4)*(Empilage!O$15^2-Empilage!O$16^2))","v":{"v":122.23099629457562,"d":"122"}},"MPa",null,"Contrainte axiale",{"$f":"Empilage!$D$92*10/((PI()/4)*(Empilage!S$15^2-Empilage!S$16^2))","v":{"v":122.23099629457562,"d":"122"}},"MPa",null,"Contrainte axiale",{"$f":"Empilage!$D$92*10/((PI()/4)*(Empilage!W$15^2-Empilage!W$16^2))","v":{"v":122.23099629457562,"d":"122"}},"MPa",null,"Contrainte axiale",{"$f":"Empilage!$D$92*10/((PI()/4)*(Empilage!AA$15^2-Empilage!AA$16^2))","v":{"v":122.23099629457562,"d":"122"}},"MPa",null,"Contrainte axiale",{"$f":"Empilage!$D$92*10/((PI()/4)*(Empilage!AE$15^2-Empilage!AE$16^2))","v":{"v":122.23099629457562,"d":"122"}},"MPa",null,"Contrainte axiale",{"$f":"Empilage!$D$92*10/((PI()/4)*(Empilage!AI$15^2-Empilage!AI$16^2))","v":{"v":122.23099629457562,"d":"122"}},"MPa",null,"Contrainte axiale",{"$f":"Empilage!$D$92*10/((PI()/4)*(Empilage!AM$15^2-Empilage!AM$16^2))","v":{"v":122.23099629457562,"d":"122"}},"MPa"]
[null,"Déformée axiale",{"$f":"(C$32/Empilage!C$18*Empilage!C$13)*10^-1","v":{"v":0.031156609255083963,"d":"0.031"}},"mm",null,"Déformée axiale",{"$f":"(G$32/Empilage!G$18*Empilage!G$13)*10^-1","v":{"v":0.031156609255083963,"d":"0.031"}},"mm",null,"Déformée axiale",{"$f":"(K$32/Empilage!K$18*Empilage!K$13)*10^-1","v":{"v":0.031156609255083963,"d":"0.031"}},"mm",null,"Déformée axiale",{"$f":"(O$32/Empilage!O$18*Empilage!O$13)*10^-1","v":{"v":0.031156609255083963,"d":"0.031"}},"mm",null,"Déformée axiale",{"$f":"(S$32/Empilage!S$18*Empilage!S$13)*10^-1","v":{"v":0.031156609255083963,"d":"0.031"}},"mm",null,"Déformée axiale",{"$f":"(W$32/Empilage!W$18*Empilage!W$13)*10^-1","v":{"v":0.031156609255083963,"d":"0.031"}},"mm",null,"Déformée axiale",{"$f":"(AA$32/Empilage!AA$18*Empilage!AA$13)*10^-1","v":{"v":0.031156609255083963,"d":"0.031"}},"mm",null,"Déformée axiale",{"$f":"(AE$32/Empilage!AE$18*Empilage!AE$13)*10^-1","v":{"v":0.031156609255083963,"d":"0.031"}},"mm",null,"Déformée axiale",{"$f":"(AI$32/Empilage!AI$18*Empilage!AI$13)*10^-1","v":{"v":0.031156609255083963,"d":"0.031"}},"mm",null,"Déformée axiale",{"$f":"(AM$32/Empilage!AM$18*Empilage!AM$13)*10^-1","v":{"v":0.031156609255083963,"d":"0.031"}},"mm"]
[null,"Déformée radiale",{"$f":"(-Empilage!C$27/Empilage!C$18*C31*Detail_des_effets!C$32)*10^-1","v":{"v":-3.3051657239104876E-3,"d":"-0.003"}},"mm au diamètre",null,"Déformée radiale",{"$f":"(-Empilage!G$27/Empilage!G$18*G31*Detail_des_effets!G$32)*10^-1","v":{"v":-3.3051657239104876E-3,"d":"-0.003"}},"mm au diamètre",null,"Déformée radiale",{"$f":"(-Empilage!K$27/Empilage!K$18*K31*Detail_des_effets!K$32)*10^-1","v":{"v":-3.3051657239104876E-3,"d":"-0.003"}},"mm au diamètre",null,"Déformée radiale",{"$f":"(-Empilage!O$27/Empilage!O$18*O31*Detail_des_effets!O$32)*10^-1","v":{"v":-3.3051657239104876E-3,"d":"-0.003"}},"mm au diamètre",null,"Déformée radiale",{"$f":"(-Empilage!S$27/Empilage!S$18*S31*Detail_des_effets!S$32)*10^-1","v":{"v":-3.3051657239104876E-3,"d":"-0.003"}},"mm au diamètre",null,"Déformée radiale",{"$f":"(-Empilage!W$27/Empilage!W$18*W31*Detail_des_effets!W$32)*10^-1","v":{"v":-3.3051657239104876E-3,"d":"-0.003"}},"mm au diamètre",null,"Déformée radiale",{"$f":"(-Empilage!AA$27/Empilage!AA$18*AA31*Detail_des_effets!AA$32)*10^-1","v":{"v":-3.3051657239104876E-3,"d":"-0.003"}},"mm au diamètre",null,"Déformée radiale",{"$f":"(-Empilage!AE$27/Empilage!AE$18*AE31*Detail_des_effets!AE$32)*10^-1","v":{"v":-3.3051657239104876E-3,"d":"-0.003"}},"mm au diamètre",null,"Déformée radiale",{"$f":"(-Empilage!AI$27/Empilage!AI$18*AI31*Detail_des_effets!AI$32)*10^-1","v":{"v":-3.3051657239104876E-3,"d":"-0.003"}},"mm au diamètre",null,"Déformée radiale",{"$f":"(-Empilage!AM$27/Empilage!AM$18*AM31*Detail_des_effets!AM$32)*10^-1","v":{"v":-3.3051657239104876E-3,"d":"-0.003"}},"mm au diamètre"]
[null,"Effet de l'effort axial seul en mise en froid",{"$nulls":3},"Effet de l'effort axial seul en mise en froid",{"$nulls":3},"Effet de l'effort axial seul en mise en froid",{"$nulls":3},"Effet de l'effort axial seul en mise en froid",{"$nulls":3},"Effet de l'effort axial seul en mise en froid",{"$nulls":3},"Effet de l'effort axial seul en mise en froid",{"$nulls":3},"Effet de l'effort axial seul en mise en froid",{"$nulls":3},"Effet de l'effort axial seul en mise en froid",{"$nulls":3},"Effet de l'effort axial seul en mise en froid",{"$nulls":3},"Effet de l'effort axial seul en mise en froid"]
[]
[null,"Au niveau du frettage",{"$nulls":3},"Au niveau du frettage",{"$nulls":3},"Au niveau du frettage",{"$nulls":3},"Au niveau du frettage",{"$nulls":3},"Au niveau du frettage",{"$nulls":3},"Au niveau du frettage",{"$nulls":3},"Au niveau du frettage",{"$nulls":3},"Au niveau du frettage",{"$nulls":3},"Au niveau du frettage",{"$nulls":3},"Au niveau du frettage"]
[null,"Contrainte axiale",{"$f":"Empilage!$D$92*10/((PI()/4)*(Empilage!C$15^2-Empilage!C$16^2))","v":{"v":122.23099629457562,"d":"122"}},"MPa",null,"Contrainte axiale",{"$f":"Empilage!$D$92*10/((PI()/4)*(Empilage!G$15^2-Empilage!G$16^2))","v":{"v":122.23099629457562,"d":"122"}},"MPa",null,"Contrainte axiale",{"$f":"Empilage!$D$92*10/((PI()/4)*(Empilage!K$15^2-Empilage!K$16^2))","v":{"v":122.23099629457562,"d":"122"}},"MPa",null,"Contrainte axiale",{"$f":"Empilage!$D$92*10/((PI()/4)*(Empilage!O$15^2-Empilage!O$16^2))","v":{"v":122.23099629457562,"d":"122"}},"MPa",null,"Contrainte axiale",{"$f":"Empilage!$D$92*10/((PI()/4)*(Empilage!S$15^2-Empilage!S$16^2))","v":{"v":122.23099629457562,"d":"122"}},"MPa",null,"Contrainte axiale",{"$f":"Empilage!$D$92*10/((PI()/4)*(Empilage!W$15^2-Empilage!W$16^2))","v":{"v":122.23099629457562,"d":"122"}},"MPa",null,"Contrainte axiale",{"$f":"Empilage!$D$92*10/((PI()/4)*(Empilage!AA$15^2-Empilage!AA$16^2))","v":{"v":122.23099629457562,"d":"122"}},"MPa",null,"Contrainte axiale",{"$f":"Empilage!$D$92*10/((PI()/4)*(Empilage!AE$15^2-Empilage!AE$16^2))","v":{"v":122.23099629457562,"d":"122"}},"MPa",null,"Contrainte axiale",{"$f":"Empilage!$D$92*10/((PI()/4)*(Empilage!AI$15^2-Empilage!AI$16^2))","v":{"v":122.23099629457562,"d":"122"}},"MPa",null,"Contrainte axiale",{"$f":"Empilage!$D$92*10/((PI()/4)*(Empilage!AM$15^2-Empilage!AM$16^2))","v":{"v":122.23099629457562,"d":"122"}},"MPa"]
[null,"Déformée axiale",{"$f":"(C$38/Empilage!C$19*Empilage!C$13)*10^-1","v":{"v":0.02923204531096449,"d":"0.029"}},"mm",null,"Déformée axiale",{"$f":"(G$38/Empilage!G$19*Empilage!G$13)*10^-1","v":{"v":0.02923204531096449,"d":"0.029"}},"mm",null,"Déformée axiale",{"$f":"(K$38/Empilage!K$19*Empilage!K$13)*10^-1","v":{"v":0.02923204531096449,"d":"0.029"}},"mm",null,"Déformée axiale",{"$f":"(O$38/Empilage!O$19*Empilage!O$13)*10^-1","v":{"v":0.02923204531096449,"d":"0.029"}},"mm",null,"Déformée axiale",{"$f":"(S$38/Empilage!S$19*Empilage!S$13)*10^-1","v":{"v":0.02923204531096449,"d":"0.029"}},"mm",null,"Déformée axiale",{"$f":"(W$38/Empilage!W$19*Empilage!W$13)*10^-1","v":{"v":0.02923204531096449,"d":"0.029"}},"mm",null,"Déformée axiale",{"$f":"(AA$38/Empilage!AA$19*Empilage!AA$13)*10^-1","v":{"v":0.02923204531096449,"d":"0.029"}},"mm",null,"Déformée axiale",{"$f":"(AE$38/Empilage!AE$19*Empilage!AE$13)*10^-1","v":{"v":0.02923204531096449,"d":"0.029"}},"mm",null,"Déformée axiale",{"$f":"(AI$38/Empilage!AI$19*Empilage!AI$13)*10^-1","v":{"v":0.02923204531096449,"d":"0.029"}},"mm",null,"Déformée axiale",{"$f":"(AM$38/Empilage!AM$19*Empilage!AM$13)*10^-1","v":{"v":0.02923204531096449,"d":"0.029"}},"mm"]
[null,"Déformée radiale",{"$f":"(-Empilage!C$27/Empilage!C$19*Empilage!C$15*Detail_des_effets!C$38)*10^-1","v":{"v":-3.8762543691204425E-3,"d":"-0.004"}},"mm au diamètre",null,"Déformée radiale",{"$f":"(-Empilage!G$27/Empilage!G$19*Empilage!G$15*Detail_des_effets!G$38)*10^-1","v":{"v":-3.8762543691204425E-3,"d":"-0.004"}},"mm au diamètre",null,"Déformée radiale",{"$f":"(-Empilage!K$27/Empilage!K$19*Empilage!K$15*Detail_des_effets!K$38)*10^-1","v":{"v":-3.8762543691204425E-3,"d":"-0.004"}},"mm au diamètre",null,"Déformée radiale",{"$f":"(-Empilage!O$27/Empilage!O$19*Empilage!O$15*Detail_des_effets!O$38)*10^-1","v":{"v":-3.8762543691204425E-3,"d":"-0.004"}},"mm au diamètre",null,"Déformée radiale",{"$f":"(-Empilage!S$27/Empilage!S$19*Empilage!S$15*Detail_des_effets!S$38)*10^-1","v":{"v":-3.8762543691204425E-3,"d":"-0.004"}},"mm au diamètre",null,"Déformée radiale",{"$f":"(-Empilage!W$27/Empilage!W$19*Empilage!W$15*Detail_des_effets!W$38)*10^-1","v":{"v":-3.8762543691204425E-3,"d":"-0.004"}},"mm au diamètre",null,"Déformée radiale",{"$f":"(-Empilage!AA$27/Empilage!AA$19*Empilage!AA$15*Detail_des_effets!AA$38)*10^-1","v":{"v":-3.8762543691204425E-3,"d":"-0.004"}},"mm au diamètre",null,"Déformée radiale",{"$f":"(-Empilage!AE$27/Empilage!AE$19*Empilage!AE$15*Detail_des_effets!AE$38)*10^-1","v":{"v":-3.8762543691204425E-3,"d":"-0.004"}},"mm au diamètre",null,"Déformée radiale",{"$f":"(-Empilage!AI$27/Empilage!AI$19*Empilage!AI$15*Detail_des_effets!AI$38)*10^-1","v":{"v":-3.8762543691204425E-3,"d":"-0.004"}},"mm au diamètre",null,"Déformée radiale",{"$f":"(-Empilage!AM$27/Empilage!AM$19*Empilage!AM$15*Detail_des_effets!AM$38)*10^-1","v":{"v":-3.8762543691204425E-3,"d":"-0.004"}},"mm au diamètre"]
[null,"Dans la pièce, au diamètre particulier",{"$f":"Empilage!C$17","v":{"v":20,"d":"20.00"}},"mm",null,"Dans la pièce, au diamètre particulier",{"$f":"Empilage!G$17","v":{"v":20,"d":"20.00"}},"mm",null,"Dans la pièce, au diamètre particulier",{"$f":"Empilage!K$17","v":{"v":20,"d":"20.00"}},"mm",null,"Dans la pièce, au diamètre particulier",{"$f":"Empilage!O$17","v":{"v":20,"d":"20.00"}},"mm",null,"Dans la pièce, au diamètre particulier",{"$f":"Empilage!S$17","v":{"v":20,"d":"20.00"}},"mm",null,"Dans la pièce, au diamètre particulier",{"$f":"Empilage!W$17","v":{"v":20,"d":"20.00"}},"mm",null,"Dans la pièce, au diamètre particulier",{"$f":"Empilage!AA$17","v":{"v":20,"d":"20.00"}},"mm",null,"Dans la pièce, au diamètre particulier",{"$f":"Empilage!AE$17","v":{"v":20,"d":"20.00"}},"mm",null,"Dans la pièce, au diamètre particulier",{"$f":"Empilage!AI$17","v":{"v":20,"d":"20.00"}},"mm",null,"Dans la pièce, au diamètre particulier",{"$f":"Empilage!AM$17","v":{"v":20,"d":"20.00"}},"mm"]
[null,"Contrainte axiale",{"$f":"Empilage!$D$92*10/((PI()/4)*(Empilage!C$15^2-Empilage!C$16^2))","v":{"v":122.23099629457562,"d":"122"}},"MPa",null,"Contrainte axiale",{"$f":"Empilage!$D$92*10/((PI()/4)*(Empilage!G$15^2-Empilage!G$16^2))","v":{"v":122.23099629457562,"d":"122"}},"MPa",null,"Contrainte axiale",{"$f":"Empilage!$D$92*10/((PI()/4)*(Empilage!K$15^2-Empilage!K$16^2))","v":{"v":122.23099629457562,"d":"122"}},"MPa",null,"Contrainte axiale",{"$f":"Empilage!$D$92*10/((PI()/4)*(Empilage!O$15^2-Empilage!O$16^2))","v":{"v":122.23099629457562,"d":"122"}},"MPa",null,"Contrainte axiale",{"$f":"Empilage!$D$92*10/((PI()/4)*(Empilage!S$15^2-Empilage!S$16^2))","v":{"v":122.23099629457562,"d":"122"}},"MPa",null,"Contrainte axiale",{"$f":"Empilage!$D$92*10/((PI()/4)*(Empilage!W$15^2-Empilage!W$16^2))","v":{"v":122.23099629457562,"d":"122"}},"MPa",null,"Contrainte axiale",{"$f":"Empilage!$D$92*10/((PI()/4)*(Empilage!AA$15^2-Empilage!AA$16^2))","v":{"v":122.23099629457562,"d":"122"}},"MPa",null,"Contrainte axiale",{"$f":"Empilage!$D$92*10/((PI()/4)*(Empilage!AE$15^2-Empilage!AE$16^2))","v":{"v":122.23099629457562,"d":"122"}},"MPa",null,"Contrainte axiale",{"$f":"Empilage!$D$92*10/((PI()/4)*(Empilage!AI$15^2-Empilage!AI$16^2))","v":{"v":122.23099629457562,"d":"122"}},"MPa",null,"Contrainte axiale",{"$f":"Empilage!$D$92*10/((PI()/4)*(Empilage!AM$15^2-Empilage!AM$16^2))","v":{"v":122.23099629457562,"d":"122"}},"MPa"]
[null,"Déformée axiale",{"$f":"(C$42/Empilage!C$19*Empilage!C$13)*10^-1","v":{"v":0.02923204531096449,"d":"0.029"}},"mm",null,"Déformée axiale",{"$f":"(G$42/Empilage!G$19*Empilage!G$13)*10^-1","v":{"v":0.02923204531096449,"d":"0.029"}},"mm",null,"Déformée axiale",{"$f":"(K$42/Empilage!K$19*Empilage!K$13)*10^-1","v":{"v":0.02923204531096449,"d":"0.029"}},"mm",null,"Déformée axiale",{"$f":"(O$42/Empilage!O$19*Empilage!O$13)*10^-1","v":{"v":0.02923204531096449,"d":"0.029"}},"mm",null,"Déformée axiale",{"$f":"(S$42/Empilage!S$19*Empilage!S$13)*10^-1","v":{"v":0.02923204531096449,"d":"0.029"}},"mm",null,"Déformée axiale",{"$f":"(W$42/Empilage!W$19*Empilage!W$13)*10^-1","v":{"v":0.02923204531096449,"d":"0.029"}},"mm",null,"Déformée axiale",{"$f":"(AA$42/Empilage!AA$19*Empilage!AA$13)*10^-1","v":{"v":0.02923204531096449,"d":"0.029"}},"mm",null,"Déformée axiale",{"$f":"(AE$42/Empilage!AE$19*Empilage!AE$13)*10^-1","v":{"v":0.02923204531096449,"d":"0.029"}},"mm",null,"Déformée axiale",{"$f":"(AI$42/Empilage!AI$19*Empilage!AI$13)*10^-1","v":{"v":0.02923204531096449,"d":"0.029"}},"mm",null,"Déformée axiale",{"$f":"(AM$42/Empilage!AM$19*Empilage!AM$13)*10^-1","v":{"v":0.02923204531096449,"d":"0.029"}},"mm"]
[null,"Déformée radiale",{"$f":"(-Empilage!C$27/Empilage!C$19*C41*Detail_des_effets!C$42)*10^-1","v":{"v":-3.1010034952963545E-3,"d":"-0.003"}},"mm au diamètre",null,"Déformée radiale",{"$f":"(-Empilage!G$27/Empilage!G$19*G41*Detail_des_effets!G$42)*10^-1","v":{"v":-3.1010034952963545E-3,"d":"-0.003"}},"mm au diamètre",null,"Déformée radiale",{"$f":"(-Empilage!K$27/Empilage!K$19*K41*Detail_des_effets!K$42)*10^-1","v":{"v":-3.1010034952963545E-3,"d":"-0.003"}},"mm au diamètre",null,"Déformée radiale",{"$f":"(-Empilage!O$27/Empilage!O$19*O41*Detail_des_effets!O$42)*10^-1","v":{"v":-3.1010034952963545E-3,"d":"-0.003"}},"mm au diamètre",null,"Déformée radiale",{"$f":"(-Empilage!S$27/Empilage!S$19*S41*Detail_des_effets!S$42)*10^-1","v":{"v":-3.1010034952963545E-3,"d":"-0.003"}},"mm au diamètre",null,"Déformée radiale",{"$f":"(-Empilage!W$27/Empilage!W$19*W41*Detail_des_effets!W$42)*10^-1","v":{"v":-3.1010034952963545E-3,"d":"-0.003"}},"mm au diamètre",null,"Déformée radiale",{"$f":"(-Empilage!AA$27/Empilage!AA$19*AA41*Detail_des_effets!AA$42)*10^-1","v":{"v":-3.1010034952963545E-3,"d":"-0.003"}},"mm au diamètre",null,"Déformée radiale",{"$f":"(-Empilage!AE$27/Empilage!AE$19*AE41*Detail_des_effets!AE$42)*10^-1","v":{"v":-3.1010034952963545E-3,"d":"-0.003"}},"mm au diamètre",null,"Déformée radiale",{"$f":"(-Empilage!AI$27/Empilage!AI$19*AI41*Detail_des_effets!AI$42)*10^-1","v":{"v":-3.1010034952963545E-3,"d":"-0.003"}},"mm au diamètre",null,"Déformée radiale",{"$f":"(-Empilage!AM$27/Empilage!AM$19*AM41*Detail_des_effets!AM$42)*10^-1","v":{"v":-3.1010034952963545E-3,"d":"-0.003"}},"mm au diamètre"]
[null,"Effet de l'effort axial seul en fonctionnement",{"$nulls":3},"Effet de l'effort axial seul en fonctionnement",{"$nulls":3},"Effet de l'effort axial seul en fonctionnement",{"$nulls":3},"Effet de l'effort axial seul en fonctionnement",{"$nulls":3},"Effet de l'effort axial seul en fonctionnement",{"$nulls":3},"Effet de l'effort axial seul en fonctionnement",{"$nulls":3},"Effet de l'effort axial seul en fonctionnement",{"$nulls":3},"Effet de l'effort axial seul en fonctionnement",{"$nulls":3},"Effet de l'effort axial seul en fonctionnement",{"$nulls":3},"Effet de l'effort axial seul en fonctionnement"]
[]
[null,"Au niveau du frettage",{"$nulls":3},"Au niveau du frettage",{"$nulls":3},"Au niveau du frettage",{"$nulls":3},"Au niveau du frettage",{"$nulls":3},"Au niveau du frettage",{"$nulls":3},"Au niveau du frettage",{"$nulls":3},"Au niveau du frettage",{"$nulls":3},"Au niveau du frettage",{"$nulls":3},"Au niveau du frettage",{"$nulls":3},"Au niveau du frettage"]
[null,"Contrainte axiale",{"$f":"Empilage!$D$92*10/((PI()/4)*(Empilage!C$15^2-Empilage!C$16^2))","v":{"v":122.23099629457562,"d":"122"}},"MPa",null,"Contrainte axiale",{"$f":"Empilage!$D$92*10/((PI()/4)*(Empilage!G$15^2-Empilage!G$16^2))","v":{"v":122.23099629457562,"d":"122"}},"MPa",null,"Contrainte axiale",{"$f":"Empilage!$D$92*10/((PI()/4)*(Empilage!K$15^2-Empilage!K$16^2))","v":{"v":122.23099629457562,"d":"122"}},"MPa",null,"Contrainte axiale",{"$f":"Empilage!$D$92*10/((PI()/4)*(Empilage!O$15^2-Empilage!O$16^2))","v":{"v":122.23099629457562,"d":"122"}},"MPa",null,"Contrainte axiale",{"$f":"Empilage!$D$92*10/((PI()/4)*(Empilage!S$15^2-Empilage!S$16^2))","v":{"v":122.23099629457562,"d":"122"}},"MPa",null,"Contrainte axiale",{"$f":"Empilage!$D$92*10/((PI()/4)*(Empilage!W$15^2-Empilage!W$16^2))","v":{"v":122.23099629457562,"d":"122"}},"MPa",null,"Contrainte axiale",{"$f":"Empilage!$D$92*10/((PI()/4)*(Empilage!AA$15^2-Empilage!AA$16^2))","v":{"v":122.23099629457562,"d":"122"}},"MPa",null,"Contrainte axiale",{"$f":"Empilage!$D$92*10/((PI()/4)*(Empilage!AE$15^2-Empilage!AE$16^2))","v":{"v":122.23099629457562,"d":"122"}},"MPa",null,"Contrainte axiale",{"$f":"Empilage!$D$92*10/((PI()/4)*(Empilage!AI$15^2-Empilage!AI$16^2))","v":{"v":122.23099629457562,"d":"122"}},"MPa",null,"Contrainte axiale",{"$f":"Empilage!$D$92*10/((PI()/4)*(Empilage!AM$15^2-Empilage!AM$16^2))","v":{"v":122.23099629457562,"d":"122"}},"MPa"]
[null,"Déformée axiale",{"$f":"(C$48/Empilage!C$20*Empilage!C$13)*10^-1","v":{"v":0.02966361892815299,"d":"0.030"}},"mm",null,"Déformée axiale",{"$f":"(G$48/Empilage!G$20*Empilage!G$13)*10^-1","v":{"v":0.02966361892815299,"d":"0.030"}},"mm",null,"Déformée axiale",{"$f":"(K$48/Empilage!K$20*Empilage!K$13)*10^-1","v":{"v":0.02966361892815299,"d":"0.030"}},"mm",null,"Déformée axiale",{"$f":"(O$48/Empilage!O$20*Empilage!O$13)*10^-1","v":{"v":0.02966361892815299,"d":"0.030"}},"mm",null,"Déformée axiale",{"$f":"(S$48/Empilage!S$20*Empilage!S$13)*10^-1","v":{"v":0.02966361892815299,"d":"0.030"}},"mm",null,"Déformée axiale",{"$f":"(W$48/Empilage!W$20*Empilage!W$13)*10^-1","v":{"v":0.02966361892815299,"d":"0.030"}},"mm",null,"Déformée axiale",{"$f":"(AA$48/Empilage!AA$20*Empilage!AA$13)*10^-1","v":{"v":0.02966361892815299,"d":"0.030"}},"mm",null,"Déformée axiale",{"$f":"(AE$48/Empilage!AE$20*Empilage!AE$13)*10^-1","v":{"v":0.02966361892815299,"d":"0.030"}},"mm",null,"Déformée axiale",{"$f":"(AI$48/Empilage!AI$20*Empilage!AI$13)*10^-1","v":{"v":0.02966361892815299,"d":"0.030"}},"mm",null,"Déformée axiale",{"$f":"(AM$48/Empilage!AM$20*Empilage!AM$13)*10^-1","v":{"v":0.02966361892815299,"d":"0.030"}},"mm"]
[null,"Déformée radiale",{"$f":"(-Empilage!C$27/Empilage!C$20*Empilage!C$15*Detail_des_effets!C$48)*10^-1","v":{"v":-0.003933482288050788,"d":"-0.004"}},"mm au diamètre",null,"Déformée radiale",{"$f":"(-Empilage!G$27/Empilage!G$20*Empilage!G$15*Detail_des_effets!G$48)*10^-1","v":{"v":-0.003933482288050788,"d":"-0.004"}},"mm au diamètre",null,"Déformée radiale",{"$f":"(-Empilage!K$27/Empilage!K$20*Empilage!K$15*Detail_des_effets!K$48)*10^-1","v":{"v":-0.003933482288050788,"d":"-0.004"}},"mm au diamètre",null,"Déformée radiale",{"$f":"(-Empilage!O$27/Empilage!O$20*Empilage!O$15*Detail_des_effets!O$48)*10^-1","v":{"v":-0.003933482288050788,"d":"-0.004"}},"mm au diamètre",null,"Déformée radiale",{"$f":"(-Empilage!S$27/Empilage!S$20*Empilage!S$15*Detail_des_effets!S$48)*10^-1","v":{"v":-0.003933482288050788,"d":"-0.004"}},"mm au diamètre",null,"Déformée radiale",{"$f":"(-Empilage!W$27/Empilage!W$20*Empilage!W$15*Detail_des_effets!W$48)*10^-1","v":{"v":-0.003933482288050788,"d":"-0.004"}},"mm au diamètre",null,"Déformée radiale",{"$f":"(-Empilage!AA$27/Empilage!AA$20*Empilage!AA$15*Detail_des_effets!AA$48)*10^-1","v":{"v":-0.003933482288050788,"d":"-0.004"}},"mm au diamètre",null,"Déformée radiale",{"$f":"(-Empilage!AE$27/Empilage!AE$20*Empilage!AE$15*Detail_des_effets!AE$48)*10^-1","v":{"v":-0.003933482288050788,"d":"-0.004"}},"mm au diamètre",null,"Déformée radiale",{"$f":"(-Empilage!AI$27/Empilage!AI$20*Empilage!AI$15*Detail_des_effets!AI$48)*10^-1","v":{"v":-0.003933482288050788,"d":"-0.004"}},"mm au diamètre",null,"Déformée radiale",{"$f":"(-Empilage!AM$27/Empilage!AM$20*Empilage!AM$15*Detail_des_effets!AM$48)*10^-1","v":{"v":-0.003933482288050788,"d":"-0.004"}},"mm au diamètre"]
[null,"Dans la pièce, au diamètre particulier",{"$f":"Empilage!C$17","v":{"v":20,"d":"20.00"}},"mm",null,"Dans la pièce, au diamètre particulier",{"$f":"Empilage!G$17","v":{"v":20,"d":"20.00"}},"mm",null,"Dans la pièce, au diamètre particulier",{"$f":"Empilage!K$17","v":{"v":20,"d":"20.00"}},"mm",null,"Dans la pièce, au diamètre particulier",{"$f":"Empilage!O$17","v":{"v":20,"d":"20.00"}},"mm",null,"Dans la pièce, au diamètre particulier",{"$f":"Empilage!S$17","v":{"v":20,"d":"20.00"}},"mm",null,"Dans la pièce, au diamètre particulier",{"$f":"Empilage!W$17","v":{"v":20,"d":"20.00"}},"mm",null,"Dans la pièce, au diamètre particulier",{"$f":"Empilage!AA$17","v":{"v":20,"d":"20.00"}},"mm",null,"Dans la pièce, au diamètre particulier",{"$f":"Empilage!AE$17","v":{"v":20,"d":"20.00"}},"mm",null,"Dans la pièce, au diamètre particulier",{"$f":"Empilage!AI$17","v":{"v":20,"d":"20.00"}},"mm",null,"Dans la pièce, au diamètre particulier",{"$f":"Empilage!AM$17","v":{"v":20,"d":"20.00"}},"mm"]
[null,"Contrainte axiale",{"$f":"Empilage!$D$92*10/((PI()/4)*(Empilage!C$15^2-Empilage!C$16^2))","v":{"v":122.23099629457562,"d":"122"}},"MPa",null,"Contrainte axiale",{"$f":"Empilage!$D$92*10/((PI()/4)*(Empilage!G$15^2-Empilage!G$16^2))","v":{"v":122.23099629457562,"d":"122"}},"MPa",null,"Contrainte axiale",{"$f":"Empilage!$D$92*10/((PI()/4)*(Empilage!K$15^2-Empilage!K$16^2))","v":{"v":122.23099629457562,"d":"122"}},"MPa",null,"Contrainte axiale",{"$f":"Empilage!$D$92*10/((PI()/4)*(Empilage!O$15^2-Empilage!O$16^2))","v":{"v":122.23099629457562,"d":"122"}},"MPa",null,"Contrainte axiale",{"$f":"Empilage!$D$92*10/((PI()/4)*(Empilage!S$15^2-Empilage!S$16^2))","v":{"v":122.23099629457562,"d":"122"}},"MPa",null,"Contrainte axiale",{"$f":"Empilage!$D$92*10/((PI()/4)*(Empilage!W$15^2-Empilage!W$16^2))","v":{"v":122.23099629457562,"d":"122"}},"MPa",null,"Contrainte axiale",{"$f":"Empilage!$D$92*10/((PI()/4)*(Empilage!AA$15^2-Empilage!AA$16^2))","v":{"v":122.23099629457562,"d":"122"}},"MPa",null,"Contrainte axiale",{"$f":"Empilage!$D$92*10/((PI()/4)*(Empilage!AE$15^2-Empilage!AE$16^2))","v":{"v":122.23099629457562,"d":"122"}},"MPa",null,"Contrainte axiale",{"$f":"Empilage!$D$92*10/((PI()/4)*(Empilage!AI$15^2-Empilage!AI$16^2))","v":{"v":122.23099629457562,"d":"122"}},"MPa",null,"Contrainte axiale",{"$f":"Empilage!$D$92*10/((PI()/4)*(Empilage!AM$15^2-Empilage!AM$16^2))","v":{"v":122.23099629457562,"d":"122"}},"MPa"]
[null,"Déformée axiale",{"$f":"(C$52/Empilage!C$20*Empilage!C$13)*10^-1","v":{"v":0.02966361892815299,"d":"0.030"}},"mm",null,"Déformée axiale",{"$f":"(G$52/Empilage!G$20*Empilage!G$13)*10^-1","v":{"v":0.02966361892815299,"d":"0.030"}},"mm",null,"Déformée axiale",{"$f":"(K$52/Empilage!K$20*Empilage!K$13)*10^-1","v":{"v":0.02966361892815299,"d":"0.030"}},"mm",null,"Déformée axiale",{"$f":"(O$52/Empilage!O$20*Empilage!O$13)*10^-1","v":{"v":0.02966361892815299,"d":"0.030"}},"mm",null,"Déformée axiale",{"$f":"(S$52/Empilage!S$20*Empilage!S$13)*10^-1","v":{"v":0.02966361892815299,"d":"0.030"}},"mm",null,"Déformée axiale",{"$f":"(W$52/Empilage!W$20*Empilage!W$13)*10^-1","v":{"v":0.02966361892815299,"d":"0.030"}},"mm",null,"Déformée axiale",{"$f":"(AA$52/Empilage!AA$20*Empilage!AA$13)*10^-1","v":{"v":0.02966361892815299,"d":"0.030"}},"mm",null,"Déformée axiale",{"$f":"(AE$52/Empilage!AE$20*Empilage!AE$13)*10^-1","v":{"v":0.02966361892815299,"d":"0.030"}},"mm",null,"Déformée axiale",{"$f":"(AI$52/Empilage!AI$20*Empilage!AI$13)*10^-1","v":{"v":0.02966361892815299,"d":"0.030"}},"mm",null,"Déformée axiale",{"$f":"(AM$52/Empilage!AM$20*Empilage!AM$13)*10^-1","v":{"v":0.02966361892815299,"d":"0.030"}},"mm"]
[null,"Déformée radiale",{"$f":"(-Empilage!C$27/Empilage!C$20*C51*Detail_des_effets!C$52)*10^-1","v":{"v":-3.1467858304406304E-3,"d":"-0.003"}},"mm au diamètre",null,"Déformée radiale",{"$f":"(-Empilage!G$27/Empilage!G$20*G51*Detail_des_effets!G$52)*10^-1","v":{"v":-3.1467858304406304E-3,"d":"-0.003"}},"mm au diamètre",null,"Déformée radiale",{"$f":"(-Empilage!K$27/Empilage!K$20*K51*Detail_des_effets!K$52)*10^-1","v":{"v":-3.1467858304406304E-3,"d":"-0.003"}},"mm au diamètre",null,"Déformée radiale",{"$f":"(-Empilage!O$27/Empilage!O$20*O51*Detail_des_effets!O$52)*10^-1","v":{"v":-3.1467858304406304E-3,"d":"-0.003"}},"mm au diamètre",null,"Déformée radiale",{"$f":"(-Empilage!S$27/Empilage!S$20*S51*Detail_des_effets!S$52)*10^-1","v":{"v":-3.1467858304406304E-3,"d":"-0.003"}},"mm au diamètre",null,"Déformée radiale",{"$f":"(-Empilage!W$27/Empilage!W$20*W51*Detail_des_effets!W$52)*10^-1","v":{"v":-3.1467858304406304E-3,"d":"-0.003"}},"mm au diamètre",null,"Déformée radiale",{"$f":"(-Empilage!AA$27/Empilage!AA$20*AA51*Detail_des_effets!AA$52)*10^-1","v":{"v":-3.1467858304406304E-3,"d":"-0.003"}},"mm au diamètre",null,"Déformée radiale",{"$f":"(-Empilage!AE$27/Empilage!AE$20*AE51*Detail_des_effets!AE$52)*10^-1","v":{"v":-3.1467858304406304E-3,"d":"-0.003"}},"mm au diamètre",null,"Déformée radiale",{"$f":"(-Empilage!AI$27/Empilage!AI$20*AI51*Detail_des_effets!AI$52)*10^-1","v":{"v":-3.1467858304406304E-3,"d":"-0.003"}},"mm au diamètre",null,"Déformée radiale",{"$f":"(-Empilage!AM$27/Empilage!AM$20*AM51*Detail_des_effets!AM$52)*10^-1","v":{"v":-3.1467858304406304E-3,"d":"-0.003"}},"mm au diamètre"]
[null,"Effet du frettage seul en montage",{"$nulls":3},"Effet du frettage seul en montage",{"$nulls":3},"Effet du frettage seul en montage",{"$nulls":3},"Effet du frettage seul en montage",{"$nulls":3},"Effet du frettage seul en montage",{"$nulls":3},"Effet du frettage seul en montage",{"$nulls":3},"Effet du frettage seul en montage",{"$nulls":3},"Effet du frettage seul en montage",{"$nulls":3},"Effet du frettage seul en montage",{"$nulls":3},"Effet du frettage seul en montage"]
[]
[null,"Pression de contact","Empilage!/Empilage!/(Constantes_de_frettage!-Constantes_de_frettage!) * 0.001","MPa",null,"Pression de contact","Empilage!/Empilage!/(Constantes_de_frettage!-Constantes_de_frettage!) * 0.001","MPa",null,"Pression de contact","Empilage!/Empilage!/(Constantes_de_frettage!-Constantes_de_frettage!) * 0.001","MPa",null,"Pression de contact","Empilage!/Empilage!/(Constantes_de_frettage!-Constantes_de_frettage!) * 0.001","MPa",null,"Pression de contact","Empilage!/Empilage!/(Constantes_de_frettage!-Constantes_de_frettage!) * 0.001","MPa",null,"Pression de contact","Empilage!/Empilage!/(Constantes_de_frettage!-Constantes_de_frettage!) * 0.001","MPa",null,"Pression de contact","Empilage!/Empilage!/(Constantes_de_frettage!-Constantes_de_frettage!) * 0.001","MPa",null,"Pression de contact","Empilage!/Empilage!/(Constantes_de_frettage!-Constantes_de_frettage!) * 0.001","MPa",null,"Pression de contact","Empilage!/Empilage!/(Constantes_de_frettage!-Constantes_de_frettage!) * 0.001","MPa",null,"Pression de contact","Empilage!/Empilage!/(Constantes_de_frettage!-Constantes_de_frettage!) * 0.001","MPa"]
[null,"Au niveau du frettage",{"$nulls":3},"Au niveau du frettage",{"$nulls":3},"Au niveau du frettage",{"$nulls":3},"Au niveau du frettage",{"$nulls":3},"Au niveau du frettage",{"$nulls":3},"Au niveau du frettage",{"$nulls":3},"Au niveau du frettage",{"$nulls":3},"Au niveau du frettage",{"$nulls":3},"Au niveau du frettage",{"$nulls":3},"Au niveau du frettage"]
[null,"Contrainte radiale",{"$f":"-C57","v":{"$error":"#VALUE!"}},"MPa",null,"Contrainte radiale",{"$f":"-G57","v":{"$error":"#VALUE!"}},"MPa",null,"Contrainte radiale",{"$f":"-K57","v":{"$error":"#VALUE!"}},"MPa",null,"Contrainte radiale",{"$f":"-O57","v":{"$error":"#VALUE!"}},"MPa",null,"Contrainte radiale",{"$f":"-S57","v":{"$error":"#VALUE!"}},"MPa",null,"Contrainte radiale",{"$f":"-W57","v":{"$error":"#VALUE!"}},"MPa",null,"Contrainte radiale",{"$f":"-AA57","v":{"$error":"#VALUE!"}},"MPa",null,"Contrainte radiale",{"$f":"-AE57","v":{"$error":"#VALUE!"}},"MPa",null,"Contrainte radiale",{"$f":"-AI57","v":{"$error":"#VALUE!"}},"MPa",null,"Contrainte radiale",{"$f":"-AM57","v":{"$error":"#VALUE!"}},"MPa"]
[null,"Contrainte tangentielle",{"$f":"-C57*(Empilage!C15^2+Empilage!C16^2)/(Empilage!C15^2-Empilage!C16^2)","v":{"$error":"#VALUE!"}},"MPa",null,"Contrainte tangentielle",{"$f":"-G57*(Empilage!G15^2+Empilage!G16^2)/(Empilage!G15^2-Empilage!G16^2)","v":{"$error":"#VALUE!"}},"MPa",null,"Contrainte tangentielle",{"$f":"-K57*(Empilage!K15^2+Empilage!K16^2)/(Empilage!K15^2-Empilage!K16^2)","v":{"$error":"#VALUE!"}},"MPa",null,"Contrainte tangentielle",{"$f":"-O57*(Empilage!O15^2+Empilage!O16^2)/(Empilage!O15^2-Empilage!O16^2)","v":{"$error":"#VALUE!"}},"MPa",null,"Contrainte tangentielle",{"$f":"-S57*(Empilage!S15^2+Empilage!S16^2)/(Empilage!S15^2-Empilage!S16^2)","v":{"$error":"#VALUE!"}},"MPa",null,"Contrainte tangentielle",{"$f":"-W57*(Empilage!W15^2+Empilage!W16^2)/(Empilage!W15^2-Empilage!W16^2)","v":{"$error":"#VALUE!"}},"MPa",null,"Contrainte tangentielle",{"$f":"-AA57*(Empilage!AA15^2+Empilage!AA16^2)/(Empilage!AA15^2-Empilage!AA16^2)","v":{"$error":"#VALUE!"}},"MPa",null,"Contrainte tangentielle",{"$f":"-AE57*(Empilage!AE15^2+Empilage!AE16^2)/(Empilage!AE15^2-Empilage!AE16^2)","v":{"$error":"#VALUE!"}},"MPa",null,"Contrainte tangentielle",{"$f":"-AI57*(Empilage!AI15^2+Empilage!AI16^2)/(Empilage!AI15^2-Empilage!AI16^2)","v":{"$error":"#VALUE!"}},"MPa",null,"Contrainte tangentielle",{"$f":"-AM57*(Empilage!AM15^2+Empilage!AM16^2)/(Empilage!AM15^2-Empilage!AM16^2)","v":{"$error":"#VALUE!"}},"MPa"]
[null,"Déformée radiale",{"$f":"Empilage!C15*((C60-Empilage!C$27*Detail_des_effets!C59)/Empilage!C18)*10^-1","v":{"$error":"#VALUE!"}},"mm au diamètre",null,"Déformée radiale",{"$f":"Empilage!G15*((G60-Empilage!G$27*Detail_des_effets!G59)/Empilage!G18)*10^-1","v":{"$error":"#VALUE!"}},"mm au diamètre",null,"Déformée radiale",{"$f":"Empilage!K15*((K60-Empilage!K$27*Detail_des_effets!K59)/Empilage!K18)*10^-1","v":{"$error":"#VALUE!"}},"mm au diamètre",null,"Déformée radiale",{"$f":"Empilage!O15*((O60-Empilage!O$27*Detail_des_effets!O59)/Empilage!O18)*10^-1","v":{"$error":"#VALUE!"}},"mm au diamètre",null,"Déformée radiale",{"$f":"Empilage!S15*((S60-Empilage!S$27*Detail_des_effets!S59)/Empilage!S18)*10^-1","v":{"$error":"#VALUE!"}},"mm au diamètre",null,"Déformée radiale",{"$f":"Empilage!W15*((W60-Empilage!W$27*Detail_des_effets!W59)/Empilage!W18)*10^-1","v":{"$error":"#VALUE!"}},"mm au diamètre",null,"Déformée radiale",{"$f":"Empilage!AA15*((AA60-Empilage!AA$27*Detail_des_effets!AA59)/Empilage!AA18)*10^-1","v":{"$error":"#VALUE!"}},"mm au diamètre",null,"Déformée radiale",{"$f":"Empilage!AE15*((AE60-Empilage!AE$27*Detail_des_effets!AE59)/Empilage!AE18)*10^-1","v":{"$error":"#VALUE!"}},"mm au diamètre",null,"Déformée radiale",{"$f":"Empilage!AI15*((AI60-Empilage!AI$27*Detail_des_effets!AI59)/Empilage!AI18)*10^-1","v":{"$error":"#VALUE!"}},"mm au diamètre",null,"Déformée radiale",{"$f":"Empilage!AM15*((AM60-Empilage!AM$27*Detail_des_effets!AM59)/Empilage!AM18)*10^-1","v":{"$error":"#VALUE!"}},"mm au diamètre"]
[null,"Dans la pièce, au diamètre particulier",{"$f":"Empilage!C$17","v":{"v":20,"d":"20.00"}},"mm",null,"Dans la pièce, au diamètre particulier",{"$f":"Empilage!G$17","v":{"v":20,"d":"20.00"}},"mm",null,"Dans la pièce, au diamètre particulier",{"$f":"Empilage!K$17","v":{"v":20,"d":"20.00"}},"mm",null,"Dans la pièce, au diamètre particulier",{"$f":"Empilage!O$17","v":{"v":20,"d":"20.00"}},"mm",null,"Dans la pièce, au diamètre particulier",{"$f":"Empilage!S$17","v":{"v":20,"d":"20.00"}},"mm",null,"Dans la pièce, au diamètre particulier",{"$f":"Empilage!W$17","v":{"v":20,"d":"20.00"}},"mm",null,"Dans la pièce, au diamètre particulier",{"$f":"Empilage!AA$17","v":{"v":20,"d":"20.00"}},"mm",null,"Dans la pièce, au diamètre particulier",{"$f":"Empilage!AE$17","v":{"v":20,"d":"20.00"}},"mm",null,"Dans la pièce, au diamètre particulier",{"$f":"Empilage!AI$17","v":{"v":20,"d":"20.00"}},"mm",null,"Dans la pièce, au diamètre particulier",{"$f":"Empilage!AM$17","v":{"v":20,"d":"20.00"}},"mm"]
[null,"Contrainte radiale",{"$f":"-C57*(Empilage!C$15^2/(Empilage!C$15^2-Empilage!C$16^2))*(1-(Empilage!C$16^2/Empilage!C$17^2))","v":{"$error":"#VALUE!"}},"MPa",null,"Contrainte radiale",{"$f":"-G57*(Empilage!G$15^2/(Empilage!G$15^2-Empilage!G$16^2))*(1-(Empilage!G$16^2/Empilage!G$17^2))","v":{"$error":"#VALUE!"}},"MPa",null,"Contrainte radiale",{"$f":"-K57*(Empilage!K$15^2/(Empilage!K$15^2-Empilage!K$16^2))*(1-(Empilage!K$16^2/Empilage!K$17^2))","v":{"$error":"#VALUE!"}},"MPa",null,"Contrainte radiale",{"$f":"-O57*(Empilage!O$15^2/(Empilage!O$15^2-Empilage!O$16^2))*(1-(Empilage!O$16^2/Empilage!O$17^2))","v":{"$error":"#VALUE!"}},"MPa",null,"Contrainte radiale",{"$f":"-S57*(Empilage!S$15^2/(Empilage!S$15^2-Empilage!S$16^2))*(1-(Empilage!S$16^2/Empilage!S$17^2))","v":{"$error":"#VALUE!"}},"MPa",null,"Contrainte radiale",{"$f":"-W57*(Empilage!W$15^2/(Empilage!W$15^2-Empilage!W$16^2))*(1-(Empilage!W$16^2/Empilage!W$17^2))","v":{"$error":"#VALUE!"}},"MPa",null,"Contrainte radiale",{"$f":"-AA57*(Empilage!AA$15^2/(Empilage!AA$15^2-Empilage!AA$16^2))*(1-(Empilage!AA$16^2/Empilage!AA$17^2))","v":{"$error":"#VALUE!"}},"MPa",null,"Contrainte radiale",{"$f":"-AE57*(Empilage!AE$15^2/(Empilage!AE$15^2-Empilage!AE$16^2))*(1-(Empilage!AE$16^2/Empilage!AE$17^2))","v":{"$error":"#VALUE!"}},"MPa",null,"Contrainte radiale",{"$f":"-AI57*(Empilage!AI$15^2/(Empilage!AI$15^2-Empilage!AI$16^2))*(1-(Empilage!AI$16^2/Empilage!AI$17^2))","v":{"$error":"#VALUE!"}},"MPa",null,"Contrainte radiale",{"$f":"-AM57*(Empilage!AM$15^2/(Empilage!AM$15^2-Empilage!AM$16^2))*(1-(Empilage!AM$16^2/Empilage!AM$17^2))","v":{"$error":"#VALUE!"}},"MPa"]
[null,"Contrainte tangentielle",{"$f":"-C57*(Empilage!C$15^2/(Empilage!C$15^2-Empilage!C$16^2))*(1+(Empilage!C$16^2/Empilage!C$17^2))","v":{"$error":"#VALUE!"}},"MPa",null,"Contrainte tangentielle",{"$f":"-G57*(Empilage!G$15^2/(Empilage!G$15^2-Empilage!G$16^2))*(1+(Empilage!G$16^2/Empilage!G$17^2))","v":{"$error":"#VALUE!"}},"MPa",null,"Contrainte tangentielle",{"$f":"-K57*(Empilage!K$15^2/(Empilage!K$15^2-Empilage!K$16^2))*(1+(Empilage!K$16^2/Empilage!K$17^2))","v":{"$error":"#VALUE!"}},"MPa",null,"Contrainte tangentielle",{"$f":"-O57*(Empilage!O$15^2/(Empilage!O$15^2-Empilage!O$16^2))*(1+(Empilage!O$16^2/Empilage!O$17^2))","v":{"$error":"#VALUE!"}},"MPa",null,"Contrainte tangentielle",{"$f":"-S57*(Empilage!S$15^2/(Empilage!S$15^2-Empilage!S$16^2))*(1+(Empilage!S$16^2/Empilage!S$17^2))","v":{"$error":"#VALUE!"}},"MPa",null,"Contrainte tangentielle",{"$f":"-W57*(Empilage!W$15^2/(Empilage!W$15^2-Empilage!W$16^2))*(1+(Empilage!W$16^2/Empilage!W$17^2))","v":{"$error":"#VALUE!"}},"MPa",null,"Contrainte tangentielle",{"$f":"-AA57*(Empilage!AA$15^2/(Empilage!AA$15^2-Empilage!AA$16^2))*(1+(Empilage!AA$16^2/Empilage!AA$17^2))","v":{"$error":"#VALUE!"}},"MPa",null,"Contrainte tangentielle",{"$f":"-AE57*(Empilage!AE$15^2/(Empilage!AE$15^2-Empilage!AE$16^2))*(1+(Empilage!AE$16^2/Empilage!AE$17^2))","v":{"$error":"#VALUE!"}},"MPa",null,"Contrainte tangentielle",{"$f":"-AI57*(Empilage!AI$15^2/(Empilage!AI$15^2-Empilage!AI$16^2))*(1+(Empilage!AI$16^2/Empilage!AI$17^2))","v":{"$error":"#VALUE!"}},"MPa",null,"Contrainte tangentielle",{"$f":"-AM57*(Empilage!AM$15^2/(Empilage!AM$15^2-Empilage!AM$16^2))*(1+(Empilage!AM$16^2/Empilage!AM$17^2))","v":{"$error":"#VALUE!"}},"MPa"]
[null,"Déformée radiale",{"$f":"C62*((C64-Empilage!C$27*Detail_des_effets!C63)/Empilage!C18)*10^-1","v":{"$error":"#VALUE!"}},"mm au diamètre",null,"Déformée radiale",{"$f":"G62*((G64-Empilage!G$27*Detail_des_effets!G63)/Empilage!G18)*10^-1","v":{"$error":"#VALUE!"}},"mm au diamètre",null,"Déformée radiale",{"$f":"K62*((K64-Empilage!K$27*Detail_des_effets!K63)/Empilage!K18)*10^-1","v":{"$error":"#VALUE!"}},"mm au diamètre",null,"Déformée radiale",{"$f":"O62*((O64-Empilage!O$27*Detail_des_effets!O63)/Empilage!O18)*10^-1","v":{"$error":"#VALUE!"}},"mm au diamètre",null,"Déformée radiale",{"$f":"S62*((S64-Empilage!S$27*Detail_des_effets!S63)/Empilage!S18)*10^-1","v":{"$error":"#VALUE!"}},"mm au diamètre",null,"Déformée radiale",{"$f":"W62*((W64-Empilage!W$27*Detail_des_effets!W63)/Empilage!W18)*10^-1","v":{"$error":"#VALUE!"}},"mm au diamètre",null,"Déformée radiale",{"$f":"AA62*((AA64-Empilage!AA$27*Detail_des_effets!AA63)/Empilage!AA18)*10^-1","v":{"$error":"#VALUE!"}},"mm au diamètre",null,"Déformée radiale",{"$f":"AE62*((AE64-Empilage!AE$27*Detail_des_effets!AE63)/Empilage!AE18)*10^-1","v":{"$error":"#VALUE!"}},"mm au diamètre",null,"Déformée radiale",{"$f":"AI62*((AI64-Empilage!AI$27*Detail_des_effets!AI63)/Empilage!AI18)*10^-1","v":{"$error":"#VALUE!"}},"mm au diamètre",null,"Déformée radiale",{"$f":"AM62*((AM64-Empilage!AM$27*Detail_des_effets!AM63)/Empilage!AM18)*10^-1","v":{"$error":"#VALUE!"}},"mm au diamètre"]
[null,"Effet du frettage seul en mise en froid",{"$nulls":3},"Effet du frettage seul en mise en froid",{"$nulls":3},"Effet du frettage seul en mise en froid",{"$nulls":3},"Effet du frettage seul en mise en froid",{"$nulls":3},"Effet du frettage seul en mise en froid",{"$nulls":3},"Effet du frettage seul en mise en froid",{"$nulls":3},"Effet du frettage seul en mise en froid",{"$nulls":3},"Effet du frettage seul en mise en froid",{"$nulls":3},"Effet du frettage seul en mise en froid",{"$nulls":3},"Effet du frettage seul en mise en froid"]
[]
[null,"Pression de contact","Empilage!/Empilage!/(Constantes_de_frettage!-Constantes_de_frettage!) * 0.001","MPa",null,"Pression de contact","Empilage!/Empilage!/(Constantes_de_frettage!-Constantes_de_frettage!) * 0.001","MPa",null,"Pression de contact","Empilage!/Empilage!/(Constantes_de_frettage!-Constantes_de_frettage!) * 0.001","MPa",null,"Pression de contact","Empilage!/Empilage!/(Constantes_de_frettage!-Constantes_de_frettage!) * 0.001","MPa",null,"Pression de contact","Empilage!/Empilage!/(Constantes_de_frettage!-Constantes_de_frettage!) * 0.001","MPa",null,"Pression de contact","Empilage!/Empilage!/(Constantes_de_frettage!-Constantes_de_frettage!) * 0.001","MPa",null,"Pression de contact","Empilage!/Empilage!/(Constantes_de_frettage!-Constantes_de_frettage!) * 0.001","MPa",null,"Pression de contact","Empilage!/Empilage!/(Constantes_de_frettage!-Constantes_de_frettage!) * 0.001","MPa",null,"Pression de contact","Empilage!/Empilage!/(Constantes_de_frettage!-Constantes_de_frettage!) * 0.001","MPa",null,"Pression de contact","Empilage!/Empilage!/(Constantes_de_frettage!-Constantes_de_frettage!) * 0.001","MPa"]
[null,"Au niveau du frettage",{"$nulls":3},"Au niveau du frettage",{"$nulls":3},"Au niveau du frettage",{"$nulls":3},"Au niveau du frettage",{"$nulls":3},"Au niveau du frettage",{"$nulls":3},"Au niveau du frettage",{"$nulls":3},"Au niveau du frettage",{"$nulls":3},"Au niveau du frettage",{"$nulls":3},"Au niveau du frettage",{"$nulls":3},"Au niveau du frettage"]
[null,"Contrainte radiale",{"$f":"-C68","v":{"$error":"#VALUE!"}},"MPa",null,"Contrainte radiale",{"$f":"-G68","v":{"$error":"#VALUE!"}},"MPa",null,"Contrainte radiale",{"$f":"-K68","v":{"$error":"#VALUE!"}},"MPa",null,"Contrainte radiale",{"$f":"-O68","v":{"$error":"#VALUE!"}},"MPa",null,"Contrainte radiale",{"$f":"-S68","v":{"$error":"#VALUE!"}},"MPa",null,"Contrainte radiale",{"$f":"-W68","v":{"$error":"#VALUE!"}},"MPa",null,"Contrainte radiale",{"$f":"-AA68","v":{"$error":"#VALUE!"}},"MPa",null,"Contrainte radiale",{"$f":"-AE68","v":{"$error":"#VALUE!"}},"MPa",null,"Contrainte radiale",{"$f":"-AI68","v":{"$error":"#VALUE!"}},"MPa",null,"Contrainte radiale",{"$f":"-AM68","v":{"$error":"#VALUE!"}},"MPa"]
[null,"Contrainte tangentielle",{"$f":"-C68*(Empilage!C15^2+Empilage!C16^2)/(Empilage!C15^2-Empilage!C16^2)","v":{"$error":"#VALUE!"}},"MPa",null,"Contrainte tangentielle",{"$f":"-G68*(Empilage!G15^2+Empilage!G16^2)/(Empilage!G15^2-Empilage!G16^2)","v":{"$error":"#VALUE!"}},"MPa",null,"Contrainte tangentielle",{"$f":"-K68*(Empilage!K15^2+Empilage!K16^2)/(Empilage!K15^2-Empilage!K16^2)","v":{"$error":"#VALUE!"}},"MPa",null,"Contrainte tangentielle",{"$f":"-O68*(Empilage!O15^2+Empilage!O16^2)/(Empilage!O15^2-Empilage!O16^2)","v":{"$error":"#VALUE!"}},"MPa",null,"Contrainte tangentielle",{"$f":"-S68*(Empilage!S15^2+Empilage!S16^2)/(Empilage!S15^2-Empilage!S16^2)","v":{"$error":"#VALUE!"}},"MPa",null,"Contrainte tangentielle",{"$f":"-W68*(Empilage!W15^2+Empilage!W16^2)/(Empilage!W15^2-Empilage!W16^2)","v":{"$error":"#VALUE!"}},"MPa",null,"Contrainte tangentielle",{"$f":"-AA68*(Empilage!AA15^2+Empilage!AA16^2)/(Empilage!AA15^2-Empilage!AA16^2)","v":{"$error":"#VALUE!"}},"MPa",null,"Contrainte tangentielle",{"$f":"-AE68*(Empilage!AE15^2+Empilage!AE16^2)/(Empilage!AE15^2-Empilage!AE16^2)","v":{"$error":"#VALUE!"}},"MPa",null,"Contrainte tangentielle",{"$f":"-AI68*(Empilage!AI15^2+Empilage!AI16^2)/(Empilage!AI15^2-Empilage!AI16^2)","v":{"$error":"#VALUE!"}},"MPa",null,"Contrainte tangentielle",{"$f":"-AM68*(Empilage!AM15^2+Empilage!AM16^2)/(Empilage!AM15^2-Empilage!AM16^2)","v":{"$error":"#VALUE!"}},"MPa"]
[null,"Déformée radiale",{"$f":"Empilage!C15*((C71-Empilage!C$27*Detail_des_effets!C70)/Empilage!C19)*10^-1","v":{"$error":"#VALUE!"}},"mm au diamètre",null,"Déformée radiale",{"$f":"Empilage!G15*((G71-Empilage!G$27*Detail_des_effets!G70)/Empilage!G19)*10^-1","v":{"$error":"#VALUE!"}},"mm au diamètre",null,"Déformée radiale",{"$f":"Empilage!K15*((K71-Empilage!K$27*Detail_des_effets!K70)/Empilage!K19)*10^-1","v":{"$error":"#VALUE!"}},"mm au diamètre",null,"Déformée radiale",{"$f":"Empilage!O15*((O71-Empilage!O$27*Detail_des_effets!O70)/Empilage!O19)*10^-1","v":{"$error":"#VALUE!"}},"mm au diamètre",null,"Déformée radiale",{"$f":"Empilage!S15*((S71-Empilage!S$27*Detail_des_effets!S70)/Empilage!S19)*10^-1","v":{"$error":"#VALUE!"}},"mm au diamètre",null,"Déformée radiale",{"$f":"Empilage!W15*((W71-Empilage!W$27*Detail_des_effets!W70)/Empilage!W19)*10^-1","v":{"$error":"#VALUE!"}},"mm au diamètre",null,"Déformée radiale",{"$f":"Empilage!AA15*((AA71-Empilage!AA$27*Detail_des_effets!AA70)/Empilage!AA19)*10^-1","v":{"$error":"#VALUE!"}},"mm au diamètre",null,"Déformée radiale",{"$f":"Empilage!AE15*((AE71-Empilage!AE$27*Detail_des_effets!AE70)/Empilage!AE19)*10^-1","v":{"$error":"#VALUE!"}},"mm au diamètre",null,"Déformée radiale",{"$f":"Empilage!AI15*((AI71-Empilage!AI$27*Detail_des_effets!AI70)/Empilage!AI19)*10^-1","v":{"$error":"#VALUE!"}},"mm au diamètre",null,"Déformée radiale",{"$f":"Empilage!AM15*((AM71-Empilage!AM$27*Detail_des_effets!AM70)/Empilage!AM19)*10^-1","v":{"$error":"#VALUE!"}},"mm au diamètre"]
[null,"Dans la pièce, au diamètre particulier",{"$f":"Empilage!C$17","v":{"v":20,"d":"20.00"}},"mm",null,"Dans la pièce, au diamètre particulier",{"$f":"Empilage!G$17","v":{"v":20,"d":"20.00"}},"mm",null,"Dans la pièce, au diamètre particulier",{"$f":"Empilage!K$17","v":{"v":20,"d":"20.00"}},"mm",null,"Dans la pièce, au diamètre particulier",{"$f":"Empilage!O$17","v":{"v":20,"d":"20.00"}},"mm",null,"Dans la pièce, au diamètre particulier",{"$f":"Empilage!S$17","v":{"v":20,"d":"20.00"}},"mm",null,"Dans la pièce, au diamètre particulier",{"$f":"Empilage!W$17","v":{"v":20,"d":"20.00"}},"mm",null,"Dans la pièce, au diamètre particulier",{"$f":"Empilage!AA$17","v":{"v":20,"d":"20.00"}},"mm",null,"Dans la pièce, au diamètre particulier",{"$f":"Empilage!AE$17","v":{"v":20,"d":"20.00"}},"mm",null,"Dans la pièce, au diamètre particulier",{"$f":"Empilage!AI$17","v":{"v":20,"d":"20.00"}},"mm",null,"Dans la pièce, au diamètre particulier",{"$f":"Empilage!AM$17","v":{"v":20,"d":"20.00"}},"mm"]
[null,"Contrainte radiale",{"$f":"-C68*(Empilage!C$15^2/(Empilage!C$15^2-Empilage!C$16^2))*(1-(Empilage!C$16^2/Empilage!C$17^2))","v":{"$error":"#VALUE!"}},"MPa",null,"Contrainte radiale",{"$f":"-G68*(Empilage!G$15^2/(Empilage!G$15^2-Empilage!G$16^2))*(1-(Empilage!G$16^2/Empilage!G$17^2))","v":{"$error":"#VALUE!"}},"MPa",null,"Contrainte radiale",{"$f":"-K68*(Empilage!K$15^2/(Empilage!K$15^2-Empilage!K$16^2))*(1-(Empilage!K$16^2/Empilage!K$17^2))","v":{"$error":"#VALUE!"}},"MPa",null,"Contrainte radiale",{"$f":"-O68*(Empilage!O$15^2/(Empilage!O$15^2-Empilage!O$16^2))*(1-(Empilage!O$16^2/Empilage!O$17^2))","v":{"$error":"#VALUE!"}},"MPa",null,"Contrainte radiale",{"$f":"-S68*(Empilage!S$15^2/(Empilage!S$15^2-Empilage!S$16^2))*(1-(Empilage!S$16^2/Empilage!S$17^2))","v":{"$error":"#VALUE!"}},"MPa",null,"Contrainte radiale",{"$f":"-W68*(Empilage!W$15^2/(Empilage!W$15^2-Empilage!W$16^2))*(1-(Empilage!W$16^2/Empilage!W$17^2))","v":{"$error":"#VALUE!"}},"MPa",null,"Contrainte radiale",{"$f":"-AA68*(Empilage!AA$15^2/(Empilage!AA$15^2-Empilage!AA$16^2))*(1-(Empilage!AA$16^2/Empilage!AA$17^2))","v":{"$error":"#VALUE!"}},"MPa",null,"Contrainte radiale",{"$f":"-AE68*(Empilage!AE$15^2/(Empilage!AE$15^2-Empilage!AE$16^2))*(1-(Empilage!AE$16^2/Empilage!AE$17^2))","v":{"$error":"#VALUE!"}},"MPa",null,"Contrainte radiale",{"$f":"-AI68*(Empilage!AI$15^2/(Empilage!AI$15^2-Empilage!AI$16^2))*(1-(Empilage!AI$16^2/Empilage!AI$17^2))","v":{"$error":"#VALUE!"}},"MPa",null,"Contrainte radiale",{"$f":"-AM68*(Empilage!AM$15^2/(Empilage!AM$15^2-Empilage!AM$16^2))*(1-(Empilage!AM$16^2/Empilage!AM$17^2))","v":{"$error":"#VALUE!"}},"MPa"]
[null,"Contrainte tangentielle",{"$f":"-C68*(Empilage!C$15^2/(Empilage!C$15^2-Empilage!C$16^2))*(1+(Empilage!C$16^2/Empilage!C$17^2))","v":{"$error":"#VALUE!"}},"MPa",null,"Contrainte tangentielle",{"$f":"-G68*(Empilage!G$15^2/(Empilage!G$15^2-Empilage!G$16^2))*(1+(Empilage!G$16^2/Empilage!G$17^2))","v":{"$error":"#VALUE!"}},"MPa",null,"Contrainte tangentielle",{"$f":"-K68*(Empilage!K$15^2/(Empilage!K$15^2-Empilage!K$16^2))*(1+(Empilage!K$16^2/Empilage!K$17^2))","v":{"$error":"#VALUE!"}},"MPa",null,"Contrainte tangentielle",{"$f":"-O68*(Empilage!O$15^2/(Empilage!O$15^2-Empilage!O$16^2))*(1+(Empilage!O$16^2/Empilage!O$17^2))","v":{"$error":"#VALUE!"}},"MPa",null,"Contrainte tangentielle",{"$f":"-S68*(Empilage!S$15^2/(Empilage!S$15^2-Empilage!S$16^2))*(1+(Empilage!S$16^2/Empilage!S$17^2))","v":{"$error":"#VALUE!"}},"MPa",null,"Contrainte tangentielle",{"$f":"-W68*(Empilage!W$15^2/(Empilage!W$15^2-Empilage!W$16^2))*(1+(Empilage!W$16^2/Empilage!W$17^2))","v":{"$error":"#VALUE!"}},"MPa",null,"Contrainte tangentielle",{"$f":"-AA68*(Empilage!AA$15^2/(Empilage!AA$15^2-Empilage!AA$16^2))*(1+(Empilage!AA$16^2/Empilage!AA$17^2))","v":{"$error":"#VALUE!"}},"MPa",null,"Contrainte tangentielle",{"$f":"-AE68*(Empilage!AE$15^2/(Empilage!AE$15^2-Empilage!AE$16^2))*(1+(Empilage!AE$16^2/Empilage!AE$17^2))","v":{"$error":"#VALUE!"}},"MPa",null,"Contrainte tangentielle",{"$f":"-AI68*(Empilage!AI$15^2/(Empilage!AI$15^2-Empilage!AI$16^2))*(1+(Empilage!AI$16^2/Empilage!AI$17^2))","v":{"$error":"#VALUE!"}},"MPa",null,"Contrainte tangentielle",{"$f":"-AM68*(Empilage!AM$15^2/(Empilage!AM$15^2-Empilage!AM$16^2))*(1+(Empilage!AM$16^2/Empilage!AM$17^2))","v":{"$error":"#VALUE!"}},"MPa"]
[null,"Déformée radiale",{"$f":"C73*((C75-Empilage!C$27*Detail_des_effets!C74)/Empilage!C19)*10^-1","v":{"$error":"#VALUE!"}},"mm au diamètre",null,"Déformée radiale",{"$f":"G73*((G75-Empilage!G$27*Detail_des_effets!G74)/Empilage!G19)*10^-1","v":{"$error":"#VALUE!"}},"mm au diamètre",null,"Déformée radiale",{"$f":"K73*((K75-Empilage!K$27*Detail_des_effets!K74)/Empilage!K19)*10^-1","v":{"$error":"#VALUE!"}},"mm au diamètre",null,"Déformée radiale",{"$f":"O73*((O75-Empilage!O$27*Detail_des_effets!O74)/Empilage!O19)*10^-1","v":{"$error":"#VALUE!"}},"mm au diamètre",null,"Déformée radiale",{"$f":"S73*((S75-Empilage!S$27*Detail_des_effets!S74)/Empilage!S19)*10^-1","v":{"$error":"#VALUE!"}},"mm au diamètre",null,"Déformée radiale",{"$f":"W73*((W75-Empilage!W$27*Detail_des_effets!W74)/Empilage!W19)*10^-1","v":{"$error":"#VALUE!"}},"mm au diamètre",null,"Déformée radiale",{"$f":"AA73*((AA75-Empilage!AA$27*Detail_des_effets!AA74)/Empilage!AA19)*10^-1","v":{"$error":"#VALUE!"}},"mm au diamètre",null,"Déformée radiale",{"$f":"AE73*((AE75-Empilage!AE$27*Detail_des_effets!AE74)/Empilage!AE19)*10^-1","v":{"$error":"#VALUE!"}},"mm au diamètre",null,"Déformée radiale",{"$f":"AI73*((AI75-Empilage!AI$27*Detail_des_effets!AI74)/Empilage!AI19)*10^-1","v":{"$error":"#VALUE!"}},"mm au diamètre",null,"Déformée radiale",{"$f":"AM73*((AM75-Empilage!AM$27*Detail_des_effets!AM74)/Empilage!AM19)*10^-1","v":{"$error":"#VALUE!"}},"mm au diamètre"]
[null,"Effet du frettage seul en fonctionnement",{"$nulls":3},"Effet du frettage seul en fonctionnement",{"$nulls":3},"Effet du frettage seul en fonctionnement",{"$nulls":3},"Effet du frettage seul en fonctionnement",{"$nulls":3},"Effet du frettage seul en fonctionnement",{"$nulls":3},"Effet du frettage seul en fonctionnement",{"$nulls":3},"Effet du frettage seul en fonctionnement",{"$nulls":3},"Effet du frettage seul en fonctionnement",{"$nulls":3},"Effet du frettage seul en fonctionnement",{"$nulls":3},"Effet du frettage seul en fonctionnement"]
[]
[null,"Pression de contact","Empilage!/Empilage!/(Constantes_de_frettage!-Constantes_de_frettage!) * 0.001","MPa",null,"Pression de contact","Empilage!/Empilage!/(Constantes_de_frettage!-Constantes_de_frettage!) * 0.001","MPa",null,"Pression de contact","Empilage!/Empilage!/(Constantes_de_frettage!-Constantes_de_frettage!) * 0.001","MPa",null,"Pression de contact","Empilage!/Empilage!/(Constantes_de_frettage!-Constantes_de_frettage!) * 0.001","MPa",null,"Pression de contact","Empilage!/Empilage!/(Constantes_de_frettage!-Constantes_de_frettage!) * 0.001","MPa",null,"Pression de contact","Empilage!/Empilage!/(Constantes_de_frettage!-Constantes_de_frettage!) * 0.001","MPa",null,"Pression de contact","Empilage!/Empilage!/(Constantes_de_frettage!-Constantes_de_frettage!) * 0.001","MPa",null,"Pression de contact","Empilage!/Empilage!/(Constantes_de_frettage!-Constantes_de_frettage!) * 0.001","MPa",null,"Pression de contact","Empilage!/Empilage!/(Constantes_de_frettage!-Constantes_de_frettage!) * 0.001","MPa",null,"Pression de contact","Empilage!/Empilage!/(Constantes_de_frettage!-Constantes_de_frettage!) * 0.001","MPa"]
[null,"Au niveau du frettage",{"$nulls":3},"Au niveau du frettage",{"$nulls":3},"Au niveau du frettage",{"$nulls":3},"Au niveau du frettage",{"$nulls":3},"Au niveau du frettage",{"$nulls":3},"Au niveau du frettage",{"$nulls":3},"Au niveau du frettage",{"$nulls":3},"Au niveau du frettage",{"$nulls":3},"Au niveau du frettage",{"$nulls":3},"Au niveau du frettage"]
[null,"Contrainte radiale",{"$f":"-C79*(Empilage!C$15^2/(Empilage!C$15^2-Empilage!C$16^2))*(1-(Empilage!C$16^2/Empilage!C$17^2))","v":{"$error":"#VALUE!"}},"MPa",null,"Contrainte radiale",{"$f":"-G79*(Empilage!G$15^2/(Empilage!G$15^2-Empilage!G$16^2))*(1-(Empilage!G$16^2/Empilage!G$17^2))","v":{"$error":"#VALUE!"}},"MPa",null,"Contrainte radiale",{"$f":"-K79*(Empilage!K$15^2/(Empilage!K$15^2-Empilage!K$16^2))*(1-(Empilage!K$16^2/Empilage!K$17^2))","v":{"$error":"#VALUE!"}},"MPa",null,"Contrainte radiale",{"$f":"-O79*(Empilage!O$15^2/(Empilage!O$15^2-Empilage!O$16^2))*(1-(Empilage!O$16^2/Empilage!O$17^2))","v":{"$error":"#VALUE!"}},"MPa",null,"Contrainte radiale",{"$f":"-S79*(Empilage!S$15^2/(Empilage!S$15^2-Empilage!S$16^2))*(1-(Empilage!S$16^2/Empilage!S$17^2))","v":{"$error":"#VALUE!"}},"MPa",null,"Contrainte radiale",{"$f":"-W79*(Empilage!W$15^2/(Empilage!W$15^2-Empilage!W$16^2))*(1-(Empilage!W$16^2/Empilage!W$17^2))","v":{"$error":"#VALUE!"}},"MPa",null,"Contrainte radiale",{"$f":"-AA79*(Empilage!AA$15^2/(Empilage!AA$15^2-Empilage!AA$16^2))*(1-(Empilage!AA$16^2/Empilage!AA$17^2))","v":{"$error":"#VALUE!"}},"MPa",null,"Contrainte radiale",{"$f":"-AE79*(Empilage!AE$15^2/(Empilage!AE$15^2-Empilage!AE$16^2))*(1-(Empilage!AE$16^2/Empilage!AE$17^2))","v":{"$error":"#VALUE!"}},"MPa",null,"Contrainte radiale",{"$f":"-AI79*(Empilage!AI$15^2/(Empilage!AI$15^2-Empilage!AI$16^2))*(1-(Empilage!AI$16^2/Empilage!AI$17^2))","v":{"$error":"#VALUE!"}},"MPa",null,"Contrainte radiale",{"$f":"-AM79*(Empilage!AM$15^2/(Empilage!AM$15^2-Empilage!AM$16^2))*(1-(Empilage!AM$16^2/Empilage!AM$17^2))","v":{"$error":"#VALUE!"}},"MPa"]
[null,"Contrainte tangentielle",{"$f":"-C79*(Empilage!C$15^2/(Empilage!C$15^2-Empilage!C$16^2))*(1+(Empilage!C$16^2/Empilage!C$17^2))","v":{"$error":"#VALUE!"}},"MPa",null,"Contrainte tangentielle",{"$f":"-G79*(Empilage!G$15^2/(Empilage!G$15^2-Empilage!G$16^2))*(1+(Empilage!G$16^2/Empilage!G$17^2))","v":{"$error":"#VALUE!"}},"MPa",null,"Contrainte tangentielle",{"$f":"-K79*(Empilage!K$15^2/(Empilage!K$15^2-Empilage!K$16^2))*(1+(Empilage!K$16^2/Empilage!K$17^2))","v":{"$error":"#VALUE!"}},"MPa",null,"Contrainte tangentielle",{"$f":"-O79*(Empilage!O$15^2/(Empilage!O$15^2-Empilage!O$16^2))*(1+(Empilage!O$16^2/Empilage!O$17^2))","v":{"$error":"#VALUE!"}},"MPa",null,"Contrainte tangentielle",{"$f":"-S79*(Empilage!S$15^2/(Empilage!S$15^2-Empilage!S$16^2))*(1+(Empilage!S$16^2/Empilage!S$17^2))","v":{"$error":"#VALUE!"}},"MPa",null,"Contrainte tangentielle",{"$f":"-W79*(Empilage!W$15^2/(Empilage!W$15^2-Empilage!W$16^2))*(1+(Empilage!W$16^2/Empilage!W$17^2))","v":{"$error":"#VALUE!"}},"MPa",null,"Contrainte tangentielle",{"$f":"-AA79*(Empilage!AA$15^2/(Empilage!AA$15^2-Empilage!AA$16^2))*(1+(Empilage!AA$16^2/Empilage!AA$17^2))","v":{"$error":"#VALUE!"}},"MPa",null,"Contrainte tangentielle",{"$f":"-AE79*(Empilage!AE$15^2/(Empilage!AE$15^2-Empilage!AE$16^2))*(1+(Empilage!AE$16^2/Empilage!AE$17^2))","v":{"$error":"#VALUE!"}},"MPa",null,"Contrainte tangentielle",{"$f":"-AI79*(Empilage!AI$15^2/(Empilage!AI$15^2-Empilage!AI$16^2))*(1+(Empilage!AI$16^2/Empilage!AI$17^2))","v":{"$error":"#VALUE!"}},"MPa",null,"Contrainte tangentielle",{"$f":"-AM79*(Empilage!AM$15^2/(Empilage!AM$15^2-Empilage!AM$16^2))*(1+(Empilage!AM$16^2/Empilage!AM$17^2))","v":{"$error":"#VALUE!"}},"MPa"]
[null,"Déformée radiale",{"$f":"Empilage!C15*((C82-Empilage!C$27*Detail_des_effets!C81)/Empilage!C20)*10^-1","v":{"$error":"#VALUE!"}},"mm au diamètre",null,"Déformée radiale",{"$f":"Empilage!G15*((G82-Empilage!G$27*Detail_des_effets!G81)/Empilage!G20)*10^-1","v":{"$error":"#VALUE!"}},"mm au diamètre",null,"Déformée radiale",{"$f":"Empilage!K15*((K82-Empilage!K$27*Detail_des_effets!K81)/Empilage!K20)*10^-1","v":{"$error":"#VALUE!"}},"mm au diamètre",null,"Déformée radiale",{"$f":"Empilage!O15*((O82-Empilage!O$27*Detail_des_effets!O81)/Empilage!O20)*10^-1","v":{"$error":"#VALUE!"}},"mm au diamètre",null,"Déformée radiale",{"$f":"Empilage!S15*((S82-Empilage!S$27*Detail_des_effets!S81)/Empilage!S20)*10^-1","v":{"$error":"#VALUE!"}},"mm au diamètre",null,"Déformée radiale",{"$f":"Empilage!W15*((W82-Empilage!W$27*Detail_des_effets!W81)/Empilage!W20)*10^-1","v":{"$error":"#VALUE!"}},"mm au diamètre",null,"Déformée radiale",{"$f":"Empilage!AA15*((AA82-Empilage!AA$27*Detail_des_effets!AA81)/Empilage!AA20)*10^-1","v":{"$error":"#VALUE!"}},"mm au diamètre",null,"Déformée radiale",{"$f":"Empilage!AE15*((AE82-Empilage!AE$27*Detail_des_effets!AE81)/Empilage!AE20)*10^-1","v":{"$error":"#VALUE!"}},"mm au diamètre",null,"Déformée radiale",{"$f":"Empilage!AI15*((AI82-Empilage!AI$27*Detail_des_effets!AI81)/Empilage!AI20)*10^-1","v":{"$error":"#VALUE!"}},"mm au diamètre",null,"Déformée radiale",{"$f":"Empilage!AM15*((AM82-Empilage!AM$27*Detail_des_effets!AM81)/Empilage!AM20)*10^-1","v":{"$error":"#VALUE!"}},"mm au diamètre"]
[null,"Dans la pièce, au diamètre particulier",{"$f":"Empilage!C$17","v":{"v":20,"d":"20.00"}},"mm",null,"Dans la pièce, au diamètre particulier",{"$f":"Empilage!G$17","v":{"v":20,"d":"20.00"}},"mm",null,"Dans la pièce, au diamètre particulier",{"$f":"Empilage!K$17","v":{"v":20,"d":"20.00"}},"mm",null,"Dans la pièce, au diamètre particulier",{"$f":"Empilage!O$17","v":{"v":20,"d":"20.00"}},"mm",null,"Dans la pièce, au diamètre particulier",{"$f":"Empilage!S$17","v":{"v":20,"d":"20.00"}},"mm",null,"Dans la pièce, au diamètre particulier",{"$f":"Empilage!W$17","v":{"v":20,"d":"20.00"}},"mm",null,"Dans la pièce, au diamètre particulier",{"$f":"Empilage!AA$17","v":{"v":20,"d":"20.00"}},"mm",null,"Dans la pièce, au diamètre particulier",{"$f":"Empilage!AE$17","v":{"v":20,"d":"20.00"}},"mm",null,"Dans la pièce, au diamètre particulier",{"$f":"Empilage!AI$17","v":{"v":20,"d":"20.00"}},"mm",null,"Dans la pièce, au diamètre particulier",{"$f":"Empilage!AM$17","v":{"v":20,"d":"20.00"}},"mm"]
[null,"Contrainte radiale",{"$f":"-C79*(Empilage!C$15^2/(Empilage!C$15^2-Empilage!C$16^2))*(1-(Empilage!C$16^2/Empilage!C$17^2))","v":{"$error":"#VALUE!"}},"MPa",null,"Contrainte radiale",{"$f":"-G79*(Empilage!G$15^2/(Empilage!G$15^2-Empilage!G$16^2))*(1-(Empilage!G$16^2/Empilage!G$17^2))","v":{"$error":"#VALUE!"}},"MPa",null,"Contrainte radiale",{"$f":"-K79*(Empilage!K$15^2/(Empilage!K$15^2-Empilage!K$16^2))*(1-(Empilage!K$16^2/Empilage!K$17^2))","v":{"$error":"#VALUE!"}},"MPa",null,"Contrainte radiale",{"$f":"-O79*(Empilage!O$15^2/(Empilage!O$15^2-Empilage!O$16^2))*(1-(Empilage!O$16^2/Empilage!O$17^2))","v":{"$error":"#VALUE!"}},"MPa",null,"Contrainte radiale",{"$f":"-S79*(Empilage!S$15^2/(Empilage!S$15^2-Empilage!S$16^2))*(1-(Empilage!S$16^2/Empilage!S$17^2))","v":{"$error":"#VALUE!"}},"MPa",null,"Contrainte radiale",{"$f":"-W79*(Empilage!W$15^2/(Empilage!W$15^2-Empilage!W$16^2))*(1-(Empilage!W$16^2/Empilage!W$17^2))","v":{"$error":"#VALUE!"}},"MPa",null,"Contrainte radiale",{"$f":"-AA79*(Empilage!AA$15^2/(Empilage!AA$15^2-Empilage!AA$16^2))*(1-(Empilage!AA$16^2/Empilage!AA$17^2))","v":{"$error":"#VALUE!"}},"MPa",null,"Contrainte radiale",{"$f":"-AE79*(Empilage!AE$15^2/(Empilage!AE$15^2-Empilage!AE$16^2))*(1-(Empilage!AE$16^2/Empilage!AE$17^2))","v":{"$error":"#VALUE!"}},"MPa",null,"Contrainte radiale",{"$f":"-AI79*(Empilage!AI$15^2/(Empilage!AI$15^2-Empilage!AI$16^2))*(1-(Empilage!AI$16^2/Empilage!AI$17^2))","v":{"$error":"#VALUE!"}},"MPa",null,"Contrainte radiale",{"$f":"-AM79*(Empilage!AM$15^2/(Empilage!AM$15^2-Empilage!AM$16^2))*(1-(Empilage!AM$16^2/Empilage!AM$17^2))","v":{"$error":"#VALUE!"}},"MPa"]
[null,"Contrainte tangentielle",{"$f":"-C79*(Empilage!C$15^2/(Empilage!C$15^2-Empilage!C$16^2))*(1+(Empilage!C$16^2/Empilage!C$17^2))","v":{"$error":"#VALUE!"}},"MPa",null,"Contrainte tangentielle",{"$f":"-G79*(Empilage!G$15^2/(Empilage!G$15^2-Empilage!G$16^2))*(1+(Empilage!G$16^2/Empilage!G$17^2))","v":{"$error":"#VALUE!"}},"MPa",null,"Contrainte tangentielle",{"$f":"-K79*(Empilage!K$15^2/(Empilage!K$15^2-Empilage!K$16^2))*(1+(Empilage!K$16^2/Empilage!K$17^2))","v":{"$error":"#VALUE!"}},"MPa",null,"Contrainte tangentielle",{"$f":"-O79*(Empilage!O$15^2/(Empilage!O$15^2-Empilage!O$16^2))*(1+(Empilage!O$16^2/Empilage!O$17^2))","v":{"$error":"#VALUE!"}},"MPa",null,"Contrainte tangentielle",{"$f":"-S79*(Empilage!S$15^2/(Empilage!S$15^2-Empilage!S$16^2))*(1+(Empilage!S$16^2/Empilage!S$17^2))","v":{"$error":"#VALUE!"}},"MPa",null,"Contrainte tangentielle",{"$f":"-W79*(Empilage!W$15^2/(Empilage!W$15^2-Empilage!W$16^2))*(1+(Empilage!W$16^2/Empilage!W$17^2))","v":{"$error":"#VALUE!"}},"MPa",null,"Contrainte tangentielle",{"$f":"-AA79*(Empilage!AA$15^2/(Empilage!AA$15^2-Empilage!AA$16^2))*(1+(Empilage!AA$16^2/Empilage!AA$17^2))","v":{"$error":"#VALUE!"}},"MPa",null,"Contrainte tangentielle",{"$f":"-AE79*(Empilage!AE$15^2/(Empilage!AE$15^2-Empilage!AE$16^2))*(1+(Empilage!AE$16^2/Empilage!AE$17^2))","v":{"$error":"#VALUE!"}},"MPa",null,"Contrainte tangentielle",{"$f":"-AI79*(Empilage!AI$15^2/(Empilage!AI$15^2-Empilage!AI$16^2))*(1+(Empilage!AI$16^2/Empilage!AI$17^2))","v":{"$error":"#VALUE!"}},"MPa",null,"Contrainte tangentielle",{"$f":"-AM79*(Empilage!AM$15^2/(Empilage!AM$15^2-Empilage!AM$16^2))*(1+(Empilage!AM$16^2/Empilage!AM$17^2))","v":{"$error":"#VALUE!"}},"MPa"]
[null,"Déformée radiale",{"$f":"C84*((C86-Empilage!C$27*Detail_des_effets!C85)/Empilage!C20)*10^-1","v":{"$error":"#VALUE!"}},"mm au diamètre",null,"Déformée radiale",{"$f":"G84*((G86-Empilage!G$27*Detail_des_effets!G85)/Empilage!G20)*10^-1","v":{"$error":"#VALUE!"}},"mm au diamètre",null,"Déformée radiale",{"$f":"K84*((K86-Empilage!K$27*Detail_des_effets!K85)/Empilage!K20)*10^-1","v":{"$error":"#VALUE!"}},"mm au diamètre",null,"Déformée radiale",{"$f":"O84*((O86-Empilage!O$27*Detail_des_effets!O85)/Empilage!O20)*10^-1","v":{"$error":"#VALUE!"}},"mm au diamètre",null,"Déformée radiale",{"$f":"S84*((S86-Empilage!S$27*Detail_des_effets!S85)/Empilage!S20)*10^-1","v":{"$error":"#VALUE!"}},"mm au diamètre",null,"Déformée radiale",{"$f":"W84*((W86-Empilage!W$27*Detail_des_effets!W85)/Empilage!W20)*10^-1","v":{"$error":"#VALUE!"}},"mm au diamètre",null,"Déformée radiale",{"$f":"AA84*((AA86-Empilage!AA$27*Detail_des_effets!AA85)/Empilage!AA20)*10^-1","v":{"$error":"#VALUE!"}},"mm au diamètre",null,"Déformée radiale",{"$f":"AE84*((AE86-Empilage!AE$27*Detail_des_effets!AE85)/Empilage!AE20)*10^-1","v":{"$error":"#VALUE!"}},"mm au diamètre",null,"Déformée radiale",{"$f":"AI84*((AI86-Empilage!AI$27*Detail_des_effets!AI85)/Empilage!AI20)*10^-1","v":{"$error":"#VALUE!"}},"mm au diamètre",null,"Déformée radiale",{"$f":"AM84*((AM86-Empilage!AM$27*Detail_des_effets!AM85)/Empilage!AM20)*10^-1","v":{"$error":"#VALUE!"}},"mm au diamètre"]
[null,"Effet de la thermique seule en mise en froid",{"$nulls":3},"Effet de la thermique seule en mise en froid",{"$nulls":3},"Effet de la thermique seule en mise en froid",{"$nulls":3},"Effet de la thermique seule en mise en froid",{"$nulls":3},"Effet de la thermique seule en mise en froid",{"$nulls":3},"Effet de la thermique seule en mise en froid",{"$nulls":3},"Effet de la thermique seule en mise en froid",{"$nulls":3},"Effet de la thermique seule en mise en froid",{"$nulls":3},"Effet de la thermique seule en mise en froid",{"$nulls":3},"Effet de la thermique seule en mise en froid"]
[]
[null,"Au niveau du frettage",{"$nulls":3},"Au niveau du frettage",{"$nulls":3},"Au niveau du frettage",{"$nulls":3},"Au niveau du frettage",{"$nulls":3},"Au niveau du frettage",{"$nulls":3},"Au niveau du frettage",{"$nulls":3},"Au niveau du frettage",{"$nulls":3},"Au niveau du frettage",{"$nulls":3},"Au niveau du frettage",{"$nulls":3},"Au niveau du frettage"]
[null,"Déformée axiale",{"$f":"Empilage!C25*10^-5*Empilage!C13","v":{"v":-0.13154988756000002,"d":"-0.132"}},"mm",null,"Déformée axiale",{"$f":"Empilage!G25*10^-5*Empilage!G13","v":{"v":-0.13154988756000002,"d":"-0.132"}},"mm",null,"Déformée axiale",{"$f":"Empilage!K25*10^-5*Empilage!K13","v":{"v":-0.13154988756000002,"d":"-0.132"}},"mm",null,"Déformée axiale",{"$f":"Empilage!O25*10^-5*Empilage!O13","v":{"v":-0.13154988756000002,"d":"-0.132"}},"mm",null,"Déformée axiale",{"$f":"Empilage!S25*10^-5*Empilage!S13","v":{"v":-0.13154988756000002,"d":"-0.132"}},"mm",null,"Déformée axiale",{"$f":"Empilage!W25*10^-5*Empilage!W13","v":{"v":-0.13154988756000002,"d":"-0.132"}},"mm",null,"Déformée axiale",{"$f":"Empilage!AA25*10^-5*Empilage!AA13","v":{"v":-0.13154988756000002,"d":"-0.132"}},"mm",null,"Déformée axiale",{"$f":"Empilage!AE25*10^-5*Empilage!AE13","v":{"v":-0.13154988756000002,"d":"-0.132"}},"mm",null,"Déformée axiale",{"$f":"Empilage!AI25*10^-5*Empilage!AI13","v":{"v":-0.13154988756000002,"d":"-0.132"}},"mm",null,"Déformée axiale",{"$f":"Empilage!AM25*10^-5*Empilage!AM13","v":{"v":-0.13154988756000002,"d":"-0.132"}},"mm"]
[null,"Déformée radiale",{"$f":"Empilage!C25*10^-5*Empilage!C15","v":{"v":-0.06240507000000001,"d":"-0.062"}},"mm",null,"Déformée radiale",{"$f":"Empilage!G25*10^-5*Empilage!G15","v":{"v":-0.06240507000000001,"d":"-0.062"}},"mm",null,"Déformée radiale",{"$f":"Empilage!K25*10^-5*Empilage!K15","v":{"v":-0.06240507000000001,"d":"-0.062"}},"mm",null,"Déformée radiale",{"$f":"Empilage!O25*10^-5*Empilage!O15","v":{"v":-0.06240507000000001,"d":"-0.062"}},"mm",null,"Déformée radiale",{"$f":"Empilage!S25*10^-5*Empilage!S15","v":{"v":-0.06240507000000001,"d":"-0.062"}},"mm",null,"Déformée radiale",{"$f":"Empilage!W25*10^-5*Empilage!W15","v":{"v":-0.06240507000000001,"d":"-0.062"}},"mm",null,"Déformée radiale",{"$f":"Empilage!AA25*10^-5*Empilage!AA15","v":{"v":-0.06240507000000001,"d":"-0.062"}},"mm",null,"Déformée radiale",{"$f":"Empilage!AE25*10^-5*Empilage!AE15","v":{"v":-0.06240507000000001,"d":"-0.062"}},"mm",null,"Déformée radiale",{"$f":"Empilage!AI25*10^-5*Empilage!AI15","v":{"v":-0.06240507000000001,"d":"-0.062"}},"mm",null,"Déformée radiale",{"$f":"Empilage!AM25*10^-5*Empilage!AM15","v":{"v":-0.06240507000000001,"d":"-0.062"}},"mm"]
[null,"Dans la pièce, au diamètre particulier",{"$f":"Empilage!C$17","v":{"v":20,"d":"20.00"}},"mm",null,"Dans la pièce, au diamètre particulier",{"$f":"Empilage!G$17","v":{"v":20,"d":"20.00"}},"mm",null,"Dans la pièce, au diamètre particulier",{"$f":"Empilage!K$17","v":{"v":20,"d":"20.00"}},"mm",null,"Dans la pièce, au diamètre particulier",{"$f":"Empilage!O$17","v":{"v":20,"d":"20.00"}},"mm",null,"Dans la pièce, au diamètre particulier",{"$f":"Empilage!S$17","v":{"v":20,"d":"20.00"}},"mm",null,"Dans la pièce, au diamètre particulier",{"$f":"Empilage!W$17","v":{"v":20,"d":"20.00"}},"mm",null,"Dans la pièce, au diamètre particulier",{"$f":"Empilage!AA$17","v":{"v":20,"d":"20.00"}},"mm",null,"Dans la pièce, au diamètre particulier",{"$f":"Empilage!AE$17","v":{"v":20,"d":"20.00"}},"mm",null,"Dans la pièce, au diamètre particulier",{"$f":"Empilage!AI$17","v":{"v":20,"d":"20.00"}},"mm",null,"Dans la pièce, au diamètre particulier",{"$f":"Empilage!AM$17","v":{"v":20,"d":"20.00"}},"mm"]
[null,"Déformée axiale",{"$f":"Empilage!C25*10^-5*Empilage!C13","v":{"v":-0.13154988756000002,"d":"-0.132"}},"mm",null,"Déformée axiale",{"$f":"Empilage!G25*10^-5*Empilage!G13","v":{"v":-0.13154988756000002,"d":"-0.132"}},"mm",null,"Déformée axiale",{"$f":"Empilage!K25*10^-5*Empilage!K13","v":{"v":-0.13154988756000002,"d":"-0.132"}},"mm",null,"Déformée axiale",{"$f":"Empilage!O25*10^-5*Empilage!O13","v":{"v":-0.13154988756000002,"d":"-0.132"}},"mm",null,"Déformée axiale",{"$f":"Empilage!S25*10^-5*Empilage!S13","v":{"v":-0.13154988756000002,"d":"-0.132"}},"mm",null,"Déformée axiale",{"$f":"Empilage!W25*10^-5*Empilage!W13","v":{"v":-0.13154988756000002,"d":"-0.132"}},"mm",null,"Déformée axiale",{"$f":"Empilage!AA25*10^-5*Empilage!AA13","v":{"v":-0.13154988756000002,"d":"-0.132"}},"mm",null,"Déformée axiale",{"$f":"Empilage!AE25*10^-5*Empilage!AE13","v":{"v":-0.13154988756000002,"d":"-0.132"}},"mm",null,"Déformée axiale",{"$f":"Empilage!AI25*10^-5*Empilage!AI13","v":{"v":-0.13154988756000002,"d":"-0.132"}},"mm",null,"Déformée axiale",{"$f":"Empilage!AM25*10^-5*Empilage!AM13","v":{"v":-0.13154988756000002,"d":"-0.132"}},"mm"]
[null,"Déformée radiale",{"$f":"Empilage!C25*10^-5*C93","v":{"v":-0.049924056,"d":"-0.050"}},"mm",null,"Déformée radiale",{"$f":"Empilage!G25*10^-5*G93","v":{"v":-0.049924056,"d":"-0.050"}},"mm",null,"Déformée radiale",{"$f":"Empilage!K25*10^-5*K93","v":{"v":-0.049924056,"d":"-0.050"}},"mm",null,"Déformée radiale",{"$f":"Empilage!O25*10^-5*O93","v":{"v":-0.049924056,"d":"-0.050"}},"mm",null,"Déformée radiale",{"$f":"Empilage!S25*10^-5*S93","v":{"v":-0.049924056,"d":"-0.050"}},"mm",null,"Déformée radiale",{"$f":"Empilage!W25*10^-5*W93","v":{"v":-0.049924056,"d":"-0.050"}},"mm",null,"Déformée radiale",{"$f":"Empilage!AA25*10^-5*AA93","v":{"v":-0.049924056,"d":"-0.050"}},"mm",null,"Déformée radiale",{"$f":"Empilage!AE25*10^-5*AE93","v":{"v":-0.049924056,"d":"-0.050"}},"mm",null,"Déformée radiale",{"$f":"Empilage!AI25*10^-5*AI93","v":{"v":-0.049924056,"d":"-0.050"}},"mm",null,"Déformée radiale",{"$f":"Empilage!AM25*10^-5*AM93","v":{"v":-0.049924056,"d":"-0.050"}},"mm"]
[null,"Effet de la thermique seule en fonctionnement",{"$nulls":3},"Effet de la thermique seule en fonctionnement",{"$nulls":3},"Effet de la thermique seule en fonctionnement",{"$nulls":3},"Effet de la thermique seule en fonctionnement",{"$nulls":3},"Effet de la thermique seule en fonctionnement",{"$nulls":3},"Effet de la thermique seule en fonctionnement",{"$nulls":3},"Effet de la thermique seule en fonctionnement",{"$nulls":3},"Effet de la thermique seule en fonctionnement",{"$nulls":3},"Effet de la thermique seule en fonctionnement",{"$nulls":3},"Effet de la thermique seule en fonctionnement"]
[]
[null,"Au niveau du frettage",{"$nulls":3},"Au niveau du frettage",{"$nulls":3},"Au niveau du frettage",{"$nulls":3},"Au niveau du frettage",{"$nulls":3},"Au niveau du frettage",{"$nulls":3},"Au niveau du frettage",{"$nulls":3},"Au niveau du frettage",{"$nulls":3},"Au niveau du frettage",{"$nulls":3},"Au niveau du frettage",{"$nulls":3},"Au niveau du frettage"]
[null,"Déformée axiale",{"$f":"Empilage!C26*10^-5*Empilage!C13","v":{"v":-0.10572718268,"d":"-0.106"}},"mm",null,"Déformée axiale",{"$f":"Empilage!G26*10^-5*Empilage!G13","v":{"v":-0.10572718268,"d":"-0.106"}},"mm",null,"Déformée axiale",{"$f":"Empilage!K26*10^-5*Empilage!K13","v":{"v":-0.10572718268,"d":"-0.106"}},"mm",null,"Déformée axiale",{"$f":"Empilage!O26*10^-5*Empilage!O13","v":{"v":-0.10572718268,"d":"-0.106"}},"mm",null,"Déformée axiale",{"$f":"Empilage!S26*10^-5*Empilage!S13","v":{"v":-0.10572718268,"d":"-0.106"}},"mm",null,"Déformée axiale",{"$f":"Empilage!W26*10^-5*Empilage!W13","v":{"v":-0.10572718268,"d":"-0.106"}},"mm",null,"Déformée axiale",{"$f":"Empilage!AA26*10^-5*Empilage!AA13","v":{"v":-0.10572718268,"d":"-0.106"}},"mm",null,"Déformée axiale",{"$f":"Empilage!AE26*10^-5*Empilage!AE13","v":{"v":-0.10572718268,"d":"-0.106"}},"mm",null,"Déformée axiale",{"$f":"Empilage!AI26*10^-5*Empilage!AI13","v":{"v":-0.10572718268,"d":"-0.106"}},"mm",null,"Déformée axiale",{"$f":"Empilage!AM26*10^-5*Empilage!AM13","v":{"v":-0.10572718268,"d":"-0.106"}},"mm"]
[null,"Déformée radiale",{"$f":"Empilage!C26*10^-5*Empilage!C15","v":{"v":-0.05015521,"d":"-0.050"}},"mm",null,"Déformée radiale",{"$f":"Empilage!G26*10^-5*Empilage!G15","v":{"v":-0.05015521,"d":"-0.050"}},"mm",null,"Déformée radiale",{"$f":"Empilage!K26*10^-5*Empilage!K15","v":{"v":-0.05015521,"d":"-0.050"}},"mm",null,"Déformée radiale",{"$f":"Empilage!O26*10^-5*Empilage!O15","v":{"v":-0.05015521,"d":"-0.050"}},"mm",null,"Déformée radiale",{"$f":"Empilage!S26*10^-5*Empilage!S15","v":{"v":-0.05015521,"d":"-0.050"}},"mm",null,"Déformée radiale",{"$f":"Empilage!W26*10^-5*Empilage!W15","v":{"v":-0.05015521,"d":"-0.050"}},"mm",null,"Déformée radiale",{"$f":"Empilage!AA26*10^-5*Empilage!AA15","v":{"v":-0.05015521,"d":"-0.050"}},"mm",null,"Déformée radiale",{"$f":"Empilage!AE26*10^-5*Empilage!AE15","v":{"v":-0.05015521,"d":"-0.050"}},"mm",null,"Déformée radiale",{"$f":"Empilage!AI26*10^-5*Empilage!AI15","v":{"v":-0.05015521,"d":"-0.050"}},"mm",null,"Déformée radiale",{"$f":"Empilage!AM26*10^-5*Empilage!AM15","v":{"v":-0.05015521,"d":"-0.050"}},"mm"]
[null,"Dans la pièce, au diamètre particulier",{"$f":"Empilage!C$17","v":{"v":20,"d":"20.00"}},"mm",null,"Dans la pièce, au diamètre particulier",{"$f":"Empilage!G$17","v":{"v":20,"d":"20.00"}},"mm",null,"Dans la pièce, au diamètre particulier",{"$f":"Empilage!K$17","v":{"v":20,"d":"20.00"}},"mm",null,"Dans la pièce, au diamètre particulier",{"$f":"Empilage!O$17","v":{"v":20,"d":"20.00"}},"mm",null,"Dans la pièce, au diamètre particulier",{"$f":"Empilage!S$17","v":{"v":20,"d":"20.00"}},"mm",null,"Dans la pièce, au diamètre particulier",{"$f":"Empilage!W$17","v":{"v":20,"d":"20.00"}},"mm",null,"Dans la pièce, au diamètre particulier",{"$f":"Empilage!AA$17","v":{"v":20,"d":"20.00"}},"mm",null,"Dans la pièce, au diamètre particulier",{"$f":"Empilage!AE$17","v":{"v":20,"d":"20.00"}},"mm",null,"Dans la pièce, au diamètre particulier",{"$f":"Empilage!AI$17","v":{"v":20,"d":"20.00"}},"mm",null,"Dans la pièce, au diamètre particulier",{"$f":"Empilage!AM$17","v":{"v":20,"d":"20.00"}},"mm"]
[null,"Déformée axiale",{"$f":"Empilage!C26*10^-5*Empilage!C13","v":{"v":-0.10572718268,"d":"-0.106"}},"mm",null,"Déformée axiale",{"$f":"Empilage!G26*10^-5*Empilage!G13","v":{"v":-0.10572718268,"d":"-0.106"}},"mm",null,"Déformée axiale",{"$f":"Empilage!K26*10^-5*Empilage!K13","v":{"v":-0.10572718268,"d":"-0.106"}},"mm",null,"Déformée axiale",{"$f":"Empilage!O26*10^-5*Empilage!O13","v":{"v":-0.10572718268,"d":"-0.106"}},"mm",null,"Déformée axiale",{"$f":"Empilage!S26*10^-5*Empilage!S13","v":{"v":-0.10572718268,"d":"-0.106"}},"mm",null,"Déformée axiale",{"$f":"Empilage!W26*10^-5*Empilage!W13","v":{"v":-0.10572718268,"d":"-0.106"}},"mm",null,"Déformée axiale",{"$f":"Empilage!AA26*10^-5*Empilage!AA13","v":{"v":-0.10572718268,"d":"-0.106"}},"mm",null,"Déformée axiale",{"$f":"Empilage!AE26*10^-5*Empilage!AE13","v":{"v":-0.10572718268,"d":"-0.106"}},"mm",null,"Déformée axiale",{"$f":"Empilage!AI26*10^-5*Empilage!AI13","v":{"v":-0.10572718268,"d":"-0.106"}},"mm",null,"Déformée axiale",{"$f":"Empilage!AM26*10^-5*Empilage!AM13","v":{"v":-0.10572718268,"d":"-0.106"}},"mm"]
[null,"Déformée radiale",{"$f":"Empilage!C26*10^-5*C101","v":{"v":-0.040124168,"d":"-0.040"}},"mm",null,"Déformée radiale",{"$f":"Empilage!G26*10^-5*G101","v":{"v":-0.040124168,"d":"-0.040"}},"mm",null,"Déformée radiale",{"$f":"Empilage!K26*10^-5*K101","v":{"v":-0.040124168,"d":"-0.040"}},"mm",null,"Déformée radiale",{"$f":"Empilage!O26*10^-5*O101","v":{"v":-0.040124168,"d":"-0.040"}},"mm",null,"Déformée radiale",{"$f":"Empilage!S26*10^-5*S101","v":{"v":-0.040124168,"d":"-0.040"}},"mm",null,"Déformée radiale",{"$f":"Empilage!W26*10^-5*W101","v":{"v":-0.040124168,"d":"-0.040"}},"mm",null,"Déformée radiale",{"$f":"Empilage!AA26*10^-5*AA101","v":{"v":-0.040124168,"d":"-0.040"}},"mm",null,"Déformée radiale",{"$f":"Empilage!AE26*10^-5*AE101","v":{"v":-0.040124168,"d":"-0.040"}},"mm",null,"Déformée radiale",{"$f":"Empilage!AI26*10^-5*AI101","v":{"v":-0.040124168,"d":"-0.040"}},"mm",null,"Déformée radiale",{"$f":"Empilage!AM26*10^-5*AM101","v":{"v":-0.040124168,"d":"-0.040"}},"mm"]
[]
[]
[]
[]
[null,"Nom :",{"$f":"Empilage!C31","v":"Pièce femelle"},null,null,"Nom :",{"$f":"Empilage!G31","v":"Pièce femelle"},null,null,"Nom :",{"$f":"Empilage!K31","v":"Pièce femelle"},null,null,"Nom :",{"$f":"Empilage!O31","v":"Pièce femelle"},null,null,"Nom :",{"$f":"Empilage!S31","v":"Pièce femelle"},null,null,"Nom :",{"$f":"Empilage!W31","v":"Pièce femelle"},null,null,"Nom :",{"$f":"Empilage!AA31","v":"Pièce femelle"},null,null,"Nom :",{"$f":"Empilage!AE31","v":"Pièce femelle"},null,null,"Nom :",{"$f":"Empilage!AI31","v":"Pièce femelle"},null,null,"Nom :",{"$f":"Empilage!AM31","v":"Pièce femelle"}]
[null,"Effet de la centrifugation seule",{"$nulls":3},"Effet de la centrifugation seule",{"$nulls":3},"Effet de la centrifugation seule",{"$nulls":3},"Effet de la centrifugation seule",{"$nulls":3},"Effet de la centrifugation seule",{"$nulls":3},"Effet de la centrifugation seule",{"$nulls":3},"Effet de la centrifugation seule",{"$nulls":3},"Effet de la centrifugation seule",{"$nulls":3},"Effet de la centrifugation seule",{"$nulls":3},"Effet de la centrifugation seule"]
[]
[null,"Au niveau du frettage",{"$nulls":3},"Au niveau du frettage",{"$nulls":3},"Au niveau du frettage",{"$nulls":3},"Au niveau du frettage",{"$nulls":3},"Au niveau du frettage",{"$nulls":3},"Au niveau du frettage",{"$nulls":3},"Au niveau du frettage",{"$nulls":3},"Au niveau du frettage",{"$nulls":3},"Au niveau du frettage",{"$nulls":3},"Au niveau du frettage"]
[null,"Contrainte radiale",{"$f":"0","v":0},"MPa",null,"Contrainte radiale",{"$f":"0","v":0},"MPa",null,"Contrainte radiale",{"$f":"0","v":0},"MPa",null,"Contrainte radiale",{"$f":"0","v":0},"MPa",null,"Contrainte radiale",{"$f":"0","v":0},"MPa",null,"Contrainte radiale",{"$f":"0","v":0},"MPa",null,"Contrainte radiale",{"$f":"0","v":0},"MPa",null,"Contrainte radiale",{"$f":"0","v":0},"MPa",null,"Contrainte radiale",{"$f":"0","v":0},"MPa",null,"Contrainte radiale",{"$f":"0","v":0},"MPa"]
[null,"Contrainte tangentielle",{"$f":"10^-12*Empilage!C53*Empilage!$D$87^2/16*((3+Empilage!C52)*Empilage!C35^2+(1-Empilage!C52)*Empilage!C36^2)","v":{"v":17.333143441051575,"d":"17"}},"MPa",null,"Contrainte tangentielle",{"$f":"10^-12*Empilage!G53*Empilage!$D$87^2/16*((3+Empilage!G52)*Empilage!G35^2+(1-Empilage!G52)*Empilage!G36^2)","v":{"v":17.333143441051575,"d":"17"}},"MPa",null,"Contrainte tangentielle",{"$f":"10^-12*Empilage!K53*Empilage!$D$87^2/16*((3+Empilage!K52)*Empilage!K35^2+(1-Empilage!K52)*Empilage!K36^2)","v":{"v":17.333143441051575,"d":"17"}},"MPa",null,"Contrainte tangentielle",{"$f":"10^-12*Empilage!O53*Empilage!$D$87^2/16*((3+Empilage!O52)*Empilage!O35^2+(1-Empilage!O52)*Empilage!O36^2)","v":{"v":17.333143441051575,"d":"17"}},"MPa",null,"Contrainte tangentielle",{"$f":"10^-12*Empilage!S53*Empilage!$D$87^2/16*((3+Empilage!S52)*Empilage!S35^2+(1-Empilage!S52)*Empilage!S36^2)","v":{"v":17.333143441051575,"d":"17"}},"MPa",null,"Contrainte tangentielle",{"$f":"10^-12*Empilage!W53*Empilage!$D$87^2/16*((3+Empilage!W52)*Empilage!W35^2+(1-Empilage!W52)*Empilage!W36^2)","v":{"v":17.333143441051575,"d":"17"}},"MPa",null,"Contrainte tangentielle",{"$f":"10^-12*Empilage!AA53*Empilage!$D$87^2/16*((3+Empilage!AA52)*Empilage!AA35^2+(1-Empilage!AA52)*Empilage!AA36^2)","v":{"v":17.333143441051575,"d":"17"}},"MPa",null,"Contrainte tangentielle",{"$f":"10^-12*Empilage!AE53*Empilage!$D$87^2/16*((3+Empilage!AE52)*Empilage!AE35^2+(1-Empilage!AE52)*Empilage!AE36^2)","v":{"v":17.333143441051575,"d":"17"}},"MPa",null,"Contrainte tangentielle",{"$f":"10^-12*Empilage!AI53*Empilage!$D$87^2/16*((3+Empilage!AI52)*Empilage!AI35^2+(1-Empilage!AI52)*Empilage!AI36^2)","v":{"v":17.333143441051575,"d":"17"}},"MPa",null,"Contrainte tangentielle",{"$f":"10^-12*Empilage!AM53*Empilage!$D$87^2/16*((3+Empilage!AM52)*Empilage!AM35^2+(1-Empilage!AM52)*Empilage!AM36^2)","v":{"v":17.333143441051575,"d":"17"}},"MPa"]
[null,"Déformée radiale",{"$f":"IF(COUNTIF(Empilage!C38,\"*1 - Profil cylindrique*\"),(C115/Empilage!C$45)*(Detail_des_effets!C113-Empilage!C$52*Detail_des_effets!C112)*10^-1,((C115/Empilage!C$45)*(Detail_des_effets!C113-Empilage!C$52*Detail_des_effets!C112)+(Type_piece!$D$6*Empilage!C39)+(Type_piece!$E$6)+(Type_piece!$D$7*Empilage!C40)+(Type_piece!$E$7)+(Type_piece!$D$8*Empilage!C41^3)+(Type_piece!$E$8*Empilage!C41^2)+(Type_piece!$F$8*Empilage!C41)+Type_piece!$G$8)*10^-1)","v":{"v":2.3147681359334655E-3,"d":"0.002"}},"mm au diamètre",null,"Déformée radiale",{"$f":"IF(COUNTIF(Empilage!G38,\"*1 - Profil cylindrique*\"),(G115/Empilage!G$45)*(Detail_des_effets!G113-Empilage!G$52*Detail_des_effets!G112)*10^-1,((G115/Empilage!G$45)*(Detail_des_effets!G113-Empilage!G$52*Detail_des_effets!G112)+(Type_piece!$D$6*Empilage!G39)+(Type_piece!$E$6)+(Type_piece!$D$7*Empilage!G40)+(Type_piece!$E$7)+(Type_piece!$D$8*Empilage!G41^3)+(Type_piece!$E$8*Empilage!G41^2)+(Type_piece!$F$8*Empilage!G41)+Type_piece!$G$8)*10^-1)","v":{"v":2.3147681359334655E-3,"d":"0.002"}},"mm au diamètre",null,"Déformée radiale",{"$f":"IF(COUNTIF(Empilage!K38,\"*1 - Profil cylindrique*\"),(K115/Empilage!K$45)*(Detail_des_effets!K113-Empilage!K$52*Detail_des_effets!K112)*10^-1,((K115/Empilage!K$45)*(Detail_des_effets!K113-Empilage!K$52*Detail_des_effets!K112)+(Type_piece!$D$6*Empilage!K39)+(Type_piece!$E$6)+(Type_piece!$D$7*Empilage!K40)+(Type_piece!$E$7)+(Type_piece!$D$8*Empilage!K41^3)+(Type_piece!$E$8*Empilage!K41^2)+(Type_piece!$F$8*Empilage!K41)+Type_piece!$G$8)*10^-1)","v":{"v":2.3147681359334655E-3,"d":"0.002"}},"mm au diamètre",null,"Déformée radiale",{"$f":"IF(COUNTIF(Empilage!O38,\"*1 - Profil cylindrique*\"),(O115/Empilage!O$45)*(Detail_des_effets!O113-Empilage!O$52*Detail_des_effets!O112)*10^-1,((O115/Empilage!O$45)*(Detail_des_effets!O113-Empilage!O$52*Detail_des_effets!O112)+(Type_piece!$D$6*Empilage!O39)+(Type_piece!$E$6)+(Type_piece!$D$7*Empilage!O40)+(Type_piece!$E$7)+(Type_piece!$D$8*Empilage!O41^3)+(Type_piece!$E$8*Empilage!O41^2)+(Type_piece!$F$8*Empilage!O41)+Type_piece!$G$8)*10^-1)","v":{"v":2.3147681359334655E-3,"d":"0.002"}},"mm au diamètre",null,"Déformée radiale",{"$f":"IF(COUNTIF(Empilage!S38,\"*1 - Profil cylindrique*\"),(S115/Empilage!S$45)*(Detail_des_effets!S113-Empilage!S$52*Detail_des_effets!S112)*10^-1,((S115/Empilage!S$45)*(Detail_des_effets!S113-Empilage!S$52*Detail_des_effets!S112)+(Type_piece!$D$6*Empilage!S39)+(Type_piece!$E$6)+(Type_piece!$D$7*Empilage!S40)+(Type_piece!$E$7)+(Type_piece!$D$8*Empilage!S41^3)+(Type_piece!$E$8*Empilage!S41^2)+(Type_piece!$F$8*Empilage!S41)+Type_piece!$G$8)*10^-1)","v":{"v":2.3147681359334655E-3,"d":"0.002"}},"mm au diamètre",null,"Déformée radiale",{"$f":"IF(COUNTIF(Empilage!W38,\"*1 - Profil cylindrique*\"),(W115/Empilage!W$45)*(Detail_des_effets!W113-Empilage!W$52*Detail_des_effets!W112)*10^-1,((W115/Empilage!W$45)*(Detail_des_effets!W113-Empilage!W$52*Detail_des_effets!W112)+(Type_piece!$D$6*Empilage!W39)+(Type_piece!$E$6)+(Type_piece!$D$7*Empilage!W40)+(Type_piece!$E$7)+(Type_piece!$D$8*Empilage!W41^3)+(Type_piece!$E$8*Empilage!W41^2)+(Type_piece!$F$8*Empilage!W41)+Type_piece!$G$8)*10^-1)","v":{"v":2.3147681359334655E-3,"d":"0.002"}},"mm au diamètre",null,"Déformée radiale",{"$f":"IF(COUNTIF(Empilage!AA38,\"*1 - Profil cylindrique*\"),(AA115/Empilage!AA$45)*(Detail_des_effets!AA113-Empilage!AA$52*Detail_des_effets!AA112)*10^-1,((AA115/Empilage!AA$45)*(Detail_des_effets!AA113-Empilage!AA$52*Detail_des_effets!AA112)+(Type_piece!$D$6*Empilage!AA39)+(Type_piece!$E$6)+(Type_piece!$D$7*Empilage!AA40)+(Type_piece!$E$7)+(Type_piece!$D$8*Empilage!AA41^3)+(Type_piece!$E$8*Empilage!AA41^2)+(Type_piece!$F$8*Empilage!AA41)+Type_piece!$G$8)*10^-1)","v":{"v":2.3147681359334655E-3,"d":"0.002"}},"mm au diamètre",null,"Déformée radiale",{"$f":"IF(COUNTIF(Empilage!AE38,\"*1 - Profil cylindrique*\"),(AE115/Empilage!AE$45)*(Detail_des_effets!AE113-Empilage!AE$52*Detail_des_effets!AE112)*10^-1,((AE115/Empilage!AE$45)*(Detail_des_effets!AE113-Empilage!AE$52*Detail_des_effets!AE112)+(Type_piece!$D$6*Empilage!AE39)+(Type_piece!$E$6)+(Type_piece!$D$7*Empilage!AE40)+(Type_piece!$E$7)+(Type_piece!$D$8*Empilage!AE41^3)+(Type_piece!$E$8*Empilage!AE41^2)+(Type_piece!$F$8*Empilage!AE41)+Type_piece!$G$8)*10^-1)","v":{"v":2.3147681359334655E-3,"d":"0.002"}},"mm au diamètre",null,"Déformée radiale",{"$f":"IF(COUNTIF(Empilage!AI38,\"*1 - Profil cylindrique*\"),(AI115/Empilage!AI$45)*(Detail_des_effets!AI113-Empilage!AI$52*Detail_des_effets!AI112)*10^-1,((AI115/Empilage!AI$45)*(Detail_des_effets!AI113-Empilage!AI$52*Detail_des_effets!AI112)+(Type_piece!$D$6*Empilage!AI39)+(Type_piece!$E$6)+(Type_piece!$D$7*Empilage!AI40)+(Type_piece!$E$7)+(Type_piece!$D$8*Empilage!AI41^3)+(Type_piece!$E$8*Empilage!AI41^2)+(Type_piece!$F$8*Empilage!AI41)+Type_piece!$G$8)*10^-1)","v":{"v":2.3147681359334655E-3,"d":"0.002"}},"mm au diamètre",null,"Déformée radiale",{"$f":"IF(COUNTIF(Empilage!AM38,\"*1 - Profil cylindrique*\"),(AM115/Empilage!AM$45)*(Detail_des_effets!AM113-Empilage!AM$52*Detail_des_effets!AM112)*10^-1,((AM115/Empilage!AM$45)*(Detail_des_effets!AM113-Empilage!AM$52*Detail_des_effets!AM112)+(Type_piece!$D$6*Empilage!AM39)+(Type_piece!$E$6)+(Type_piece!$D$7*Empilage!AM40)+(Type_piece!$E$7)+(Type_piece!$D$8*Empilage!AM41^3)+(Type_piece!$E$8*Empilage!AM41^2)+(Type_piece!$F$8*Empilage!AM41)+Type_piece!$G$8)*10^-1)","v":{"v":2.3147681359334655E-3,"d":"0.002"}},"mm au diamètre"]
[null,"Dans la pièce, au diamètre particulier",{"$f":"Empilage!C$37","v":{"v":29,"d":"29.00"}},"mm",null,"Dans la pièce, au diamètre particulier",{"$f":"Empilage!G$37","v":{"v":29,"d":"29.00"}},"mm",null,"Dans la pièce, au diamètre particulier",{"$f":"Empilage!K$37","v":{"v":29,"d":"29.00"}},"mm",null,"Dans la pièce, au diamètre particulier",{"$f":"Empilage!O$37","v":{"v":29,"d":"29.00"}},"mm",null,"Dans la pièce, au diamètre particulier",{"$f":"Empilage!S$37","v":{"v":29,"d":"29.00"}},"mm",null,"Dans la pièce, au diamètre particulier",{"$f":"Empilage!W$37","v":{"v":29,"d":"29.00"}},"mm",null,"Dans la pièce, au diamètre particulier",{"$f":"Empilage!AA$37","v":{"v":29,"d":"29.00"}},"mm",null,"Dans la pièce, au diamètre particulier",{"$f":"Empilage!AE$37","v":{"v":29,"d":"29.00"}},"mm",null,"Dans la pièce, au diamètre particulier",{"$f":"Empilage!AI$37","v":{"v":29,"d":"29.00"}},"mm",null,"Dans la pièce, au diamètre particulier",{"$f":"Empilage!AM$37","v":{"v":29,"d":"29.00"}},"mm"]
[null,"Contrainte radiale",{"$f":"10^-12*(3+Empilage!C52)/32*Empilage!C53*Empilage!$D$87^2*(Empilage!C36^2+Empilage!C35^2-(Empilage!C36*Empilage!C35/Detail_des_effets!C115)^2-Detail_des_effets!C115^2)","v":{"v":0.12660492597448536,"d":"0.13"}},"MPa",null,"Contrainte radiale",{"$f":"10^-12*(3+Empilage!G52)/32*Empilage!G53*Empilage!$D$87^2*(Empilage!G36^2+Empilage!G35^2-(Empilage!G36*Empilage!G35/Detail_des_effets!G115)^2-Detail_des_effets!G115^2)","v":{"v":0.12660492597448536,"d":"0.13"}},"MPa",null,"Contrainte radiale",{"$f":"10^-12*(3+Empilage!K52)/32*Empilage!K53*Empilage!$D$87^2*(Empilage!K36^2+Empilage!K35^2-(Empilage!K36*Empilage!K35/Detail_des_effets!K115)^2-Detail_des_effets!K115^2)","v":{"v":0.12660492597448536,"d":"0.13"}},"MPa",null,"Contrainte radiale",{"$f":"10^-12*(3+Empilage!O52)/32*Empilage!O53*Empilage!$D$87^2*(Empilage!O36^2+Empilage!O35^2-(Empilage!O36*Empilage!O35/Detail_des_effets!O115)^2-Detail_des_effets!O115^2)","v":{"v":0.12660492597448536,"d":"0.13"}},"MPa",null,"Contrainte radiale",{"$f":"10^-12*(3+Empilage!S52)/32*Empilage!S53*Empilage!$D$87^2*(Empilage!S36^2+Empilage!S35^2-(Empilage!S36*Empilage!S35/Detail_des_effets!S115)^2-Detail_des_effets!S115^2)","v":{"v":0.12660492597448536,"d":"0.13"}},"MPa",null,"Contrainte radiale",{"$f":"10^-12*(3+Empilage!W52)/32*Empilage!W53*Empilage!$D$87^2*(Empilage!W36^2+Empilage!W35^2-(Empilage!W36*Empilage!W35/Detail_des_effets!W115)^2-Detail_des_effets!W115^2)","v":{"v":0.12660492597448536,"d":"0.13"}},"MPa",null,"Contrainte radiale",{"$f":"10^-12*(3+Empilage!AA52)/32*Empilage!AA53*Empilage!$D$87^2*(Empilage!AA36^2+Empilage!AA35^2-(Empilage!AA36*Empilage!AA35/Detail_des_effets!AA115)^2-Detail_des_effets!AA115^2)","v":{"v":0.12660492597448536,"d":"0.13"}},"MPa",null,"Contrainte radiale",{"$f":"10^-12*(3+Empilage!AE52)/32*Empilage!AE53*Empilage!$D$87^2*(Empilage!AE36^2+Empilage!AE35^2-(Empilage!AE36*Empilage!AE35/Detail_des_effets!AE115)^2-Detail_des_effets!AE115^2)","v":{"v":0.12660492597448536,"d":"0.13"}},"MPa",null,"Contrainte radiale",{"$f":"10^-12*(3+Empilage!AI52)/32*Empilage!AI53*Empilage!$D$87^2*(Empilage!AI36^2+Empilage!AI35^2-(Empilage!AI36*Empilage!AI35/Detail_des_effets!AI115)^2-Detail_des_effets!AI115^2)","v":{"v":0.12660492597448536,"d":"0.13"}},"MPa",null,"Contrainte radiale",{"$f":"10^-12*(3+Empilage!AM52)/32*Empilage!AM53*Empilage!$D$87^2*(Empilage!AM36^2+Empilage!AM35^2-(Empilage!AM36*Empilage!AM35/Detail_des_effets!AM115)^2-Detail_des_effets!AM115^2)","v":{"v":0.12660492597448536,"d":"0.13"}},"MPa"]
[null,"Contrainte tangentielle",{"$f":"10^-12*Empilage!C53/32*Empilage!$D$87^2*((3+Empilage!C52)*(Empilage!C36^2+Empilage!C35^2+(Empilage!C36*Empilage!C35/Detail_des_effets!C115)^2)-(1+3*Empilage!C52)*Detail_des_effets!C115^2)","v":{"v":14.39014840367117,"d":"14"}},"MPa",null,"Contrainte tangentielle",{"$f":"10^-12*Empilage!G53/32*Empilage!$D$87^2*((3+Empilage!G52)*(Empilage!G36^2+Empilage!G35^2+(Empilage!G36*Empilage!G35/Detail_des_effets!G115)^2)-(1+3*Empilage!G52)*Detail_des_effets!G115^2)","v":{"v":14.39014840367117,"d":"14"}},"MPa",null,"Contrainte tangentielle",{"$f":"10^-12*Empilage!K53/32*Empilage!$D$87^2*((3+Empilage!K52)*(Empilage!K36^2+Empilage!K35^2+(Empilage!K36*Empilage!K35/Detail_des_effets!K115)^2)-(1+3*Empilage!K52)*Detail_des_effets!K115^2)","v":{"v":14.39014840367117,"d":"14"}},"MPa",null,"Contrainte tangentielle",{"$f":"10^-12*Empilage!O53/32*Empilage!$D$87^2*((3+Empilage!O52)*(Empilage!O36^2+Empilage!O35^2+(Empilage!O36*Empilage!O35/Detail_des_effets!O115)^2)-(1+3*Empilage!O52)*Detail_des_effets!O115^2)","v":{"v":14.39014840367117,"d":"14"}},"MPa",null,"Contrainte tangentielle",{"$f":"10^-12*Empilage!S53/32*Empilage!$D$87^2*((3+Empilage!S52)*(Empilage!S36^2+Empilage!S35^2+(Empilage!S36*Empilage!S35/Detail_des_effets!S115)^2)-(1+3*Empilage!S52)*Detail_des_effets!S115^2)","v":{"v":14.39014840367117,"d":"14"}},"MPa",null,"Contrainte tangentielle",{"$f":"10^-12*Empilage!W53/32*Empilage!$D$87^2*((3+Empilage!W52)*(Empilage!W36^2+Empilage!W35^2+(Empilage!W36*Empilage!W35/Detail_des_effets!W115)^2)-(1+3*Empilage!W52)*Detail_des_effets!W115^2)","v":{"v":14.39014840367117,"d":"14"}},"MPa",null,"Contrainte tangentielle",{"$f":"10^-12*Empilage!AA53/32*Empilage!$D$87^2*((3+Empilage!AA52)*(Empilage!AA36^2+Empilage!AA35^2+(Empilage!AA36*Empilage!AA35/Detail_des_effets!AA115)^2)-(1+3*Empilage!AA52)*Detail_des_effets!AA115^2)","v":{"v":14.39014840367117,"d":"14"}},"MPa",null,"Contrainte tangentielle",{"$f":"10^-12*Empilage!AE53/32*Empilage!$D$87^2*((3+Empilage!AE52)*(Empilage!AE36^2+Empilage!AE35^2+(Empilage!AE36*Empilage!AE35/Detail_des_effets!AE115)^2)-(1+3*Empilage!AE52)*Detail_des_effets!AE115^2)","v":{"v":14.39014840367117,"d":"14"}},"MPa",null,"Contrainte tangentielle",{"$f":"10^-12*Empilage!AI53/32*Empilage!$D$87^2*((3+Empilage!AI52)*(Empilage!AI36^2+Empilage!AI35^2+(Empilage!AI36*Empilage!AI35/Detail_des_effets!AI115)^2)-(1+3*Empilage!AI52)*Detail_des_effets!AI115^2)","v":{"v":14.39014840367117,"d":"14"}},"MPa",null,"Contrainte tangentielle",{"$f":"10^-12*Empilage!AM53/32*Empilage!$D$87^2*((3+Empilage!AM52)*(Empilage!AM36^2+Empilage!AM35^2+(Empilage!AM36*Empilage!AM35/Detail_des_effets!AM115)^2)-(1+3*Empilage!AM52)*Detail_des_effets!AM115^2)","v":{"v":14.39014840367117,"d":"14"}},"MPa"]
[null,"Déformée radiale",{"$f":"IF(COUNTIF(Empilage!C38,\"*1 - Profil cylindrique*\"),(C$115/Empilage!C$45)*(Detail_des_effets!C117-Empilage!C$52*Detail_des_effets!C116)*10^-1,((C$115/Empilage!C$45)*(Detail_des_effets!C117-Empilage!C$52*Detail_des_effets!C116)+Type_piece!$D$6*Empilage!C39+Type_piece!$E$6+Type_piece!$D$7*Empilage!C40+Type_piece!$E$7+(Type_piece!$D$8*Empilage!C41^3)+(Type_piece!$E$8*Empilage!C41^2)+(Type_piece!$F$8*Empilage!C41)+Type_piece!$G$8)*10^-1)","v":{"v":1.9170174556457345E-3,"d":"0.002"}},"mm au diamètre",null,"Déformée radiale",{"$f":"IF(COUNTIF(Empilage!G38,\"*1 - Profil cylindrique*\"),(G$115/Empilage!G$45)*(Detail_des_effets!G117-Empilage!G$52*Detail_des_effets!G116)*10^-1,((G$115/Empilage!G$45)*(Detail_des_effets!G117-Empilage!G$52*Detail_des_effets!G116)+Type_piece!$D$6*Empilage!G39+Type_piece!$E$6+Type_piece!$D$7*Empilage!G40+Type_piece!$E$7+(Type_piece!$D$8*Empilage!G41^3)+(Type_piece!$E$8*Empilage!G41^2)+(Type_piece!$F$8*Empilage!G41)+Type_piece!$G$8)*10^-1)","v":{"v":1.9170174556457345E-3,"d":"0.002"}},"mm au diamètre",null,"Déformée radiale",{"$f":"IF(COUNTIF(Empilage!K38,\"*1 - Profil cylindrique*\"),(K$115/Empilage!K$45)*(Detail_des_effets!K117-Empilage!K$52*Detail_des_effets!K116)*10^-1,((K$115/Empilage!K$45)*(Detail_des_effets!K117-Empilage!K$52*Detail_des_effets!K116)+Type_piece!$D$6*Empilage!K39+Type_piece!$E$6+Type_piece!$D$7*Empilage!K40+Type_piece!$E$7+(Type_piece!$D$8*Empilage!K41^3)+(Type_piece!$E$8*Empilage!K41^2)+(Type_piece!$F$8*Empilage!K41)+Type_piece!$G$8)*10^-1)","v":{"v":1.9170174556457345E-3,"d":"0.002"}},"mm au diamètre",null,"Déformée radiale",{"$f":"IF(COUNTIF(Empilage!O38,\"*1 - Profil cylindrique*\"),(O$115/Empilage!O$45)*(Detail_des_effets!O117-Empilage!O$52*Detail_des_effets!O116)*10^-1,((O$115/Empilage!O$45)*(Detail_des_effets!O117-Empilage!O$52*Detail_des_effets!O116)+Type_piece!$D$6*Empilage!O39+Type_piece!$E$6+Type_piece!$D$7*Empilage!O40+Type_piece!$E$7+(Type_piece!$D$8*Empilage!O41^3)+(Type_piece!$E$8*Empilage!O41^2)+(Type_piece!$F$8*Empilage!O41)+Type_piece!$G$8)*10^-1)","v":{"v":1.9170174556457345E-3,"d":"0.002"}},"mm au diamètre",null,"Déformée radiale",{"$f":"IF(COUNTIF(Empilage!S38,\"*1 - Profil cylindrique*\"),(S$115/Empilage!S$45)*(Detail_des_effets!S117-Empilage!S$52*Detail_des_effets!S116)*10^-1,((S$115/Empilage!S$45)*(Detail_des_effets!S117-Empilage!S$52*Detail_des_effets!S116)+Type_piece!$D$6*Empilage!S39+Type_piece!$E$6+Type_piece!$D$7*Empilage!S40+Type_piece!$E$7+(Type_piece!$D$8*Empilage!S41^3)+(Type_piece!$E$8*Empilage!S41^2)+(Type_piece!$F$8*Empilage!S41)+Type_piece!$G$8)*10^-1)","v":{"v":1.9170174556457345E-3,"d":"0.002"}},"mm au diamètre",null,"Déformée radiale",{"$f":"IF(COUNTIF(Empilage!W38,\"*1 - Profil cylindrique*\"),(W$115/Empilage!W$45)*(Detail_des_effets!W117-Empilage!W$52*Detail_des_effets!W116)*10^-1,((W$115/Empilage!W$45)*(Detail_des_effets!W117-Empilage!W$52*Detail_des_effets!W116)+Type_piece!$D$6*Empilage!W39+Type_piece!$E$6+Type_piece!$D$7*Empilage!W40+Type_piece!$E$7+(Type_piece!$D$8*Empilage!W41^3)+(Type_piece!$E$8*Empilage!W41^2)+(Type_piece!$F$8*Empilage!W41)+Type_piece!$G$8)*10^-1)","v":{"v":1.9170174556457345E-3,"d":"0.002"}},"mm au diamètre",null,"Déformée radiale",{"$f":"IF(COUNTIF(Empilage!AA38,\"*1 - Profil cylindrique*\"),(AA$115/Empilage!AA$45)*(Detail_des_effets!AA117-Empilage!AA$52*Detail_des_effets!AA116)*10^-1,((AA$115/Empilage!AA$45)*(Detail_des_effets!AA117-Empilage!AA$52*Detail_des_effets!AA116)+Type_piece!$D$6*Empilage!AA39+Type_piece!$E$6+Type_piece!$D$7*Empilage!AA40+Type_piece!$E$7+(Type_piece!$D$8*Empilage!AA41^3)+(Type_piece!$E$8*Empilage!AA41^2)+(Type_piece!$F$8*Empilage!AA41)+Type_piece!$G$8)*10^-1)","v":{"v":1.9170174556457345E-3,"d":"0.002"}},"mm au diamètre",null,"Déformée radiale",{"$f":"IF(COUNTIF(Empilage!AE38,\"*1 - Profil cylindrique*\"),(AE$115/Empilage!AE$45)*(Detail_des_effets!AE117-Empilage!AE$52*Detail_des_effets!AE116)*10^-1,((AE$115/Empilage!AE$45)*(Detail_des_effets!AE117-Empilage!AE$52*Detail_des_effets!AE116)+Type_piece!$D$6*Empilage!AE39+Type_piece!$E$6+Type_piece!$D$7*Empilage!AE40+Type_piece!$E$7+(Type_piece!$D$8*Empilage!AE41^3)+(Type_piece!$E$8*Empilage!AE41^2)+(Type_piece!$F$8*Empilage!AE41)+Type_piece!$G$8)*10^-1)","v":{"v":1.9170174556457345E-3,"d":"0.002"}},"mm au diamètre",null,"Déformée radiale",{"$f":"IF(COUNTIF(Empilage!AI38,\"*1 - Profil cylindrique*\"),(AI$115/Empilage!AI$45)*(Detail_des_effets!AI117-Empilage!AI$52*Detail_des_effets!AI116)*10^-1,((AI$115/Empilage!AI$45)*(Detail_des_effets!AI117-Empilage!AI$52*Detail_des_effets!AI116)+Type_piece!$D$6*Empilage!AI39+Type_piece!$E$6+Type_piece!$D$7*Empilage!AI40+Type_piece!$E$7+(Type_piece!$D$8*Empilage!AI41^3)+(Type_piece!$E$8*Empilage!AI41^2)+(Type_piece!$F$8*Empilage!AI41)+Type_piece!$G$8)*10^-1)","v":{"v":1.9170174556457345E-3,"d":"0.002"}},"mm au diamètre",null,"Déformée radiale",{"$f":"IF(COUNTIF(Empilage!AM38,\"*1 - Profil cylindrique*\"),(AM$115/Empilage!AM$45)*(Detail_des_effets!AM117-Empilage!AM$52*Detail_des_effets!AM116)*10^-1,((AM$115/Empilage!AM$45)*(Detail_des_effets!AM117-Empilage!AM$52*Detail_des_effets!AM116)+Type_piece!$D$6*Empilage!AM39+Type_piece!$E$6+Type_piece!$D$7*Empilage!AM40+Type_piece!$E$7+(Type_piece!$D$8*Empilage!AM41^3)+(Type_piece!$E$8*Empilage!AM41^2)+(Type_piece!$F$8*Empilage!AM41)+Type_piece!$G$8)*10^-1)","v":{"v":1.9170174556457345E-3,"d":"0.002"}},"mm au diamètre"]
[null,"Effet de la pression seule",{"$nulls":3},"Effet de la pression seule",{"$nulls":3},"Effet de la pression seule",{"$nulls":3},"Effet de la pression seule",{"$nulls":3},"Effet de la pression seule",{"$nulls":3},"Effet de la pression seule",{"$nulls":3},"Effet de la pression seule",{"$nulls":3},"Effet de la pression seule",{"$nulls":3},"Effet de la pression seule",{"$nulls":3},"Effet de la pression seule"]
[]
[null,"Au niveau du frettage",{"$nulls":3},"Au niveau du frettage",{"$nulls":3},"Au niveau du frettage",{"$nulls":3},"Au niveau du frettage",{"$nulls":3},"Au niveau du frettage",{"$nulls":3},"Au niveau du frettage",{"$nulls":3},"Au niveau du frettage",{"$nulls":3},"Au niveau du frettage",{"$nulls":3},"Au niveau du frettage",{"$nulls":3},"Au niveau du frettage"]
[null,"Contrainte radiale",{"$f":"-Empilage!$D$90/10","v":-1},"MPa",null,"Contrainte radiale",{"$f":"-Empilage!$D$90/10","v":-1},"MPa",null,"Contrainte radiale",{"$f":"-Empilage!$D$90/10","v":-1},"MPa",null,"Contrainte radiale",{"$f":"-Empilage!$D$90/10","v":-1},"MPa",null,"Contrainte radiale",{"$f":"-Empilage!$D$90/10","v":-1},"MPa",null,"Contrainte radiale",{"$f":"-Empilage!$D$90/10","v":-1},"MPa",null,"Contrainte radiale",{"$f":"-Empilage!$D$90/10","v":-1},"MPa",null,"Contrainte radiale",{"$f":"-Empilage!$D$90/10","v":-1},"MPa",null,"Contrainte radiale",{"$f":"-Empilage!$D$90/10","v":-1},"MPa",null,"Contrainte radiale",{"$f":"-Empilage!$D$90/10","v":-1},"MPa"]
[null,"Contrainte tangentielle",{"$f":"((Empilage!C36^2+Empilage!C35^2)*Empilage!$D$90-2*Empilage!C35^2*Empilage!$D$91)/(Empilage!C35^2-Empilage!C36^2)/10","v":{"v":-7.545454545454545,"d":"-8"}},"MPa",null,"Contrainte tangentielle",{"$f":"((Empilage!G36^2+Empilage!G35^2)*Empilage!$D$90-2*Empilage!G35^2*Empilage!$D$91)/(Empilage!G35^2-Empilage!G36^2)/10","v":{"v":-7.545454545454545,"d":"-8"}},"MPa",null,"Contrainte tangentielle",{"$f":"((Empilage!K36^2+Empilage!K35^2)*Empilage!$D$90-2*Empilage!K35^2*Empilage!$D$91)/(Empilage!K35^2-Empilage!K36^2)/10","v":{"v":-7.545454545454545,"d":"-8"}},"MPa",null,"Contrainte tangentielle",{"$f":"((Empilage!O36^2+Empilage!O35^2)*Empilage!$D$90-2*Empilage!O35^2*Empilage!$D$91)/(Empilage!O35^2-Empilage!O36^2)/10","v":{"v":-7.545454545454545,"d":"-8"}},"MPa",null,"Contrainte tangentielle",{"$f":"((Empilage!S36^2+Empilage!S35^2)*Empilage!$D$90-2*Empilage!S35^2*Empilage!$D$91)/(Empilage!S35^2-Empilage!S36^2)/10","v":{"v":-7.545454545454545,"d":"-8"}},"MPa",null,"Contrainte tangentielle",{"$f":"((Empilage!W36^2+Empilage!W35^2)*Empilage!$D$90-2*Empilage!W35^2*Empilage!$D$91)/(Empilage!W35^2-Empilage!W36^2)/10","v":{"v":-7.545454545454545,"d":"-8"}},"MPa",null,"Contrainte tangentielle",{"$f":"((Empilage!AA36^2+Empilage!AA35^2)*Empilage!$D$90-2*Empilage!AA35^2*Empilage!$D$91)/(Empilage!AA35^2-Empilage!AA36^2)/10","v":{"v":-7.545454545454545,"d":"-8"}},"MPa",null,"Contrainte tangentielle",{"$f":"((Empilage!AE36^2+Empilage!AE35^2)*Empilage!$D$90-2*Empilage!AE35^2*Empilage!$D$91)/(Empilage!AE35^2-Empilage!AE36^2)/10","v":{"v":-7.545454545454545,"d":"-8"}},"MPa",null,"Contrainte tangentielle",{"$f":"((Empilage!AI36^2+Empilage!AI35^2)*Empilage!$D$90-2*Empilage!AI35^2*Empilage!$D$91)/(Empilage!AI35^2-Empilage!AI36^2)/10","v":{"v":-7.545454545454545,"d":"-8"}},"MPa",null,"Contrainte tangentielle",{"$f":"((Empilage!AM36^2+Empilage!AM35^2)*Empilage!$D$90-2*Empilage!AM35^2*Empilage!$D$91)/(Empilage!AM35^2-Empilage!AM36^2)/10","v":{"v":-7.545454545454545,"d":"-8"}},"MPa"]
[null,"Déformée radiale",{"$f":"(C$125/Empilage!C$45)*(Detail_des_effets!C123-Empilage!C$52*Detail_des_effets!C122)*10^-1","v":{"v":-9.7033395896029624E-4,"d":"-0.001"}},"mm au diamètre",null,"Déformée radiale",{"$f":"(G$125/Empilage!G$45)*(Detail_des_effets!G123-Empilage!G$52*Detail_des_effets!G122)*10^-1","v":{"v":-9.7033395896029624E-4,"d":"-0.001"}},"mm au diamètre",null,"Déformée radiale",{"$f":"(K$125/Empilage!K$45)*(Detail_des_effets!K123-Empilage!K$52*Detail_des_effets!K122)*10^-1","v":{"v":-9.7033395896029624E-4,"d":"-0.001"}},"mm au diamètre",null,"Déformée radiale",{"$f":"(O$125/Empilage!O$45)*(Detail_des_effets!O123-Empilage!O$52*Detail_des_effets!O122)*10^-1","v":{"v":-9.7033395896029624E-4,"d":"-0.001"}},"mm au diamètre",null,"Déformée radiale",{"$f":"(S$125/Empilage!S$45)*(Detail_des_effets!S123-Empilage!S$52*Detail_des_effets!S122)*10^-1","v":{"v":-9.7033395896029624E-4,"d":"-0.001"}},"mm au diamètre",null,"Déformée radiale",{"$f":"(W$125/Empilage!W$45)*(Detail_des_effets!W123-Empilage!W$52*Detail_des_effets!W122)*10^-1","v":{"v":-9.7033395896029624E-4,"d":"-0.001"}},"mm au diamètre",null,"Déformée radiale",{"$f":"(AA$125/Empilage!AA$45)*(Detail_des_effets!AA123-Empilage!AA$52*Detail_des_effets!AA122)*10^-1","v":{"v":-9.7033395896029624E-4,"d":"-0.001"}},"mm au diamètre",null,"Déformée radiale",{"$f":"(AE$125/Empilage!AE$45)*(Detail_des_effets!AE123-Empilage!AE$52*Detail_des_effets!AE122)*10^-1","v":{"v":-9.7033395896029624E-4,"d":"-0.001"}},"mm au diamètre",null,"Déformée radiale",{"$f":"(AI$125/Empilage!AI$45)*(Detail_des_effets!AI123-Empilage!AI$52*Detail_des_effets!AI122)*10^-1","v":{"v":-9.7033395896029624E-4,"d":"-0.001"}},"mm au diamètre",null,"Déformée radiale",{"$f":"(AM$125/Empilage!AM$45)*(Detail_des_effets!AM123-Empilage!AM$52*Detail_des_effets!AM122)*10^-1","v":{"v":-9.7033395896029624E-4,"d":"-0.001"}},"mm au diamètre"]
[null,"Dans la pièce, au diamètre particulier",{"$f":"Empilage!C$37","v":{"v":29,"d":"29.00"}},"mm",null,"Dans la pièce, au diamètre particulier",{"$f":"Empilage!G$37","v":{"v":29,"d":"29.00"}},"mm",null,"Dans la pièce, au diamètre particulier",{"$f":"Empilage!K$37","v":{"v":29,"d":"29.00"}},"mm",null,"Dans la pièce, au diamètre particulier",{"$f":"Empilage!O$37","v":{"v":29,"d":"29.00"}},"mm",null,"Dans la pièce, au diamètre particulier",{"$f":"Empilage!S$37","v":{"v":29,"d":"29.00"}},"mm",null,"Dans la pièce, au diamètre particulier",{"$f":"Empilage!W$37","v":{"v":29,"d":"29.00"}},"mm",null,"Dans la pièce, au diamètre particulier",{"$f":"Empilage!AA$37","v":{"v":29,"d":"29.00"}},"mm",null,"Dans la pièce, au diamètre particulier",{"$f":"Empilage!AE$37","v":{"v":29,"d":"29.00"}},"mm",null,"Dans la pièce, au diamètre particulier",{"$f":"Empilage!AI$37","v":{"v":29,"d":"29.00"}},"mm",null,"Dans la pièce, au diamètre particulier",{"$f":"Empilage!AM$37","v":{"v":29,"d":"29.00"}},"mm"]
[null,"Contrainte radiale",{"$f":"(C$125^2*(Empilage!C36^2*Empilage!$D$90-Empilage!C35^2*Empilage!$D$91)-(Empilage!$D$90-Empilage!$D$91)*Empilage!C36^2*Empilage!C35^2)/(Detail_des_effets!C$125^2*(Empilage!C35^2-Empilage!C36^2))/10","v":{"v":-1.8405577775375637,"d":"-2"}},"MPa",null,"Contrainte radiale",{"$f":"(G$125^2*(Empilage!G36^2*Empilage!$D$90-Empilage!G35^2*Empilage!$D$91)-(Empilage!$D$90-Empilage!$D$91)*Empilage!G36^2*Empilage!G35^2)/(Detail_des_effets!G$125^2*(Empilage!G35^2-Empilage!G36^2))/10","v":{"v":-1.8405577775375637,"d":"-2"}},"MPa",null,"Contrainte radiale",{"$f":"(K$125^2*(Empilage!K36^2*Empilage!$D$90-Empilage!K35^2*Empilage!$D$91)-(Empilage!$D$90-Empilage!$D$91)*Empilage!K36^2*Empilage!K35^2)/(Detail_des_effets!K$125^2*(Empilage!K35^2-Empilage!K36^2))/10","v":{"v":-1.8405577775375637,"d":"-2"}},"MPa",null,"Contrainte radiale",{"$f":"(O$125^2*(Empilage!O36^2*Empilage!$D$90-Empilage!O35^2*Empilage!$D$91)-(Empilage!$D$90-Empilage!$D$91)*Empilage!O36^2*Empilage!O35^2)/(Detail_des_effets!O$125^2*(Empilage!O35^2-Empilage!O36^2))/10","v":{"v":-1.8405577775375637,"d":"-2"}},"MPa",null,"Contrainte radiale",{"$f":"(S$125^2*(Empilage!S36^2*Empilage!$D$90-Empilage!S35^2*Empilage!$D$91)-(Empilage!$D$90-Empilage!$D$91)*Empilage!S36^2*Empilage!S35^2)/(Detail_des_effets!S$125^2*(Empilage!S35^2-Empilage!S36^2))/10","v":{"v":-1.8405577775375637,"d":"-2"}},"MPa",null,"Contrainte radiale",{"$f":"(W$125^2*(Empilage!W36^2*Empilage!$D$90-Empilage!W35^2*Empilage!$D$91)-(Empilage!$D$90-Empilage!$D$91)*Empilage!W36^2*Empilage!W35^2)/(Detail_des_effets!W$125^2*(Empilage!W35^2-Empilage!W36^2))/10","v":{"v":-1.8405577775375637,"d":"-2"}},"MPa",null,"Contrainte radiale",{"$f":"(AA$125^2*(Empilage!AA36^2*Empilage!$D$90-Empilage!AA35^2*Empilage!$D$91)-(Empilage!$D$90-Empilage!$D$91)*Empilage!AA36^2*Empilage!AA35^2)/(Detail_des_effets!AA$125^2*(Empilage!AA35^2-Empilage!AA36^2))/10","v":{"v":-1.8405577775375637,"d":"-2"}},"MPa",null,"Contrainte radiale",{"$f":"(AE$125^2*(Empilage!AE36^2*Empilage!$D$90-Empilage!AE35^2*Empilage!$D$91)-(Empilage!$D$90-Empilage!$D$91)*Empilage!AE36^2*Empilage!AE35^2)/(Detail_des_effets!AE$125^2*(Empilage!AE35^2-Empilage!AE36^2))/10","v":{"v":-1.8405577775375637,"d":"-2"}},"MPa",null,"Contrainte radiale",{"$f":"(AI$125^2*(Empilage!AI36^2*Empilage!$D$90-Empilage!AI35^2*Empilage!$D$91)-(Empilage!$D$90-Empilage!$D$91)*Empilage!AI36^2*Empilage!AI35^2)/(Detail_des_effets!AI$125^2*(Empilage!AI35^2-Empilage!AI36^2))/10","v":{"v":-1.8405577775375637,"d":"-2"}},"MPa",null,"Contrainte radiale",{"$f":"(AM$125^2*(Empilage!AM36^2*Empilage!$D$90-Empilage!AM35^2*Empilage!$D$91)-(Empilage!$D$90-Empilage!$D$91)*Empilage!AM36^2*Empilage!AM35^2)/(Detail_des_effets!AM$125^2*(Empilage!AM35^2-Empilage!AM36^2))/10","v":{"v":-1.8405577775375637,"d":"-2"}},"MPa"]
[null,"Contrainte tangentielle",{"$f":"(C$125^2*(Empilage!C36^2*Empilage!$D$90-Empilage!C35^2*Empilage!$D$91)+(Empilage!$D$90-Empilage!$D$91)*Empilage!C36^2*Empilage!C35^2)/Detail_des_effets!C$125^2/(Empilage!C35^2-Empilage!C36^2)/10","v":{"v":-6.704896767916982,"d":"-7"}},"MPa",null,"Contrainte tangentielle",{"$f":"(G$125^2*(Empilage!G36^2*Empilage!$D$90-Empilage!G35^2*Empilage!$D$91)+(Empilage!$D$90-Empilage!$D$91)*Empilage!G36^2*Empilage!G35^2)/Detail_des_effets!G$125^2/(Empilage!G35^2-Empilage!G36^2)/10","v":{"v":-6.704896767916982,"d":"-7"}},"MPa",null,"Contrainte tangentielle",{"$f":"(K$125^2*(Empilage!K36^2*Empilage!$D$90-Empilage!K35^2*Empilage!$D$91)+(Empilage!$D$90-Empilage!$D$91)*Empilage!K36^2*Empilage!K35^2)/Detail_des_effets!K$125^2/(Empilage!K35^2-Empilage!K36^2)/10","v":{"v":-6.704896767916982,"d":"-7"}},"MPa",null,"Contrainte tangentielle",{"$f":"(O$125^2*(Empilage!O36^2*Empilage!$D$90-Empilage!O35^2*Empilage!$D$91)+(Empilage!$D$90-Empilage!$D$91)*Empilage!O36^2*Empilage!O35^2)/Detail_des_effets!O$125^2/(Empilage!O35^2-Empilage!O36^2)/10","v":{"v":-6.704896767916982,"d":"-7"}},"MPa",null,"Contrainte tangentielle",{"$f":"(S$125^2*(Empilage!S36^2*Empilage!$D$90-Empilage!S35^2*Empilage!$D$91)+(Empilage!$D$90-Empilage!$D$91)*Empilage!S36^2*Empilage!S35^2)/Detail_des_effets!S$125^2/(Empilage!S35^2-Empilage!S36^2)/10","v":{"v":-6.704896767916982,"d":"-7"}},"MPa",null,"Contrainte tangentielle",{"$f":"(W$125^2*(Empilage!W36^2*Empilage!$D$90-Empilage!W35^2*Empilage!$D$91)+(Empilage!$D$90-Empilage!$D$91)*Empilage!W36^2*Empilage!W35^2)/Detail_des_effets!W$125^2/(Empilage!W35^2-Empilage!W36^2)/10","v":{"v":-6.704896767916982,"d":"-7"}},"MPa",null,"Contrainte tangentielle",{"$f":"(AA$125^2*(Empilage!AA36^2*Empilage!$D$90-Empilage!AA35^2*Empilage!$D$91)+(Empilage!$D$90-Empilage!$D$91)*Empilage!AA36^2*Empilage!AA35^2)/Detail_des_effets!AA$125^2/(Empilage!AA35^2-Empilage!AA36^2)/10","v":{"v":-6.704896767916982,"d":"-7"}},"MPa",null,"Contrainte tangentielle",{"$f":"(AE$125^2*(Empilage!AE36^2*Empilage!$D$90-Empilage!AE35^2*Empilage!$D$91)+(Empilage!$D$90-Empilage!$D$91)*Empilage!AE36^2*Empilage!AE35^2)/Detail_des_effets!AE$125^2/(Empilage!AE35^2-Empilage!AE36^2)/10","v":{"v":-6.704896767916982,"d":"-7"}},"MPa",null,"Contrainte tangentielle",{"$f":"(AI$125^2*(Empilage!AI36^2*Empilage!$D$90-Empilage!AI35^2*Empilage!$D$91)+(Empilage!$D$90-Empilage!$D$91)*Empilage!AI36^2*Empilage!AI35^2)/Detail_des_effets!AI$125^2/(Empilage!AI35^2-Empilage!AI36^2)/10","v":{"v":-6.704896767916982,"d":"-7"}},"MPa",null,"Contrainte tangentielle",{"$f":"(AM$125^2*(Empilage!AM36^2*Empilage!$D$90-Empilage!AM35^2*Empilage!$D$91)+(Empilage!$D$90-Empilage!$D$91)*Empilage!AM36^2*Empilage!AM35^2)/Detail_des_effets!AM$125^2/(Empilage!AM35^2-Empilage!AM36^2)/10","v":{"v":-6.704896767916982,"d":"-7"}},"MPa"]
[null,"Déformée radiale",{"$f":"(C$125/Empilage!C$45)*(Detail_des_effets!C127-Empilage!C$52*Detail_des_effets!C126)*10^-1","v":{"v":-8.2670329437540635E-4,"d":"-0.001"}},"mm au diamètre",null,"Déformée radiale",{"$f":"(G$125/Empilage!G$45)*(Detail_des_effets!G127-Empilage!G$52*Detail_des_effets!G126)*10^-1","v":{"v":-8.2670329437540635E-4,"d":"-0.001"}},"mm au diamètre",null,"Déformée radiale",{"$f":"(K$125/Empilage!K$45)*(Detail_des_effets!K127-Empilage!K$52*Detail_des_effets!K126)*10^-1","v":{"v":-8.2670329437540635E-4,"d":"-0.001"}},"mm au diamètre",null,"Déformée radiale",{"$f":"(O$125/Empilage!O$45)*(Detail_des_effets!O127-Empilage!O$52*Detail_des_effets!O126)*10^-1","v":{"v":-8.2670329437540635E-4,"d":"-0.001"}},"mm au diamètre",null,"Déformée radiale",{"$f":"(S$125/Empilage!S$45)*(Detail_des_effets!S127-Empilage!S$52*Detail_des_effets!S126)*10^-1","v":{"v":-8.2670329437540635E-4,"d":"-0.001"}},"mm au diamètre",null,"Déformée radiale",{"$f":"(W$125/Empilage!W$45)*(Detail_des_effets!W127-Empilage!W$52*Detail_des_effets!W126)*10^-1","v":{"v":-8.2670329437540635E-4,"d":"-0.001"}},"mm au diamètre",null,"Déformée radiale",{"$f":"(AA$125/Empilage!AA$45)*(Detail_des_effets!AA127-Empilage!AA$52*Detail_des_effets!AA126)*10^-1","v":{"v":-8.2670329437540635E-4,"d":"-0.001"}},"mm au diamètre",null,"Déformée radiale",{"$f":"(AE$125/Empilage!AE$45)*(Detail_des_effets!AE127-Empilage!AE$52*Detail_des_effets!AE126)*10^-1","v":{"v":-8.2670329437540635E-4,"d":"-0.001"}},"mm au diamètre",null,"Déformée radiale",{"$f":"(AI$125/Empilage!AI$45)*(Detail_des_effets!AI127-Empilage!AI$52*Detail_des_effets!AI126)*10^-1","v":{"v":-8.2670329437540635E-4,"d":"-0.001"}},"mm au diamètre",null,"Déformée radiale",{"$f":"(AM$125/Empilage!AM$45)*(Detail_des_effets!AM127-Empilage!AM$52*Detail_des_effets!AM126)*10^-1","v":{"v":-8.2670329437540635E-4,"d":"-0.001"}},"mm au diamètre"]
[null,"Effet de l'effort axial seul en montage",{"$nulls":3},"Effet de l'effort axial seul en montage",{"$nulls":3},"Effet de l'effort axial seul en montage",{"$nulls":3},"Effet de l'effort axial seul en montage",{"$nulls":3},"Effet de l'effort axial seul en montage",{"$nulls":3},"Effet de l'effort axial seul en montage",{"$nulls":3},"Effet de l'effort axial seul en montage",{"$nulls":3},"Effet de l'effort axial seul en montage",{"$nulls":3},"Effet de l'effort axial seul en montage",{"$nulls":3},"Effet de l'effort axial seul en montage"]
[]
[null,"Au niveau du frettage",{"$nulls":3},"Au niveau du frettage",{"$nulls":3},"Au niveau du frettage",{"$nulls":3},"Au niveau du frettage",{"$nulls":3},"Au niveau du frettage",{"$nulls":3},"Au niveau du frettage",{"$nulls":3},"Au niveau du frettage",{"$nulls":3},"Au niveau du frettage",{"$nulls":3},"Au niveau du frettage",{"$nulls":3},"Au niveau du frettage"]
[null,"Contrainte axiale",{"$f":"Empilage!$D$92*10/((PI()/4)*(Empilage!C$35^2-Empilage!C$36^2))","v":{"v":277.7977188513082,"d":"278"}},"MPa",null,"Contrainte axiale",{"$f":"Empilage!$D$92*10/((PI()/4)*(Empilage!G$35^2-Empilage!G$36^2))","v":{"v":277.7977188513082,"d":"278"}},"MPa",null,"Contrainte axiale",{"$f":"Empilage!$D$92*10/((PI()/4)*(Empilage!K$35^2-Empilage!K$36^2))","v":{"v":277.7977188513082,"d":"278"}},"MPa",null,"Contrainte axiale",{"$f":"Empilage!$D$92*10/((PI()/4)*(Empilage!O$35^2-Empilage!O$36^2))","v":{"v":277.7977188513082,"d":"278"}},"MPa",null,"Contrainte axiale",{"$f":"Empilage!$D$92*10/((PI()/4)*(Empilage!S$35^2-Empilage!S$36^2))","v":{"v":277.7977188513082,"d":"278"}},"MPa",null,"Contrainte axiale",{"$f":"Empilage!$D$92*10/((PI()/4)*(Empilage!W$35^2-Empilage!W$36^2))","v":{"v":277.7977188513082,"d":"278"}},"MPa",null,"Contrainte axiale",{"$f":"Empilage!$D$92*10/((PI()/4)*(Empilage!AA$35^2-Empilage!AA$36^2))","v":{"v":277.7977188513082,"d":"278"}},"MPa",null,"Contrainte axiale",{"$f":"Empilage!$D$92*10/((PI()/4)*(Empilage!AE$35^2-Empilage!AE$36^2))","v":{"v":277.7977188513082,"d":"278"}},"MPa",null,"Contrainte axiale",{"$f":"Empilage!$D$92*10/((PI()/4)*(Empilage!AI$35^2-Empilage!AI$36^2))","v":{"v":277.7977188513082,"d":"278"}},"MPa",null,"Contrainte axiale",{"$f":"Empilage!$D$92*10/((PI()/4)*(Empilage!AM$35^2-Empilage!AM$36^2))","v":{"v":277.7977188513082,"d":"278"}},"MPa"]
[null,"Déformée axiale",{"$f":"C$132/Empilage!C$43*Empilage!C$33*10^-1","v":{"v":0.07081047557973628,"d":"0.071"}},"mm",null,"Déformée axiale",{"$f":"G$132/Empilage!G$43*Empilage!G$33*10^-1","v":{"v":0.07081047557973628,"d":"0.071"}},"mm",null,"Déformée axiale",{"$f":"K$132/Empilage!K$43*Empilage!K$33*10^-1","v":{"v":0.07081047557973628,"d":"0.071"}},"mm",null,"Déformée axiale",{"$f":"O$132/Empilage!O$43*Empilage!O$33*10^-1","v":{"v":0.07081047557973628,"d":"0.071"}},"mm",null,"Déformée axiale",{"$f":"S$132/Empilage!S$43*Empilage!S$33*10^-1","v":{"v":0.07081047557973628,"d":"0.071"}},"mm",null,"Déformée axiale",{"$f":"W$132/Empilage!W$43*Empilage!W$33*10^-1","v":{"v":0.07081047557973628,"d":"0.071"}},"mm",null,"Déformée axiale",{"$f":"AA$132/Empilage!AA$43*Empilage!AA$33*10^-1","v":{"v":0.07081047557973628,"d":"0.071"}},"mm",null,"Déformée axiale",{"$f":"AE$132/Empilage!AE$43*Empilage!AE$33*10^-1","v":{"v":0.07081047557973628,"d":"0.071"}},"mm",null,"Déformée axiale",{"$f":"AI$132/Empilage!AI$43*Empilage!AI$33*10^-1","v":{"v":0.07081047557973628,"d":"0.071"}},"mm",null,"Déformée axiale",{"$f":"AM$132/Empilage!AM$43*Empilage!AM$33*10^-1","v":{"v":0.07081047557973628,"d":"0.071"}},"mm"]
[null,"Déformée radiale",{"$f":"-Empilage!C$52/Empilage!C$43*Empilage!C35*Detail_des_effets!C132*10^-1","v":{"v":-0.011267610422422115,"d":"-0.011"}},"mm au diamètre",null,"Déformée radiale",{"$f":"-Empilage!G$52/Empilage!G$43*Empilage!G35*Detail_des_effets!G132*10^-1","v":{"v":-0.011267610422422115,"d":"-0.011"}},"mm au diamètre",null,"Déformée radiale",{"$f":"-Empilage!K$52/Empilage!K$43*Empilage!K35*Detail_des_effets!K132*10^-1","v":{"v":-0.011267610422422115,"d":"-0.011"}},"mm au diamètre",null,"Déformée radiale",{"$f":"-Empilage!O$52/Empilage!O$43*Empilage!O35*Detail_des_effets!O132*10^-1","v":{"v":-0.011267610422422115,"d":"-0.011"}},"mm au diamètre",null,"Déformée radiale",{"$f":"-Empilage!S$52/Empilage!S$43*Empilage!S35*Detail_des_effets!S132*10^-1","v":{"v":-0.011267610422422115,"d":"-0.011"}},"mm au diamètre",null,"Déformée radiale",{"$f":"-Empilage!W$52/Empilage!W$43*Empilage!W35*Detail_des_effets!W132*10^-1","v":{"v":-0.011267610422422115,"d":"-0.011"}},"mm au diamètre",null,"Déformée radiale",{"$f":"-Empilage!AA$52/Empilage!AA$43*Empilage!AA35*Detail_des_effets!AA132*10^-1","v":{"v":-0.011267610422422115,"d":"-0.011"}},"mm au diamètre",null,"Déformée radiale",{"$f":"-Empilage!AE$52/Empilage!AE$43*Empilage!AE35*Detail_des_effets!AE132*10^-1","v":{"v":-0.011267610422422115,"d":"-0.011"}},"mm au diamètre",null,"Déformée radiale",{"$f":"-Empilage!AI$52/Empilage!AI$43*Empilage!AI35*Detail_des_effets!AI132*10^-1","v":{"v":-0.011267610422422115,"d":"-0.011"}},"mm au diamètre",null,"Déformée radiale",{"$f":"-Empilage!AM$52/Empilage!AM$43*Empilage!AM35*Detail_des_effets!AM132*10^-1","v":{"v":-0.011267610422422115,"d":"-0.011"}},"mm au diamètre"]
[null,"Dans la pièce, au diamètre particulier",{"$f":"Empilage!C$37","v":{"v":29,"d":"29.00"}},"mm",null,"Dans la pièce, au diamètre particulier",{"$f":"Empilage!G$37","v":{"v":29,"d":"29.00"}},"mm",null,"Dans la pièce, au diamètre particulier",{"$f":"Empilage!K$37","v":{"v":29,"d":"29.00"}},"mm",null,"Dans la pièce, au diamètre particulier",{"$f":"Empilage!O$37","v":{"v":29,"d":"29.00"}},"mm",null,"Dans la pièce, au diamètre particulier",{"$f":"Empilage!S$37","v":{"v":29,"d":"29.00"}},"mm",null,"Dans la pièce, au diamètre particulier",{"$f":"Empilage!W$37","v":{"v":29,"d":"29.00"}},"mm",null,"Dans la pièce, au diamètre particulier",{"$f":"Empilage!AA$37","v":{"v":29,"d":"29.00"}},"mm",null,"Dans la pièce, au diamètre particulier",{"$f":"Empilage!AE$37","v":{"v":29,"d":"29.00"}},"mm",null,"Dans la pièce, au diamètre particulier",{"$f":"Empilage!AI$37","v":{"v":29,"d":"29.00"}},"mm",null,"Dans la pièce, au diamètre particulier",{"$f":"Empilage!AM$37","v":{"v":29,"d":"29.00"}},"mm"]
[null,"Contrainte axiale",{"$f":"Empilage!$D$92*10/((PI()/4)*(Empilage!C$35^2-Empilage!C$36^2))","v":{"v":277.7977188513082,"d":"278"}},"MPa",null,"Contrainte axiale",{"$f":"Empilage!$D$92*10/((PI()/4)*(Empilage!G$35^2-Empilage!G$36^2))","v":{"v":277.7977188513082,"d":"278"}},"MPa",null,"Contrainte axiale",{"$f":"Empilage!$D$92*10/((PI()/4)*(Empilage!K$35^2-Empilage!K$36^2))","v":{"v":277.7977188513082,"d":"278"}},"MPa",null,"Contrainte axiale",{"$f":"Empilage!$D$92*10/((PI()/4)*(Empilage!O$35^2-Empilage!O$36^2))","v":{"v":277.7977188513082,"d":"278"}},"MPa",null,"Contrainte axiale",{"$f":"Empilage!$D$92*10/((PI()/4)*(Empilage!S$35^2-Empilage!S$36^2))","v":{"v":277.7977188513082,"d":"278"}},"MPa",null,"Contrainte axiale",{"$f":"Empilage!$D$92*10/((PI()/4)*(Empilage!W$35^2-Empilage!W$36^2))","v":{"v":277.7977188513082,"d":"278"}},"MPa",null,"Contrainte axiale",{"$f":"Empilage!$D$92*10/((PI()/4)*(Empilage!AA$35^2-Empilage!AA$36^2))","v":{"v":277.7977188513082,"d":"278"}},"MPa",null,"Contrainte axiale",{"$f":"Empilage!$D$92*10/((PI()/4)*(Empilage!AE$35^2-Empilage!AE$36^2))","v":{"v":277.7977188513082,"d":"278"}},"MPa",null,"Contrainte axiale",{"$f":"Empilage!$D$92*10/((PI()/4)*(Empilage!AI$35^2-Empilage!AI$36^2))","v":{"v":277.7977188513082,"d":"278"}},"MPa",null,"Contrainte axiale",{"$f":"Empilage!$D$92*10/((PI()/4)*(Empilage!AM$35^2-Empilage!AM$36^2))","v":{"v":277.7977188513082,"d":"278"}},"MPa"]
[null,"Déformée axiale",{"$f":"C$132/Empilage!C$43*Empilage!C$33*10^-1","v":{"v":0.07081047557973628,"d":"0.071"}},"mm",null,"Déformée axiale",{"$f":"G$132/Empilage!G$43*Empilage!G$33*10^-1","v":{"v":0.07081047557973628,"d":"0.071"}},"mm",null,"Déformée axiale",{"$f":"K$132/Empilage!K$43*Empilage!K$33*10^-1","v":{"v":0.07081047557973628,"d":"0.071"}},"mm",null,"Déformée axiale",{"$f":"O$132/Empilage!O$43*Empilage!O$33*10^-1","v":{"v":0.07081047557973628,"d":"0.071"}},"mm",null,"Déformée axiale",{"$f":"S$132/Empilage!S$43*Empilage!S$33*10^-1","v":{"v":0.07081047557973628,"d":"0.071"}},"mm",null,"Déformée axiale",{"$f":"W$132/Empilage!W$43*Empilage!W$33*10^-1","v":{"v":0.07081047557973628,"d":"0.071"}},"mm",null,"Déformée axiale",{"$f":"AA$132/Empilage!AA$43*Empilage!AA$33*10^-1","v":{"v":0.07081047557973628,"d":"0.071"}},"mm",null,"Déformée axiale",{"$f":"AE$132/Empilage!AE$43*Empilage!AE$33*10^-1","v":{"v":0.07081047557973628,"d":"0.071"}},"mm",null,"Déformée axiale",{"$f":"AI$132/Empilage!AI$43*Empilage!AI$33*10^-1","v":{"v":0.07081047557973628,"d":"0.071"}},"mm",null,"Déformée axiale",{"$f":"AM$132/Empilage!AM$43*Empilage!AM$33*10^-1","v":{"v":0.07081047557973628,"d":"0.071"}},"mm"]
[null,"Déformée radiale",{"$f":"-Empilage!C$52/Empilage!C$43*C135*Detail_des_effets!C136*10^-1","v":{"v":-0.01089202340834138,"d":"-0.011"}},"mm au diamètre",null,"Déformée radiale",{"$f":"-Empilage!G$52/Empilage!G$43*G135*Detail_des_effets!G136*10^-1","v":{"v":-0.01089202340834138,"d":"-0.011"}},"mm au diamètre",null,"Déformée radiale",{"$f":"-Empilage!K$52/Empilage!K$43*K135*Detail_des_effets!K136*10^-1","v":{"v":-0.01089202340834138,"d":"-0.011"}},"mm au diamètre",null,"Déformée radiale",{"$f":"-Empilage!O$52/Empilage!O$43*O135*Detail_des_effets!O136*10^-1","v":{"v":-0.01089202340834138,"d":"-0.011"}},"mm au diamètre",null,"Déformée radiale",{"$f":"-Empilage!S$52/Empilage!S$43*S135*Detail_des_effets!S136*10^-1","v":{"v":-0.01089202340834138,"d":"-0.011"}},"mm au diamètre",null,"Déformée radiale",{"$f":"-Empilage!W$52/Empilage!W$43*W135*Detail_des_effets!W136*10^-1","v":{"v":-0.01089202340834138,"d":"-0.011"}},"mm au diamètre",null,"Déformée radiale",{"$f":"-Empilage!AA$52/Empilage!AA$43*AA135*Detail_des_effets!AA136*10^-1","v":{"v":-0.01089202340834138,"d":"-0.011"}},"mm au diamètre",null,"Déformée radiale",{"$f":"-Empilage!AE$52/Empilage!AE$43*AE135*Detail_des_effets!AE136*10^-1","v":{"v":-0.01089202340834138,"d":"-0.011"}},"mm au diamètre",null,"Déformée radiale",{"$f":"-Empilage!AI$52/Empilage!AI$43*AI135*Detail_des_effets!AI136*10^-1","v":{"v":-0.01089202340834138,"d":"-0.011"}},"mm au diamètre",null,"Déformée radiale",{"$f":"-Empilage!AM$52/Empilage!AM$43*AM135*Detail_des_effets!AM136*10^-1","v":{"v":-0.01089202340834138,"d":"-0.011"}},"mm au diamètre"]
[null,"Effet de l'effort axial seul en mise en froid",{"$nulls":3},"Effet de l'effort axial seul en mise en froid",{"$nulls":3},"Effet de l'effort axial seul en mise en froid",{"$nulls":3},"Effet de l'effort axial seul en mise en froid",{"$nulls":3},"Effet de l'effort axial seul en mise en froid",{"$nulls":3},"Effet de l'effort axial seul en mise en froid",{"$nulls":3},"Effet de l'effort axial seul en mise en froid",{"$nulls":3},"Effet de l'effort axial seul en mise en froid",{"$nulls":3},"Effet de l'effort axial seul en mise en froid",{"$nulls":3},"Effet de l'effort axial seul en mise en froid"]
[]
[null,"Au niveau du frettage",{"$nulls":3},"Au niveau du frettage",{"$nulls":3},"Au niveau du frettage",{"$nulls":3},"Au niveau du frettage",{"$nulls":3},"Au niveau du frettage",{"$nulls":3},"Au niveau du frettage",{"$nulls":3},"Au niveau du frettage",{"$nulls":3},"Au niveau du frettage",{"$nulls":3},"Au niveau du frettage",{"$nulls":3},"Au niveau du frettage"]
[null,"Contrainte axiale",{"$f":"Empilage!$D$92*10/((PI()/4)*(Empilage!C$35^2-Empilage!C$36^2))","v":{"v":277.7977188513082,"d":"278"}},"MPa",null,"Contrainte axiale",{"$f":"Empilage!$D$92*10/((PI()/4)*(Empilage!G$35^2-Empilage!G$36^2))","v":{"v":277.7977188513082,"d":"278"}},"MPa",null,"Contrainte axiale",{"$f":"Empilage!$D$92*10/((PI()/4)*(Empilage!K$35^2-Empilage!K$36^2))","v":{"v":277.7977188513082,"d":"278"}},"MPa",null,"Contrainte axiale",{"$f":"Empilage!$D$92*10/((PI()/4)*(Empilage!O$35^2-Empilage!O$36^2))","v":{"v":277.7977188513082,"d":"278"}},"MPa",null,"Contrainte axiale",{"$f":"Empilage!$D$92*10/((PI()/4)*(Empilage!S$35^2-Empilage!S$36^2))","v":{"v":277.7977188513082,"d":"278"}},"MPa",null,"Contrainte axiale",{"$f":"Empilage!$D$92*10/((PI()/4)*(Empilage!W$35^2-Empilage!W$36^2))","v":{"v":277.7977188513082,"d":"278"}},"MPa",null,"Contrainte axiale",{"$f":"Empilage!$D$92*10/((PI()/4)*(Empilage!AA$35^2-Empilage!AA$36^2))","v":{"v":277.7977188513082,"d":"278"}},"MPa",null,"Contrainte axiale",{"$f":"Empilage!$D$92*10/((PI()/4)*(Empilage!AE$35^2-Empilage!AE$36^2))","v":{"v":277.7977188513082,"d":"278"}},"MPa",null,"Contrainte axiale",{"$f":"Empilage!$D$92*10/((PI()/4)*(Empilage!AI$35^2-Empilage!AI$36^2))","v":{"v":277.7977188513082,"d":"278"}},"MPa",null,"Contrainte axiale",{"$f":"Empilage!$D$92*10/((PI()/4)*(Empilage!AM$35^2-Empilage!AM$36^2))","v":{"v":277.7977188513082,"d":"278"}},"MPa"]
[null,"Déformée axiale",{"$f":"C$142/Empilage!C$44*Empilage!C$33*10^-1","v":{"v":0.06643646661582839,"d":"0.066"}},"mm",null,"Déformée axiale",{"$f":"G$142/Empilage!G$44*Empilage!G$33*10^-1","v":{"v":0.06643646661582839,"d":"0.066"}},"mm",null,"Déformée axiale",{"$f":"K$142/Empilage!K$44*Empilage!K$33*10^-1","v":{"v":0.06643646661582839,"d":"0.066"}},"mm",null,"Déformée axiale",{"$f":"O$142/Empilage!O$44*Empilage!O$33*10^-1","v":{"v":0.06643646661582839,"d":"0.066"}},"mm",null,"Déformée axiale",{"$f":"S$142/Empilage!S$44*Empilage!S$33*10^-1","v":{"v":0.06643646661582839,"d":"0.066"}},"mm",null,"Déformée axiale",{"$f":"W$142/Empilage!W$44*Empilage!W$33*10^-1","v":{"v":0.06643646661582839,"d":"0.066"}},"mm",null,"Déformée axiale",{"$f":"AA$142/Empilage!AA$44*Empilage!AA$33*10^-1","v":{"v":0.06643646661582839,"d":"0.066"}},"mm",null,"Déformée axiale",{"$f":"AE$142/Empilage!AE$44*Empilage!AE$33*10^-1","v":{"v":0.06643646661582839,"d":"0.066"}},"mm",null,"Déformée axiale",{"$f":"AI$142/Empilage!AI$44*Empilage!AI$33*10^-1","v":{"v":0.06643646661582839,"d":"0.066"}},"mm",null,"Déformée axiale",{"$f":"AM$142/Empilage!AM$44*Empilage!AM$33*10^-1","v":{"v":0.06643646661582839,"d":"0.066"}},"mm"]
[null,"Déformée radiale",{"$f":"-Empilage!C$52/Empilage!C$44*Empilage!C35*Detail_des_effets!C142*10^-1","v":{"v":-0.010571602824873936,"d":"-0.011"}},"mm au diamètre",null,"Déformée radiale",{"$f":"-Empilage!G$52/Empilage!G$44*Empilage!G35*Detail_des_effets!G142*10^-1","v":{"v":-0.010571602824873936,"d":"-0.011"}},"mm au diamètre",null,"Déformée radiale",{"$f":"-Empilage!K$52/Empilage!K$44*Empilage!K35*Detail_des_effets!K142*10^-1","v":{"v":-0.010571602824873936,"d":"-0.011"}},"mm au diamètre",null,"Déformée radiale",{"$f":"-Empilage!O$52/Empilage!O$44*Empilage!O35*Detail_des_effets!O142*10^-1","v":{"v":-0.010571602824873936,"d":"-0.011"}},"mm au diamètre",null,"Déformée radiale",{"$f":"-Empilage!S$52/Empilage!S$44*Empilage!S35*Detail_des_effets!S142*10^-1","v":{"v":-0.010571602824873936,"d":"-0.011"}},"mm au diamètre",null,"Déformée radiale",{"$f":"-Empilage!W$52/Empilage!W$44*Empilage!W35*Detail_des_effets!W142*10^-1","v":{"v":-0.010571602824873936,"d":"-0.011"}},"mm au diamètre",null,"Déformée radiale",{"$f":"-Empilage!AA$52/Empilage!AA$44*Empilage!AA35*Detail_des_effets!AA142*10^-1","v":{"v":-0.010571602824873936,"d":"-0.011"}},"mm au diamètre",null,"Déformée radiale",{"$f":"-Empilage!AE$52/Empilage!AE$44*Empilage!AE35*Detail_des_effets!AE142*10^-1","v":{"v":-0.010571602824873936,"d":"-0.011"}},"mm au diamètre",null,"Déformée radiale",{"$f":"-Empilage!AI$52/Empilage!AI$44*Empilage!AI35*Detail_des_effets!AI142*10^-1","v":{"v":-0.010571602824873936,"d":"-0.011"}},"mm au diamètre",null,"Déformée radiale",{"$f":"-Empilage!AM$52/Empilage!AM$44*Empilage!AM35*Detail_des_effets!AM142*10^-1","v":{"v":-0.010571602824873936,"d":"-0.011"}},"mm au diamètre"]
[null,"Dans la pièce, au diamètre particulier",{"$f":"Empilage!C$37","v":{"v":29,"d":"29.00"}},"mm",null,"Dans la pièce, au diamètre particulier",{"$f":"Empilage!G$37","v":{"v":29,"d":"29.00"}},"mm",null,"Dans la pièce, au diamètre particulier",{"$f":"Empilage!K$37","v":{"v":29,"d":"29.00"}},"mm",null,"Dans la pièce, au diamètre particulier",{"$f":"Empilage!O$37","v":{"v":29,"d":"29.00"}},"mm",null,"Dans la pièce, au diamètre particulier",{"$f":"Empilage!S$37","v":{"v":29,"d":"29.00"}},"mm",null,"Dans la pièce, au diamètre particulier",{"$f":"Empilage!W$37","v":{"v":29,"d":"29.00"}},"mm",null,"Dans la pièce, au diamètre particulier",{"$f":"Empilage!AA$37","v":{"v":29,"d":"29.00"}},"mm",null,"Dans la pièce, au diamètre particulier",{"$f":"Empilage!AE$37","v":{"v":29,"d":"29.00"}},"mm",null,"Dans la pièce, au diamètre particulier",{"$f":"Empilage!AI$37","v":{"v":29,"d":"29.00"}},"mm",null,"Dans la pièce, au diamètre particulier",{"$f":"Empilage!AM$37","v":{"v":29,"d":"29.00"}},"mm"]
[null,"Contrainte axiale",{"$f":"Empilage!$D$92*10/((PI()/4)*(Empilage!C$35^2-Empilage!C$36^2))","v":{"v":277.7977188513082,"d":"278"}},"MPa",null,"Contrainte axiale",{"$f":"Empilage!$D$92*10/((PI()/4)*(Empilage!G$35^2-Empilage!G$36^2))","v":{"v":277.7977188513082,"d":"278"}},"MPa",null,"Contrainte axiale",{"$f":"Empilage!$D$92*10/((PI()/4)*(Empilage!K$35^2-Empilage!K$36^2))","v":{"v":277.7977188513082,"d":"278"}},"MPa",null,"Contrainte axiale",{"$f":"Empilage!$D$92*10/((PI()/4)*(Empilage!O$35^2-Empilage!O$36^2))","v":{"v":277.7977188513082,"d":"278"}},"MPa",null,"Contrainte axiale",{"$f":"Empilage!$D$92*10/((PI()/4)*(Empilage!S$35^2-Empilage!S$36^2))","v":{"v":277.7977188513082,"d":"278"}},"MPa",null,"Contrainte axiale",{"$f":"Empilage!$D$92*10/((PI()/4)*(Empilage!W$35^2-Empilage!W$36^2))","v":{"v":277.7977188513082,"d":"278"}},"MPa",null,"Contrainte axiale",{"$f":"Empilage!$D$92*10/((PI()/4)*(Empilage!AA$35^2-Empilage!AA$36^2))","v":{"v":277.7977188513082,"d":"278"}},"MPa",null,"Contrainte axiale",{"$f":"Empilage!$D$92*10/((PI()/4)*(Empilage!AE$35^2-Empilage!AE$36^2))","v":{"v":277.7977188513082,"d":"278"}},"MPa",null,"Contrainte axiale",{"$f":"Empilage!$D$92*10/((PI()/4)*(Empilage!AI$35^2-Empilage!AI$36^2))","v":{"v":277.7977188513082,"d":"278"}},"MPa",null,"Contrainte axiale",{"$f":"Empilage!$D$92*10/((PI()/4)*(Empilage!AM$35^2-Empilage!AM$36^2))","v":{"v":277.7977188513082,"d":"278"}},"MPa"]
[null,"Déformée axiale",{"$f":"C$146/Empilage!C$44*Empilage!C$33*10^-1","v":{"v":0.06643646661582839,"d":"0.066"}},"mm",null,"Déformée axiale",{"$f":"G$146/Empilage!G$44*Empilage!G$33*10^-1","v":{"v":0.06643646661582839,"d":"0.066"}},"mm",null,"Déformée axiale",{"$f":"K$146/Empilage!K$44*Empilage!K$33*10^-1","v":{"v":0.06643646661582839,"d":"0.066"}},"mm",null,"Déformée axiale",{"$f":"O$146/Empilage!O$44*Empilage!O$33*10^-1","v":{"v":0.06643646661582839,"d":"0.066"}},"mm",null,"Déformée axiale",{"$f":"S$146/Empilage!S$44*Empilage!S$33*10^-1","v":{"v":0.06643646661582839,"d":"0.066"}},"mm",null,"Déformée axiale",{"$f":"W$146/Empilage!W$44*Empilage!W$33*10^-1","v":{"v":0.06643646661582839,"d":"0.066"}},"mm",null,"Déformée axiale",{"$f":"AA$146/Empilage!AA$44*Empilage!AA$33*10^-1","v":{"v":0.06643646661582839,"d":"0.066"}},"mm",null,"Déformée axiale",{"$f":"AE$146/Empilage!AE$44*Empilage!AE$33*10^-1","v":{"v":0.06643646661582839,"d":"0.066"}},"mm",null,"Déformée axiale",{"$f":"AI$146/Empilage!AI$44*Empilage!AI$33*10^-1","v":{"v":0.06643646661582839,"d":"0.066"}},"mm",null,"Déformée axiale",{"$f":"AM$146/Empilage!AM$44*Empilage!AM$33*10^-1","v":{"v":0.06643646661582839,"d":"0.066"}},"mm"]
[null,"Déformée radiale",{"$f":"-Empilage!C$52/Empilage!C$44*C145*Detail_des_effets!C146*10^-1","v":{"v":-0.010219216064044804,"d":"-0.010"}},"mm au diamètre",null,"Déformée radiale",{"$f":"-Empilage!G$52/Empilage!G$44*G145*Detail_des_effets!G146*10^-1","v":{"v":-0.010219216064044804,"d":"-0.010"}},"mm au diamètre",null,"Déformée radiale",{"$f":"-Empilage!K$52/Empilage!K$44*K145*Detail_des_effets!K146*10^-1","v":{"v":-0.010219216064044804,"d":"-0.010"}},"mm au diamètre",null,"Déformée radiale",{"$f":"-Empilage!O$52/Empilage!O$44*O145*Detail_des_effets!O146*10^-1","v":{"v":-0.010219216064044804,"d":"-0.010"}},"mm au diamètre",null,"Déformée radiale",{"$f":"-Empilage!S$52/Empilage!S$44*S145*Detail_des_effets!S146*10^-1","v":{"v":-0.010219216064044804,"d":"-0.010"}},"mm au diamètre",null,"Déformée radiale",{"$f":"-Empilage!W$52/Empilage!W$44*W145*Detail_des_effets!W146*10^-1","v":{"v":-0.010219216064044804,"d":"-0.010"}},"mm au diamètre",null,"Déformée radiale",{"$f":"-Empilage!AA$52/Empilage!AA$44*AA145*Detail_des_effets!AA146*10^-1","v":{"v":-0.010219216064044804,"d":"-0.010"}},"mm au diamètre",null,"Déformée radiale",{"$f":"-Empilage!AE$52/Empilage!AE$44*AE145*Detail_des_effets!AE146*10^-1","v":{"v":-0.010219216064044804,"d":"-0.010"}},"mm au diamètre",null,"Déformée radiale",{"$f":"-Empilage!AI$52/Empilage!AI$44*AI145*Detail_des_effets!AI146*10^-1","v":{"v":-0.010219216064044804,"d":"-0.010"}},"mm au diamètre",null,"Déformée radiale",{"$f":"-Empilage!AM$52/Empilage!AM$44*AM145*Detail_des_effets!AM146*10^-1","v":{"v":-0.010219216064044804,"d":"-0.010"}},"mm au diamètre"]
[null,"Effet de l'effort axial seul en fonctionnement",{"$nulls":3},"Effet de l'effort axial seul en fonctionnement",{"$nulls":3},"Effet de l'effort axial seul en fonctionnement",{"$nulls":3},"Effet de l'effort axial seul en fonctionnement",{"$nulls":3},"Effet de l'effort axial seul en fonctionnement",{"$nulls":3},"Effet de l'effort axial seul en fonctionnement",{"$nulls":3},"Effet de l'effort axial seul en fonctionnement",{"$nulls":3},"Effet de l'effort axial seul en fonctionnement",{"$nulls":3},"Effet de l'effort axial seul en fonctionnement",{"$nulls":3},"Effet de l'effort axial seul en fonctionnement"]
[]
[null,"Au niveau du frettage",{"$nulls":3},"Au niveau du frettage",{"$nulls":3},"Au niveau du frettage",{"$nulls":3},"Au niveau du frettage",{"$nulls":3},"Au niveau du frettage",{"$nulls":3},"Au niveau du frettage",{"$nulls":3},"Au niveau du frettage",{"$nulls":3},"Au niveau du frettage",{"$nulls":3},"Au niveau du frettage",{"$nulls":3},"Au niveau du frettage"]
[null,"Contrainte axiale",{"$f":"Empilage!$D$92*10/((PI()/4)*(Empilage!C$35^2-Empilage!C$36^2))","v":{"v":277.7977188513082,"d":"278"}},"MPa",null,"Contrainte axiale",{"$f":"Empilage!$D$92*10/((PI()/4)*(Empilage!G$35^2-Empilage!G$36^2))","v":{"v":277.7977188513082,"d":"278"}},"MPa",null,"Contrainte axiale",{"$f":"Empilage!$D$92*10/((PI()/4)*(Empilage!K$35^2-Empilage!K$36^2))","v":{"v":277.7977188513082,"d":"278"}},"MPa",null,"Contrainte axiale",{"$f":"Empilage!$D$92*10/((PI()/4)*(Empilage!O$35^2-Empilage!O$36^2))","v":{"v":277.7977188513082,"d":"278"}},"MPa",null,"Contrainte axiale",{"$f":"Empilage!$D$92*10/((PI()/4)*(Empilage!S$35^2-Empilage!S$36^2))","v":{"v":277.7977188513082,"d":"278"}},"MPa",null,"Contrainte axiale",{"$f":"Empilage!$D$92*10/((PI()/4)*(Empilage!W$35^2-Empilage!W$36^2))","v":{"v":277.7977188513082,"d":"278"}},"MPa",null,"Contrainte axiale",{"$f":"Empilage!$D$92*10/((PI()/4)*(Empilage!AA$35^2-Empilage!AA$36^2))","v":{"v":277.7977188513082,"d":"278"}},"MPa",null,"Contrainte axiale",{"$f":"Empilage!$D$92*10/((PI()/4)*(Empilage!AE$35^2-Empilage!AE$36^2))","v":{"v":277.7977188513082,"d":"278"}},"MPa",null,"Contrainte axiale",{"$f":"Empilage!$D$92*10/((PI()/4)*(Empilage!AI$35^2-Empilage!AI$36^2))","v":{"v":277.7977188513082,"d":"278"}},"MPa",null,"Contrainte axiale",{"$f":"Empilage!$D$92*10/((PI()/4)*(Empilage!AM$35^2-Empilage!AM$36^2))","v":{"v":277.7977188513082,"d":"278"}},"MPa"]
[null,"Déformée axiale",{"$f":"C$152/Empilage!C$45*Empilage!C$33*10^-1","v":{"v":0.06741731574580226,"d":"0.067"}},"mm",null,"Déformée axiale",{"$f":"G$152/Empilage!G$45*Empilage!G$33*10^-1","v":{"v":0.06741731574580226,"d":"0.067"}},"mm",null,"Déformée axiale",{"$f":"K$152/Empilage!K$45*Empilage!K$33*10^-1","v":{"v":0.06741731574580226,"d":"0.067"}},"mm",null,"Déformée axiale",{"$f":"O$152/Empilage!O$45*Empilage!O$33*10^-1","v":{"v":0.06741731574580226,"d":"0.067"}},"mm",null,"Déformée axiale",{"$f":"S$152/Empilage!S$45*Empilage!S$33*10^-1","v":{"v":0.06741731574580226,"d":"0.067"}},"mm",null,"Déformée axiale",{"$f":"W$152/Empilage!W$45*Empilage!W$33*10^-1","v":{"v":0.06741731574580226,"d":"0.067"}},"mm",null,"Déformée axiale",{"$f":"AA$152/Empilage!AA$45*Empilage!AA$33*10^-1","v":{"v":0.06741731574580226,"d":"0.067"}},"mm",null,"Déformée axiale",{"$f":"AE$152/Empilage!AE$45*Empilage!AE$33*10^-1","v":{"v":0.06741731574580226,"d":"0.067"}},"mm",null,"Déformée axiale",{"$f":"AI$152/Empilage!AI$45*Empilage!AI$33*10^-1","v":{"v":0.06741731574580226,"d":"0.067"}},"mm",null,"Déformée axiale",{"$f":"AM$152/Empilage!AM$45*Empilage!AM$33*10^-1","v":{"v":0.06741731574580226,"d":"0.067"}},"mm"]
[null,"Déformée radiale",{"$f":"-Empilage!C$52/Empilage!C$45*Empilage!C35*Detail_des_effets!C152*10^-1","v":{"v":-0.01072767896741124,"d":"-0.011"}},"mm au diamètre",null,"Déformée radiale",{"$f":"-Empilage!G$52/Empilage!G$45*Empilage!G35*Detail_des_effets!G152*10^-1","v":{"v":-0.01072767896741124,"d":"-0.011"}},"mm au diamètre",null,"Déformée radiale",{"$f":"-Empilage!K$52/Empilage!K$45*Empilage!K35*Detail_des_effets!K152*10^-1","v":{"v":-0.01072767896741124,"d":"-0.011"}},"mm au diamètre",null,"Déformée radiale",{"$f":"-Empilage!O$52/Empilage!O$45*Empilage!O35*Detail_des_effets!O152*10^-1","v":{"v":-0.01072767896741124,"d":"-0.011"}},"mm au diamètre",null,"Déformée radiale",{"$f":"-Empilage!S$52/Empilage!S$45*Empilage!S35*Detail_des_effets!S152*10^-1","v":{"v":-0.01072767896741124,"d":"-0.011"}},"mm au diamètre",null,"Déformée radiale",{"$f":"-Empilage!W$52/Empilage!W$45*Empilage!W35*Detail_des_effets!W152*10^-1","v":{"v":-0.01072767896741124,"d":"-0.011"}},"mm au diamètre",null,"Déformée radiale",{"$f":"-Empilage!AA$52/Empilage!AA$45*Empilage!AA35*Detail_des_effets!AA152*10^-1","v":{"v":-0.01072767896741124,"d":"-0.011"}},"mm au diamètre",null,"Déformée radiale",{"$f":"-Empilage!AE$52/Empilage!AE$45*Empilage!AE35*Detail_des_effets!AE152*10^-1","v":{"v":-0.01072767896741124,"d":"-0.011"}},"mm au diamètre",null,"Déformée radiale",{"$f":"-Empilage!AI$52/Empilage!AI$45*Empilage!AI35*Detail_des_effets!AI152*10^-1","v":{"v":-0.01072767896741124,"d":"-0.011"}},"mm au diamètre",null,"Déformée radiale",{"$f":"-Empilage!AM$52/Empilage!AM$45*Empilage!AM35*Detail_des_effets!AM152*10^-1","v":{"v":-0.01072767896741124,"d":"-0.011"}},"mm au diamètre"]
[null,"Dans la pièce, au diamètre particulier",{"$f":"Empilage!C$37","v":{"v":29,"d":"29.00"}},"mm",null,"Dans la pièce, au diamètre particulier",{"$f":"Empilage!G$37","v":{"v":29,"d":"29.00"}},"mm",null,"Dans la pièce, au diamètre particulier",{"$f":"Empilage!K$37","v":{"v":29,"d":"29.00"}},"mm",null,"Dans la pièce, au diamètre particulier",{"$f":"Empilage!O$37","v":{"v":29,"d":"29.00"}},"mm",null,"Dans la pièce, au diamètre particulier",{"$f":"Empilage!S$37","v":{"v":29,"d":"29.00"}},"mm",null,"Dans la pièce, au diamètre particulier",{"$f":"Empilage!W$37","v":{"v":29,"d":"29.00"}},"mm",null,"Dans la pièce, au diamètre particulier",{"$f":"Empilage!AA$37","v":{"v":29,"d":"29.00"}},"mm",null,"Dans la pièce, au diamètre particulier",{"$f":"Empilage!AE$37","v":{"v":29,"d":"29.00"}},"mm",null,"Dans la pièce, au diamètre particulier",{"$f":"Empilage!AI$37","v":{"v":29,"d":"29.00"}},"mm",null,"Dans la pièce, au diamètre particulier",{"$f":"Empilage!AM$37","v":{"v":29,"d":"29.00"}},"mm"]
[null,"Contrainte axiale",{"$f":"Empilage!$D$92*10/((PI()/4)*(Empilage!C$35^2-Empilage!C$36^2))","v":{"v":277.7977188513082,"d":"278"}},"MPa",null,"Contrainte axiale",{"$f":"Empilage!$D$92*10/((PI()/4)*(Empilage!G$35^2-Empilage!G$36^2))","v":{"v":277.7977188513082,"d":"278"}},"MPa",null,"Contrainte axiale",{"$f":"Empilage!$D$92*10/((PI()/4)*(Empilage!K$35^2-Empilage!K$36^2))","v":{"v":277.7977188513082,"d":"278"}},"MPa",null,"Contrainte axiale",{"$f":"Empilage!$D$92*10/((PI()/4)*(Empilage!O$35^2-Empilage!O$36^2))","v":{"v":277.7977188513082,"d":"278"}},"MPa",null,"Contrainte axiale",{"$f":"Empilage!$D$92*10/((PI()/4)*(Empilage!S$35^2-Empilage!S$36^2))","v":{"v":277.7977188513082,"d":"278"}},"MPa",null,"Contrainte axiale",{"$f":"Empilage!$D$92*10/((PI()/4)*(Empilage!W$35^2-Empilage!W$36^2))","v":{"v":277.7977188513082,"d":"278"}},"MPa",null,"Contrainte axiale",{"$f":"Empilage!$D$92*10/((PI()/4)*(Empilage!AA$35^2-Empilage!AA$36^2))","v":{"v":277.7977188513082,"d":"278"}},"MPa",null,"Contrainte axiale",{"$f":"Empilage!$D$92*10/((PI()/4)*(Empilage!AE$35^2-Empilage!AE$36^2))","v":{"v":277.7977188513082,"d":"278"}},"MPa",null,"Contrainte axiale",{"$f":"Empilage!$D$92*10/((PI()/4)*(Empilage!AI$35^2-Empilage!AI$36^2))","v":{"v":277.7977188513082,"d":"278"}},"MPa",null,"Contrainte axiale",{"$f":"Empilage!$D$92*10/((PI()/4)*(Empilage!AM$35^2-Empilage!AM$36^2))","v":{"v":277.7977188513082,"d":"278"}},"MPa"]
[null,"Déformée axiale",{"$f":"C$156/Empilage!C$45*Empilage!C$33*10^-1","v":{"v":0.06741731574580226,"d":"0.067"}},"mm",null,"Déformée axiale",{"$f":"G$156/Empilage!G$45*Empilage!G$33*10^-1","v":{"v":0.06741731574580226,"d":"0.067"}},"mm",null,"Déformée axiale",{"$f":"K$156/Empilage!K$45*Empilage!K$33*10^-1","v":{"v":0.06741731574580226,"d":"0.067"}},"mm",null,"Déformée axiale",{"$f":"O$156/Empilage!O$45*Empilage!O$33*10^-1","v":{"v":0.06741731574580226,"d":"0.067"}},"mm",null,"Déformée axiale",{"$f":"S$156/Empilage!S$45*Empilage!S$33*10^-1","v":{"v":0.06741731574580226,"d":"0.067"}},"mm",null,"Déformée axiale",{"$f":"W$156/Empilage!W$45*Empilage!W$33*10^-1","v":{"v":0.06741731574580226,"d":"0.067"}},"mm",null,"Déformée axiale",{"$f":"AA$156/Empilage!AA$45*Empilage!AA$33*10^-1","v":{"v":0.06741731574580226,"d":"0.067"}},"mm",null,"Déformée axiale",{"$f":"AE$156/Empilage!AE$45*Empilage!AE$33*10^-1","v":{"v":0.06741731574580226,"d":"0.067"}},"mm",null,"Déformée axiale",{"$f":"AI$156/Empilage!AI$45*Empilage!AI$33*10^-1","v":{"v":0.06741731574580226,"d":"0.067"}},"mm",null,"Déformée axiale",{"$f":"AM$156/Empilage!AM$45*Empilage!AM$33*10^-1","v":{"v":0.06741731574580226,"d":"0.067"}},"mm"]
[null,"Déformée radiale",{"$f":"-Empilage!C$52/Empilage!C$45*C155*Detail_des_effets!C156*10^-1","v":{"v":-0.010370089668497532,"d":"-0.010"}},"mm au diamètre",null,"Déformée radiale",{"$f":"-Empilage!G$52/Empilage!G$45*G155*Detail_des_effets!G156*10^-1","v":{"v":-0.010370089668497532,"d":"-0.010"}},"mm au diamètre",null,"Déformée radiale",{"$f":"-Empilage!K$52/Empilage!K$45*K155*Detail_des_effets!K156*10^-1","v":{"v":-0.010370089668497532,"d":"-0.010"}},"mm au diamètre",null,"Déformée radiale",{"$f":"-Empilage!O$52/Empilage!O$45*O155*Detail_des_effets!O156*10^-1","v":{"v":-0.010370089668497532,"d":"-0.010"}},"mm au diamètre",null,"Déformée radiale",{"$f":"-Empilage!S$52/Empilage!S$45*S155*Detail_des_effets!S156*10^-1","v":{"v":-0.010370089668497532,"d":"-0.010"}},"mm au diamètre",null,"Déformée radiale",{"$f":"-Empilage!W$52/Empilage!W$45*W155*Detail_des_effets!W156*10^-1","v":{"v":-0.010370089668497532,"d":"-0.010"}},"mm au diamètre",null,"Déformée radiale",{"$f":"-Empilage!AA$52/Empilage!AA$45*AA155*Detail_des_effets!AA156*10^-1","v":{"v":-0.010370089668497532,"d":"-0.010"}},"mm au diamètre",null,"Déformée radiale",{"$f":"-Empilage!AE$52/Empilage!AE$45*AE155*Detail_des_effets!AE156*10^-1","v":{"v":-0.010370089668497532,"d":"-0.010"}},"mm au diamètre",null,"Déformée radiale",{"$f":"-Empilage!AI$52/Empilage!AI$45*AI155*Detail_des_effets!AI156*10^-1","v":{"v":-0.010370089668497532,"d":"-0.010"}},"mm au diamètre",null,"Déformée radiale",{"$f":"-Empilage!AM$52/Empilage!AM$45*AM155*Detail_des_effets!AM156*10^-1","v":{"v":-0.010370089668497532,"d":"-0.010"}},"mm au diamètre"]
[null,"Effet du frettage seul en montage",{"$nulls":3},"Effet du frettage seul en montage",{"$nulls":3},"Effet du frettage seul en montage",{"$nulls":3},"Effet du frettage seul en montage",{"$nulls":3},"Effet du frettage seul en montage",{"$nulls":3},"Effet du frettage seul en montage",{"$nulls":3},"Effet du frettage seul en montage",{"$nulls":3},"Effet du frettage seul en montage",{"$nulls":3},"Effet du frettage seul en montage",{"$nulls":3},"Effet du frettage seul en montage"]
[]
[null,"Pression de contact",{"$f":"C57","v":"Empilage!/Empilage!/(Constantes_de_frettage!-Constantes_de_frettage!) * 0.001"},"MPa",null,"Pression de contact",{"$f":"G57","v":"Empilage!/Empilage!/(Constantes_de_frettage!-Constantes_de_frettage!) * 0.001"},"MPa",null,"Pression de contact",{"$f":"K57","v":"Empilage!/Empilage!/(Constantes_de_frettage!-Constantes_de_frettage!) * 0.001"},"MPa",null,"Pression de contact",{"$f":"O57","v":"Empilage!/Empilage!/(Constantes_de_frettage!-Constantes_de_frettage!) * 0.001"},"MPa",null,"Pression de contact",{"$f":"S57","v":"Empilage!/Empilage!/(Constantes_de_frettage!-Constantes_de_frettage!) * 0.001"},"MPa",null,"Pression de contact",{"$f":"W57","v":"Empilage!/Empilage!/(Constantes_de_frettage!-Constantes_de_frettage!) * 0.001"},"MPa",null,"Pression de contact",{"$f":"AA57","v":"Empilage!/Empilage!/(Constantes_de_frettage!-Constantes_de_frettage!) * 0.001"},"MPa",null,"Pression de contact",{"$f":"AE57","v":"Empilage!/Empilage!/(Constantes_de_frettage!-Constantes_de_frettage!) * 0.001"},"MPa",null,"Pression de contact",{"$f":"AI57","v":"Empilage!/Empilage!/(Constantes_de_frettage!-Constantes_de_frettage!) * 0.001"},"MPa",null,"Pression de contact",{"$f":"AM57","v":"Empilage!/Empilage!/(Constantes_de_frettage!-Constantes_de_frettage!) * 0.001"},"MPa"]
[null,"Au niveau du frettage",{"$nulls":3},"Au niveau du frettage",{"$nulls":3},"Au niveau du frettage",{"$nulls":3},"Au niveau du frettage",{"$nulls":3},"Au niveau du frettage",{"$nulls":3},"Au niveau du frettage",{"$nulls":3},"Au niveau du frettage",{"$nulls":3},"Au niveau du frettage",{"$nulls":3},"Au niveau du frettage",{"$nulls":3},"Au niveau du frettage"]
[null,"Contrainte radiale",{"$f":"-C161","v":{"$error":"#VALUE!"}},"MPa",null,"Contrainte radiale",{"$f":"-G161","v":{"$error":"#VALUE!"}},"MPa",null,"Contrainte radiale",{"$f":"-K161","v":{"$error":"#VALUE!"}},"MPa",null,"Contrainte radiale",{"$f":"-O161","v":{"$error":"#VALUE!"}},"MPa",null,"Contrainte radiale",{"$f":"-S161","v":{"$error":"#VALUE!"}},"MPa",null,"Contrainte radiale",{"$f":"-W161","v":{"$error":"#VALUE!"}},"MPa",null,"Contrainte radiale",{"$f":"-AA161","v":{"$error":"#VALUE!"}},"MPa",null,"Contrainte radiale",{"$f":"-AE161","v":{"$error":"#VALUE!"}},"MPa",null,"Contrainte radiale",{"$f":"-AI161","v":{"$error":"#VALUE!"}},"MPa",null,"Contrainte radiale",{"$f":"-AM161","v":{"$error":"#VALUE!"}},"MPa"]
[null,"Contrainte tangentielle",{"$f":"C161*(Empilage!C35^2+Empilage!C36^2)/(Empilage!C35^2-Empilage!C36^2)","v":{"$error":"#VALUE!"}},"MPa",null,"Contrainte tangentielle",{"$f":"G161*(Empilage!G35^2+Empilage!G36^2)/(Empilage!G35^2-Empilage!G36^2)","v":{"$error":"#VALUE!"}},"MPa",null,"Contrainte tangentielle",{"$f":"K161*(Empilage!K35^2+Empilage!K36^2)/(Empilage!K35^2-Empilage!K36^2)","v":{"$error":"#VALUE!"}},"MPa",null,"Contrainte tangentielle",{"$f":"O161*(Empilage!O35^2+Empilage!O36^2)/(Empilage!O35^2-Empilage!O36^2)","v":{"$error":"#VALUE!"}},"MPa",null,"Contrainte tangentielle",{"$f":"S161*(Empilage!S35^2+Empilage!S36^2)/(Empilage!S35^2-Empilage!S36^2)","v":{"$error":"#VALUE!"}},"MPa",null,"Contrainte tangentielle",{"$f":"W161*(Empilage!W35^2+Empilage!W36^2)/(Empilage!W35^2-Empilage!W36^2)","v":{"$error":"#VALUE!"}},"MPa",null,"Contrainte tangentielle",{"$f":"AA161*(Empilage!AA35^2+Empilage!AA36^2)/(Empilage!AA35^2-Empilage!AA36^2)","v":{"$error":"#VALUE!"}},"MPa",null,"Contrainte tangentielle",{"$f":"AE161*(Empilage!AE35^2+Empilage!AE36^2)/(Empilage!AE35^2-Empilage!AE36^2)","v":{"$error":"#VALUE!"}},"MPa",null,"Contrainte tangentielle",{"$f":"AI161*(Empilage!AI35^2+Empilage!AI36^2)/(Empilage!AI35^2-Empilage!AI36^2)","v":{"$error":"#VALUE!"}},"MPa",null,"Contrainte tangentielle",{"$f":"AM161*(Empilage!AM35^2+Empilage!AM36^2)/(Empilage!AM35^2-Empilage!AM36^2)","v":{"$error":"#VALUE!"}},"MPa"]
[null,"Déformée radiale",{"$f":"C166*((C164-Empilage!C$52*Detail_des_effets!C163)/Empilage!C43)*10^-1","v":{"$error":"#VALUE!"}},"mm au diamètre",null,"Déformée radiale",{"$f":"G166*((G164-Empilage!G$52*Detail_des_effets!G163)/Empilage!G43)*10^-1","v":{"$error":"#VALUE!"}},"mm au diamètre",null,"Déformée radiale",{"$f":"K166*((K164-Empilage!K$52*Detail_des_effets!K163)/Empilage!K43)*10^-1","v":{"$error":"#VALUE!"}},"mm au diamètre",null,"Déformée radiale",{"$f":"O166*((O164-Empilage!O$52*Detail_des_effets!O163)/Empilage!O43)*10^-1","v":{"$error":"#VALUE!"}},"mm au diamètre",null,"Déformée radiale",{"$f":"S166*((S164-Empilage!S$52*Detail_des_effets!S163)/Empilage!S43)*10^-1","v":{"$error":"#VALUE!"}},"mm au diamètre",null,"Déformée radiale",{"$f":"W166*((W164-Empilage!W$52*Detail_des_effets!W163)/Empilage!W43)*10^-1","v":{"$error":"#VALUE!"}},"mm au diamètre",null,"Déformée radiale",{"$f":"AA166*((AA164-Empilage!AA$52*Detail_des_effets!AA163)/Empilage!AA43)*10^-1","v":{"$error":"#VALUE!"}},"mm au diamètre",null,"Déformée radiale",{"$f":"AE166*((AE164-Empilage!AE$52*Detail_des_effets!AE163)/Empilage!AE43)*10^-1","v":{"$error":"#VALUE!"}},"mm au diamètre",null,"Déformée radiale",{"$f":"AI166*((AI164-Empilage!AI$52*Detail_des_effets!AI163)/Empilage!AI43)*10^-1","v":{"$error":"#VALUE!"}},"mm au diamètre",null,"Déformée radiale",{"$f":"AM166*((AM164-Empilage!AM$52*Detail_des_effets!AM163)/Empilage!AM43)*10^-1","v":{"$error":"#VALUE!"}},"mm au diamètre"]
[null,"Dans la pièce, au diamètre particulier",{"$f":"Empilage!C$37","v":{"v":29,"d":"29.00"}},"mm",null,"Dans la pièce, au diamètre particulier",{"$f":"Empilage!G$37","v":{"v":29,"d":"29.00"}},"mm",null,"Dans la pièce, au diamètre particulier",{"$f":"Empilage!K$37","v":{"v":29,"d":"29.00"}},"mm",null,"Dans la pièce, au diamètre particulier",{"$f":"Empilage!O$37","v":{"v":29,"d":"29.00"}},"mm",null,"Dans la pièce, au diamètre particulier",{"$f":"Empilage!S$37","v":{"v":29,"d":"29.00"}},"mm",null,"Dans la pièce, au diamètre particulier",{"$f":"Empilage!W$37","v":{"v":29,"d":"29.00"}},"mm",null,"Dans la pièce, au diamètre particulier",{"$f":"Empilage!AA$37","v":{"v":29,"d":"29.00"}},"mm",null,"Dans la pièce, au diamètre particulier",{"$f":"Empilage!AE$37","v":{"v":29,"d":"29.00"}},"mm",null,"Dans la pièce, au diamètre particulier",{"$f":"Empilage!AI$37","v":{"v":29,"d":"29.00"}},"mm",null,"Dans la pièce, au diamètre particulier",{"$f":"Empilage!AM$37","v":{"v":29,"d":"29.00"}},"mm"]
[null,"Contrainte radiale",{"$f":"C161*Empilage!C36^2/(Empilage!C40^2-Empilage!C36^2)*(1-Empilage!C40^2/Detail_des_effets!C166^2)","v":{"$error":"#VALUE!"}},"MPa",null,"Contrainte radiale",{"$f":"G161*Empilage!G36^2/(Empilage!G40^2-Empilage!G36^2)*(1-Empilage!G40^2/Detail_des_effets!G166^2)","v":{"$error":"#VALUE!"}},"MPa",null,"Contrainte radiale",{"$f":"K161*Empilage!K36^2/(Empilage!K40^2-Empilage!K36^2)*(1-Empilage!K40^2/Detail_des_effets!K166^2)","v":{"$error":"#VALUE!"}},"MPa",null,"Contrainte radiale",{"$f":"O161*Empilage!O36^2/(Empilage!O40^2-Empilage!O36^2)*(1-Empilage!O40^2/Detail_des_effets!O166^2)","v":{"$error":"#VALUE!"}},"MPa",null,"Contrainte radiale",{"$f":"S161*Empilage!S36^2/(Empilage!S40^2-Empilage!S36^2)*(1-Empilage!S40^2/Detail_des_effets!S166^2)","v":{"$error":"#VALUE!"}},"MPa",null,"Contrainte radiale",{"$f":"W161*Empilage!W36^2/(Empilage!W40^2-Empilage!W36^2)*(1-Empilage!W40^2/Detail_des_effets!W166^2)","v":{"$error":"#VALUE!"}},"MPa",null,"Contrainte radiale",{"$f":"AA161*Empilage!AA36^2/(Empilage!AA40^2-Empilage!AA36^2)*(1-Empilage!AA40^2/Detail_des_effets!AA166^2)","v":{"$error":"#VALUE!"}},"MPa",null,"Contrainte radiale",{"$f":"AE161*Empilage!AE36^2/(Empilage!AE40^2-Empilage!AE36^2)*(1-Empilage!AE40^2/Detail_des_effets!AE166^2)","v":{"$error":"#VALUE!"}},"MPa",null,"Contrainte radiale",{"$f":"AI161*Empilage!AI36^2/(Empilage!AI40^2-Empilage!AI36^2)*(1-Empilage!AI40^2/Detail_des_effets!AI166^2)","v":{"$error":"#VALUE!"}},"MPa",null,"Contrainte radiale",{"$f":"AM161*Empilage!AM36^2/(Empilage!AM40^2-Empilage!AM36^2)*(1-Empilage!AM40^2/Detail_des_effets!AM166^2)","v":{"$error":"#VALUE!"}},"MPa"]
[null,"Contrainte tangentielle",{"$f":"C161*Empilage!C36^2/(Empilage!C35^2-Empilage!C36^2)*(1+Empilage!C35^2/Detail_des_effets!C166^2)","v":{"$error":"#VALUE!"}},"MPa",null,"Contrainte tangentielle",{"$f":"G161*Empilage!G36^2/(Empilage!G35^2-Empilage!G36^2)*(1+Empilage!G35^2/Detail_des_effets!G166^2)","v":{"$error":"#VALUE!"}},"MPa",null,"Contrainte tangentielle",{"$f":"K161*Empilage!K36^2/(Empilage!K35^2-Empilage!K36^2)*(1+Empilage!K35^2/Detail_des_effets!K166^2)","v":{"$error":"#VALUE!"}},"MPa",null,"Contrainte tangentielle",{"$f":"O161*Empilage!O36^2/(Empilage!O35^2-Empilage!O36^2)*(1+Empilage!O35^2/Detail_des_effets!O166^2)","v":{"$error":"#VALUE!"}},"MPa",null,"Contrainte tangentielle",{"$f":"S161*Empilage!S36^2/(Empilage!S35^2-Empilage!S36^2)*(1+Empilage!S35^2/Detail_des_effets!S166^2)","v":{"$error":"#VALUE!"}},"MPa",null,"Contrainte tangentielle",{"$f":"W161*Empilage!W36^2/(Empilage!W35^2-Empilage!W36^2)*(1+Empilage!W35^2/Detail_des_effets!W166^2)","v":{"$error":"#VALUE!"}},"MPa",null,"Contrainte tangentielle",{"$f":"AA161*Empilage!AA36^2/(Empilage!AA35^2-Empilage!AA36^2)*(1+Empilage!AA35^2/Detail_des_effets!AA166^2)","v":{"$error":"#VALUE!"}},"MPa",null,"Contrainte tangentielle",{"$f":"AE161*Empilage!AE36^2/(Empilage!AE35^2-Empilage!AE36^2)*(1+Empilage!AE35^2/Detail_des_effets!AE166^2)","v":{"$error":"#VALUE!"}},"MPa",null,"Contrainte tangentielle",{"$f":"AI161*Empilage!AI36^2/(Empilage!AI35^2-Empilage!AI36^2)*(1+Empilage!AI35^2/Detail_des_effets!AI166^2)","v":{"$error":"#VALUE!"}},"MPa",null,"Contrainte tangentielle",{"$f":"AM161*Empilage!AM36^2/(Empilage!AM35^2-Empilage!AM36^2)*(1+Empilage!AM35^2/Detail_des_effets!AM166^2)","v":{"$error":"#VALUE!"}},"MPa"]
[null,"Déformée radiale",{"$f":"C166*((C168-Empilage!C$52*Detail_des_effets!C167)/Empilage!C43)*10^-1","v":{"$error":"#VALUE!"}},"mm au diamètre",null,"Déformée radiale",{"$f":"G166*((G168-Empilage!G$52*Detail_des_effets!G167)/Empilage!G43)*10^-1","v":{"$error":"#VALUE!"}},"mm au diamètre",null,"Déformée radiale",{"$f":"K166*((K168-Empilage!K$52*Detail_des_effets!K167)/Empilage!K43)*10^-1","v":{"$error":"#VALUE!"}},"mm au diamètre",null,"Déformée radiale",{"$f":"O166*((O168-Empilage!O$52*Detail_des_effets!O167)/Empilage!O43)*10^-1","v":{"$error":"#VALUE!"}},"mm au diamètre",null,"Déformée radiale",{"$f":"S166*((S168-Empilage!S$52*Detail_des_effets!S167)/Empilage!S43)*10^-1","v":{"$error":"#VALUE!"}},"mm au diamètre",null,"Déformée radiale",{"$f":"W166*((W168-Empilage!W$52*Detail_des_effets!W167)/Empilage!W43)*10^-1","v":{"$error":"#VALUE!"}},"mm au diamètre",null,"Déformée radiale",{"$f":"AA166*((AA168-Empilage!AA$52*Detail_des_effets!AA167)/Empilage!AA43)*10^-1","v":{"$error":"#VALUE!"}},"mm au diamètre",null,"Déformée radiale",{"$f":"AE166*((AE168-Empilage!AE$52*Detail_des_effets!AE167)/Empilage!AE43)*10^-1","v":{"$error":"#VALUE!"}},"mm au diamètre",null,"Déformée radiale",{"$f":"AI166*((AI168-Empilage!AI$52*Detail_des_effets!AI167)/Empilage!AI43)*10^-1","v":{"$error":"#VALUE!"}},"mm au diamètre",null,"Déformée radiale",{"$f":"AM166*((AM168-Empilage!AM$52*Detail_des_effets!AM167)/Empilage!AM43)*10^-1","v":{"$error":"#VALUE!"}},"mm au diamètre"]
[null,"Effet du frettage seul en mise en froid",{"$nulls":3},"Effet du frettage seul en mise en froid",{"$nulls":3},"Effet du frettage seul en mise en froid",{"$nulls":3},"Effet du frettage seul en mise en froid",{"$nulls":3},"Effet du frettage seul en mise en froid",{"$nulls":3},"Effet du frettage seul en mise en froid",{"$nulls":3},"Effet du frettage seul en mise en froid",{"$nulls":3},"Effet du frettage seul en mise en froid",{"$nulls":3},"Effet du frettage seul en mise en froid",{"$nulls":3},"Effet du frettage seul en mise en froid"]
[]
[null,"Pression de contact",{"$f":"C68","v":"Empilage!/Empilage!/(Constantes_de_frettage!-Constantes_de_frettage!) * 0.001"},"MPa",null,"Pression de contact",{"$f":"G68","v":"Empilage!/Empilage!/(Constantes_de_frettage!-Constantes_de_frettage!) * 0.001"},"MPa",null,"Pression de contact",{"$f":"K68","v":"Empilage!/Empilage!/(Constantes_de_frettage!-Constantes_de_frettage!) * 0.001"},"MPa",null,"Pression de contact",{"$f":"O68","v":"Empilage!/Empilage!/(Constantes_de_frettage!-Constantes_de_frettage!) * 0.001"},"MPa",null,"Pression de contact",{"$f":"S68","v":"Empilage!/Empilage!/(Constantes_de_frettage!-Constantes_de_frettage!) * 0.001"},"MPa",null,"Pression de contact",{"$f":"W68","v":"Empilage!/Empilage!/(Constantes_de_frettage!-Constantes_de_frettage!) * 0.001"},"MPa",null,"Pression de contact",{"$f":"AA68","v":"Empilage!/Empilage!/(Constantes_de_frettage!-Constantes_de_frettage!) * 0.001"},"MPa",null,"Pression de contact",{"$f":"AE68","v":"Empilage!/Empilage!/(Constantes_de_frettage!-Constantes_de_frettage!) * 0.001"},"MPa",null,"Pression de contact",{"$f":"AI68","v":"Empilage!/Empilage!/(Constantes_de_frettage!-Constantes_de_frettage!) * 0.001"},"MPa",null,"Pression de contact",{"$f":"AM68","v":"Empilage!/Empilage!/(Constantes_de_frettage!-Constantes_de_frettage!) * 0.001"},"MPa"]
[null,"Au niveau du frettage",{"$nulls":3},"Au niveau du frettage",{"$nulls":3},"Au niveau du frettage",{"$nulls":3},"Au niveau du frettage",{"$nulls":3},"Au niveau du frettage",{"$nulls":3},"Au niveau du frettage",{"$nulls":3},"Au niveau du frettage",{"$nulls":3},"Au niveau du frettage",{"$nulls":3},"Au niveau du frettage",{"$nulls":3},"Au niveau du frettage"]
[null,"Contrainte radiale",{"$f":"-C172","v":{"$error":"#VALUE!"}},"MPa",null,"Contrainte radiale",{"$f":"-G172","v":{"$error":"#VALUE!"}},"MPa",null,"Contrainte radiale",{"$f":"-K172","v":{"$error":"#VALUE!"}},"MPa",null,"Contrainte radiale",{"$f":"-O172","v":{"$error":"#VALUE!"}},"MPa",null,"Contrainte radiale",{"$f":"-S172","v":{"$error":"#VALUE!"}},"MPa",null,"Contrainte radiale",{"$f":"-W172","v":{"$error":"#VALUE!"}},"MPa",null,"Contrainte radiale",{"$f":"-AA172","v":{"$error":"#VALUE!"}},"MPa",null,"Contrainte radiale",{"$f":"-AE172","v":{"$error":"#VALUE!"}},"MPa",null,"Contrainte radiale",{"$f":"-AI172","v":{"$error":"#VALUE!"}},"MPa",null,"Contrainte radiale",{"$f":"-AM172","v":{"$error":"#VALUE!"}},"MPa"]
[null,"Contrainte tangentielle",{"$f":"C172*(Empilage!C35^2+Empilage!C36^2)/(Empilage!C35^2-Empilage!C36^2)","v":{"$error":"#VALUE!"}},"MPa",null,"Contrainte tangentielle",{"$f":"G172*(Empilage!G35^2+Empilage!G36^2)/(Empilage!G35^2-Empilage!G36^2)","v":{"$error":"#VALUE!"}},"MPa",null,"Contrainte tangentielle",{"$f":"K172*(Empilage!K35^2+Empilage!K36^2)/(Empilage!K35^2-Empilage!K36^2)","v":{"$error":"#VALUE!"}},"MPa",null,"Contrainte tangentielle",{"$f":"O172*(Empilage!O35^2+Empilage!O36^2)/(Empilage!O35^2-Empilage!O36^2)","v":{"$error":"#VALUE!"}},"MPa",null,"Contrainte tangentielle",{"$f":"S172*(Empilage!S35^2+Empilage!S36^2)/(Empilage!S35^2-Empilage!S36^2)","v":{"$error":"#VALUE!"}},"MPa",null,"Contrainte tangentielle",{"$f":"W172*(Empilage!W35^2+Empilage!W36^2)/(Empilage!W35^2-Empilage!W36^2)","v":{"$error":"#VALUE!"}},"MPa",null,"Contrainte tangentielle",{"$f":"AA172*(Empilage!AA35^2+Empilage!AA36^2)/(Empilage!AA35^2-Empilage!AA36^2)","v":{"$error":"#VALUE!"}},"MPa",null,"Contrainte tangentielle",{"$f":"AE172*(Empilage!AE35^2+Empilage!AE36^2)/(Empilage!AE35^2-Empilage!AE36^2)","v":{"$error":"#VALUE!"}},"MPa",null,"Contrainte tangentielle",{"$f":"AI172*(Empilage!AI35^2+Empilage!AI36^2)/(Empilage!AI35^2-Empilage!AI36^2)","v":{"$error":"#VALUE!"}},"MPa",null,"Contrainte tangentielle",{"$f":"AM172*(Empilage!AM35^2+Empilage!AM36^2)/(Empilage!AM35^2-Empilage!AM36^2)","v":{"$error":"#VALUE!"}},"MPa"]
[null,"Déformée radiale",{"$f":"C177*((C175-Empilage!C$52*Detail_des_effets!C174)/Empilage!C44)*10^-1","v":{"$error":"#VALUE!"}},"mm au diamètre",null,"Déformée radiale",{"$f":"G177*((G175-Empilage!G$52*Detail_des_effets!G174)/Empilage!G44)*10^-1","v":{"$error":"#VALUE!"}},"mm au diamètre",null,"Déformée radiale",{"$f":"K177*((K175-Empilage!K$52*Detail_des_effets!K174)/Empilage!K44)*10^-1","v":{"$error":"#VALUE!"}},"mm au diamètre",null,"Déformée radiale",{"$f":"O177*((O175-Empilage!O$52*Detail_des_effets!O174)/Empilage!O44)*10^-1","v":{"$error":"#VALUE!"}},"mm au diamètre",null,"Déformée radiale",{"$f":"S177*((S175-Empilage!S$52*Detail_des_effets!S174)/Empilage!S44)*10^-1","v":{"$error":"#VALUE!"}},"mm au diamètre",null,"Déformée radiale",{"$f":"W177*((W175-Empilage!W$52*Detail_des_effets!W174)/Empilage!W44)*10^-1","v":{"$error":"#VALUE!"}},"mm au diamètre",null,"Déformée radiale",{"$f":"AA177*((AA175-Empilage!AA$52*Detail_des_effets!AA174)/Empilage!AA44)*10^-1","v":{"$error":"#VALUE!"}},"mm au diamètre",null,"Déformée radiale",{"$f":"AE177*((AE175-Empilage!AE$52*Detail_des_effets!AE174)/Empilage!AE44)*10^-1","v":{"$error":"#VALUE!"}},"mm au diamètre",null,"Déformée radiale",{"$f":"AI177*((AI175-Empilage!AI$52*Detail_des_effets!AI174)/Empilage!AI44)*10^-1","v":{"$error":"#VALUE!"}},"mm au diamètre",null,"Déformée radiale",{"$f":"AM177*((AM175-Empilage!AM$52*Detail_des_effets!AM174)/Empilage!AM44)*10^-1","v":{"$error":"#VALUE!"}},"mm au diamètre"]
[null,"Dans la pièce, au diamètre particulier",{"$f":"Empilage!C$37","v":{"v":29,"d":"29.00"}},"mm",null,"Dans la pièce, au diamètre particulier",{"$f":"Empilage!G$37","v":{"v":29,"d":"29.00"}},"mm",null,"Dans la pièce, au diamètre particulier",{"$f":"Empilage!K$37","v":{"v":29,"d":"29.00"}},"mm",null,"Dans la pièce, au diamètre particulier",{"$f":"Empilage!O$37","v":{"v":29,"d":"29.00"}},"mm",null,"Dans la pièce, au diamètre particulier",{"$f":"Empilage!S$37","v":{"v":29,"d":"29.00"}},"mm",null,"Dans la pièce, au diamètre particulier",{"$f":"Empilage!W$37","v":{"v":29,"d":"29.00"}},"mm",null,"Dans la pièce, au diamètre particulier",{"$f":"Empilage!AA$37","v":{"v":29,"d":"29.00"}},"mm",null,"Dans la pièce, au diamètre particulier",{"$f":"Empilage!AE$37","v":{"v":29,"d":"29.00"}},"mm",null,"Dans la pièce, au diamètre particulier",{"$f":"Empilage!AI$37","v":{"v":29,"d":"29.00"}},"mm",null,"Dans la pièce, au diamètre particulier",{"$f":"Empilage!AM$37","v":{"v":29,"d":"29.00"}},"mm"]
[null,"Contrainte radiale",{"$f":"C172*Empilage!C36^2/(Empilage!C40^2-Empilage!C36^2)*(1-Empilage!C40^2/Detail_des_effets!C177^2)","v":{"$error":"#VALUE!"}},"MPa",null,"Contrainte radiale",{"$f":"G172*Empilage!G36^2/(Empilage!G40^2-Empilage!G36^2)*(1-Empilage!G40^2/Detail_des_effets!G177^2)","v":{"$error":"#VALUE!"}},"MPa",null,"Contrainte radiale",{"$f":"K172*Empilage!K36^2/(Empilage!K40^2-Empilage!K36^2)*(1-Empilage!K40^2/Detail_des_effets!K177^2)","v":{"$error":"#VALUE!"}},"MPa",null,"Contrainte radiale",{"$f":"O172*Empilage!O36^2/(Empilage!O40^2-Empilage!O36^2)*(1-Empilage!O40^2/Detail_des_effets!O177^2)","v":{"$error":"#VALUE!"}},"MPa",null,"Contrainte radiale",{"$f":"S172*Empilage!S36^2/(Empilage!S40^2-Empilage!S36^2)*(1-Empilage!S40^2/Detail_des_effets!S177^2)","v":{"$error":"#VALUE!"}},"MPa",null,"Contrainte radiale",{"$f":"W172*Empilage!W36^2/(Empilage!W40^2-Empilage!W36^2)*(1-Empilage!W40^2/Detail_des_effets!W177^2)","v":{"$error":"#VALUE!"}},"MPa",null,"Contrainte radiale",{"$f":"AA172*Empilage!AA36^2/(Empilage!AA40^2-Empilage!AA36^2)*(1-Empilage!AA40^2/Detail_des_effets!AA177^2)","v":{"$error":"#VALUE!"}},"MPa",null,"Contrainte radiale",{"$f":"AE172*Empilage!AE36^2/(Empilage!AE40^2-Empilage!AE36^2)*(1-Empilage!AE40^2/Detail_des_effets!AE177^2)","v":{"$error":"#VALUE!"}},"MPa",null,"Contrainte radiale",{"$f":"AI172*Empilage!AI36^2/(Empilage!AI40^2-Empilage!AI36^2)*(1-Empilage!AI40^2/Detail_des_effets!AI177^2)","v":{"$error":"#VALUE!"}},"MPa",null,"Contrainte radiale",{"$f":"AM172*Empilage!AM36^2/(Empilage!AM40^2-Empilage!AM36^2)*(1-Empilage!AM40^2/Detail_des_effets!AM177^2)","v":{"$error":"#VALUE!"}},"MPa"]
[null,"Contrainte tangentielle",{"$f":"C172*Empilage!C36^2/(Empilage!C35^2-Empilage!C36^2)*(1+Empilage!C35^2/Detail_des_effets!C177^2)","v":{"$error":"#VALUE!"}},"MPa",null,"Contrainte tangentielle",{"$f":"G172*Empilage!G36^2/(Empilage!G35^2-Empilage!G36^2)*(1+Empilage!G35^2/Detail_des_effets!G177^2)","v":{"$error":"#VALUE!"}},"MPa",null,"Contrainte tangentielle",{"$f":"K172*Empilage!K36^2/(Empilage!K35^2-Empilage!K36^2)*(1+Empilage!K35^2/Detail_des_effets!K177^2)","v":{"$error":"#VALUE!"}},"MPa",null,"Contrainte tangentielle",{"$f":"O172*Empilage!O36^2/(Empilage!O35^2-Empilage!O36^2)*(1+Empilage!O35^2/Detail_des_effets!O177^2)","v":{"$error":"#VALUE!"}},"MPa",null,"Contrainte tangentielle",{"$f":"S172*Empilage!S36^2/(Empilage!S35^2-Empilage!S36^2)*(1+Empilage!S35^2/Detail_des_effets!S177^2)","v":{"$error":"#VALUE!"}},"MPa",null,"Contrainte tangentielle",{"$f":"W172*Empilage!W36^2/(Empilage!W35^2-Empilage!W36^2)*(1+Empilage!W35^2/Detail_des_effets!W177^2)","v":{"$error":"#VALUE!"}},"MPa",null,"Contrainte tangentielle",{"$f":"AA172*Empilage!AA36^2/(Empilage!AA35^2-Empilage!AA36^2)*(1+Empilage!AA35^2/Detail_des_effets!AA177^2)","v":{"$error":"#VALUE!"}},"MPa",null,"Contrainte tangentielle",{"$f":"AE172*Empilage!AE36^2/(Empilage!AE35^2-Empilage!AE36^2)*(1+Empilage!AE35^2/Detail_des_effets!AE177^2)","v":{"$error":"#VALUE!"}},"MPa",null,"Contrainte tangentielle",{"$f":"AI172*Empilage!AI36^2/(Empilage!AI35^2-Empilage!AI36^2)*(1+Empilage!AI35^2/Detail_des_effets!AI177^2)","v":{"$error":"#VALUE!"}},"MPa",null,"Contrainte tangentielle",{"$f":"AM172*Empilage!AM36^2/(Empilage!AM35^2-Empilage!AM36^2)*(1+Empilage!AM35^2/Detail_des_effets!AM177^2)","v":{"$error":"#VALUE!"}},"MPa"]
[null,"Déformée radiale",{"$f":"C177*((C179-Empilage!C$52*Detail_des_effets!C178)/Empilage!C44)*10^-1","v":{"$error":"#VALUE!"}},"mm au diamètre",null,"Déformée radiale",{"$f":"G177*((G179-Empilage!G$52*Detail_des_effets!G178)/Empilage!G44)*10^-1","v":{"$error":"#VALUE!"}},"mm au diamètre",null,"Déformée radiale",{"$f":"K177*((K179-Empilage!K$52*Detail_des_effets!K178)/Empilage!K44)*10^-1","v":{"$error":"#VALUE!"}},"mm au diamètre",null,"Déformée radiale",{"$f":"O177*((O179-Empilage!O$52*Detail_des_effets!O178)/Empilage!O44)*10^-1","v":{"$error":"#VALUE!"}},"mm au diamètre",null,"Déformée radiale",{"$f":"S177*((S179-Empilage!S$52*Detail_des_effets!S178)/Empilage!S44)*10^-1","v":{"$error":"#VALUE!"}},"mm au diamètre",null,"Déformée radiale",{"$f":"W177*((W179-Empilage!W$52*Detail_des_effets!W178)/Empilage!W44)*10^-1","v":{"$error":"#VALUE!"}},"mm au diamètre",null,"Déformée radiale",{"$f":"AA177*((AA179-Empilage!AA$52*Detail_des_effets!AA178)/Empilage!AA44)*10^-1","v":{"$error":"#VALUE!"}},"mm au diamètre",null,"Déformée radiale",{"$f":"AE177*((AE179-Empilage!AE$52*Detail_des_effets!AE178)/Empilage!AE44)*10^-1","v":{"$error":"#VALUE!"}},"mm au diamètre",null,"Déformée radiale",{"$f":"AI177*((AI179-Empilage!AI$52*Detail_des_effets!AI178)/Empilage!AI44)*10^-1","v":{"$error":"#VALUE!"}},"mm au diamètre",null,"Déformée radiale",{"$f":"AM177*((AM179-Empilage!AM$52*Detail_des_effets!AM178)/Empilage!AM44)*10^-1","v":{"$error":"#VALUE!"}},"mm au diamètre"]
[null,"Effet du frettage seul en fonctionnement",{"$nulls":3},"Effet du frettage seul en fonctionnement",{"$nulls":3},"Effet du frettage seul en fonctionnement",{"$nulls":3},"Effet du frettage seul en fonctionnement",{"$nulls":3},"Effet du frettage seul en fonctionnement",{"$nulls":3},"Effet du frettage seul en fonctionnement",{"$nulls":3},"Effet du frettage seul en fonctionnement",{"$nulls":3},"Effet du frettage seul en fonctionnement",{"$nulls":3},"Effet du frettage seul en fonctionnement",{"$nulls":3},"Effet du frettage seul en fonctionnement"]
[]
[null,"Pression de contact",{"$f":"C79","v":"Empilage!/Empilage!/(Constantes_de_frettage!-Constantes_de_frettage!) * 0.001"},"MPa",null,"Pression de contact",{"$f":"G79","v":"Empilage!/Empilage!/(Constantes_de_frettage!-Constantes_de_frettage!) * 0.001"},"MPa",null,"Pression de contact",{"$f":"K79","v":"Empilage!/Empilage!/(Constantes_de_frettage!-Constantes_de_frettage!) * 0.001"},"MPa",null,"Pression de contact",{"$f":"O79","v":"Empilage!/Empilage!/(Constantes_de_frettage!-Constantes_de_frettage!) * 0.001"},"MPa",null,"Pression de contact",{"$f":"S79","v":"Empilage!/Empilage!/(Constantes_de_frettage!-Constantes_de_frettage!) * 0.001"},"MPa",null,"Pression de contact",{"$f":"W79","v":"Empilage!/Empilage!/(Constantes_de_frettage!-Constantes_de_frettage!) * 0.001"},"MPa",null,"Pression de contact",{"$f":"AA79","v":"Empilage!/Empilage!/(Constantes_de_frettage!-Constantes_de_frettage!) * 0.001"},"MPa",null,"Pression de contact",{"$f":"AE79","v":"Empilage!/Empilage!/(Constantes_de_frettage!-Constantes_de_frettage!) * 0.001"},"MPa",null,"Pression de contact",{"$f":"AI79","v":"Empilage!/Empilage!/(Constantes_de_frettage!-Constantes_de_frettage!) * 0.001"},"MPa",null,"Pression de contact",{"$f":"AM79","v":"Empilage!/Empilage!/(Constantes_de_frettage!-Constantes_de_frettage!) * 0.001"},"MPa"]
[null,"Au niveau du frettage",{"$nulls":3},"Au niveau du frettage",{"$nulls":3},"Au niveau du frettage",{"$nulls":3},"Au niveau du frettage",{"$nulls":3},"Au niveau du frettage",{"$nulls":3},"Au niveau du frettage",{"$nulls":3},"Au niveau du frettage",{"$nulls":3},"Au niveau du frettage",{"$nulls":3},"Au niveau du frettage",{"$nulls":3},"Au niveau du frettage"]
[null,"Contrainte radiale",{"$f":"-C183","v":{"$error":"#VALUE!"}},"MPa",null,"Contrainte radiale",{"$f":"-G183","v":{"$error":"#VALUE!"}},"MPa",null,"Contrainte radiale",{"$f":"-K183","v":{"$error":"#VALUE!"}},"MPa",null,"Contrainte radiale",{"$f":"-O183","v":{"$error":"#VALUE!"}},"MPa",null,"Contrainte radiale",{"$f":"-S183","v":{"$error":"#VALUE!"}},"MPa",null,"Contrainte radiale",{"$f":"-W183","v":{"$error":"#VALUE!"}},"MPa",null,"Contrainte radiale",{"$f":"-AA183","v":{"$error":"#VALUE!"}},"MPa",null,"Contrainte radiale",{"$f":"-AE183","v":{"$error":"#VALUE!"}},"MPa",null,"Contrainte radiale",{"$f":"-AI183","v":{"$error":"#VALUE!"}},"MPa",null,"Contrainte radiale",{"$f":"-AM183","v":{"$error":"#VALUE!"}},"MPa"]
[null,"Contrainte tangentielle",{"$f":"C183*(Empilage!C35^2+Empilage!C36^2)/(Empilage!C35^2-Empilage!C36^2)","v":{"$error":"#VALUE!"}},"MPa",null,"Contrainte tangentielle",{"$f":"G183*(Empilage!G35^2+Empilage!G36^2)/(Empilage!G35^2-Empilage!G36^2)","v":{"$error":"#VALUE!"}},"MPa",null,"Contrainte tangentielle",{"$f":"K183*(Empilage!K35^2+Empilage!K36^2)/(Empilage!K35^2-Empilage!K36^2)","v":{"$error":"#VALUE!"}},"MPa",null,"Contrainte tangentielle",{"$f":"O183*(Empilage!O35^2+Empilage!O36^2)/(Empilage!O35^2-Empilage!O36^2)","v":{"$error":"#VALUE!"}},"MPa",null,"Contrainte tangentielle",{"$f":"S183*(Empilage!S35^2+Empilage!S36^2)/(Empilage!S35^2-Empilage!S36^2)","v":{"$error":"#VALUE!"}},"MPa",null,"Contrainte tangentielle",{"$f":"W183*(Empilage!W35^2+Empilage!W36^2)/(Empilage!W35^2-Empilage!W36^2)","v":{"$error":"#VALUE!"}},"MPa",null,"Contrainte tangentielle",{"$f":"AA183*(Empilage!AA35^2+Empilage!AA36^2)/(Empilage!AA35^2-Empilage!AA36^2)","v":{"$error":"#VALUE!"}},"MPa",null,"Contrainte tangentielle",{"$f":"AE183*(Empilage!AE35^2+Empilage!AE36^2)/(Empilage!AE35^2-Empilage!AE36^2)","v":{"$error":"#VALUE!"}},"MPa",null,"Contrainte tangentielle",{"$f":"AI183*(Empilage!AI35^2+Empilage!AI36^2)/(Empilage!AI35^2-Empilage!AI36^2)","v":{"$error":"#VALUE!"}},"MPa",null,"Contrainte tangentielle",{"$f":"AM183*(Empilage!AM35^2+Empilage!AM36^2)/(Empilage!AM35^2-Empilage!AM36^2)","v":{"$error":"#VALUE!"}},"MPa"]
[null,"Déformée radiale",{"$f":"C188*((C186-Empilage!C$52*Detail_des_effets!C185)/Empilage!C45)*10^-1","v":{"$error":"#VALUE!"}},"mm au diamètre",null,"Déformée radiale",{"$f":"G188*((G186-Empilage!G$52*Detail_des_effets!G185)/Empilage!G45)*10^-1","v":{"$error":"#VALUE!"}},"mm au diamètre",null,"Déformée radiale",{"$f":"K188*((K186-Empilage!K$52*Detail_des_effets!K185)/Empilage!K45)*10^-1","v":{"$error":"#VALUE!"}},"mm au diamètre",null,"Déformée radiale",{"$f":"O188*((O186-Empilage!O$52*Detail_des_effets!O185)/Empilage!O45)*10^-1","v":{"$error":"#VALUE!"}},"mm au diamètre",null,"Déformée radiale",{"$f":"S188*((S186-Empilage!S$52*Detail_des_effets!S185)/Empilage!S45)*10^-1","v":{"$error":"#VALUE!"}},"mm au diamètre",null,"Déformée radiale",{"$f":"W188*((W186-Empilage!W$52*Detail_des_effets!W185)/Empilage!W45)*10^-1","v":{"$error":"#VALUE!"}},"mm au diamètre",null,"Déformée radiale",{"$f":"AA188*((AA186-Empilage!AA$52*Detail_des_effets!AA185)/Empilage!AA45)*10^-1","v":{"$error":"#VALUE!"}},"mm au diamètre",null,"Déformée radiale",{"$f":"AE188*((AE186-Empilage!AE$52*Detail_des_effets!AE185)/Empilage!AE45)*10^-1","v":{"$error":"#VALUE!"}},"mm au diamètre",null,"Déformée radiale",{"$f":"AI188*((AI186-Empilage!AI$52*Detail_des_effets!AI185)/Empilage!AI45)*10^-1","v":{"$error":"#VALUE!"}},"mm au diamètre",null,"Déformée radiale",{"$f":"AM188*((AM186-Empilage!AM$52*Detail_des_effets!AM185)/Empilage!AM45)*10^-1","v":{"$error":"#VALUE!"}},"mm au diamètre"]
[null,"Dans la pièce, au diamètre particulier",{"$f":"Empilage!C$37","v":{"v":29,"d":"29.00"}},"mm",null,"Dans la pièce, au diamètre particulier",{"$f":"Empilage!G$37","v":{"v":29,"d":"29.00"}},"mm",null,"Dans la pièce, au diamètre particulier",{"$f":"Empilage!K$37","v":{"v":29,"d":"29.00"}},"mm",null,"Dans la pièce, au diamètre particulier",{"$f":"Empilage!O$37","v":{"v":29,"d":"29.00"}},"mm",null,"Dans la pièce, au diamètre particulier",{"$f":"Empilage!S$37","v":{"v":29,"d":"29.00"}},"mm",null,"Dans la pièce, au diamètre particulier",{"$f":"Empilage!W$37","v":{"v":29,"d":"29.00"}},"mm",null,"Dans la pièce, au diamètre particulier",{"$f":"Empilage!AA$37","v":{"v":29,"d":"29.00"}},"mm",null,"Dans la pièce, au diamètre particulier",{"$f":"Empilage!AE$37","v":{"v":29,"d":"29.00"}},"mm",null,"Dans la pièce, au diamètre particulier",{"$f":"Empilage!AI$37","v":{"v":29,"d":"29.00"}},"mm",null,"Dans la pièce, au diamètre particulier",{"$f":"Empilage!AM$37","v":{"v":29,"d":"29.00"}},"mm"]
[null,"Contrainte radiale",{"$f":"C183*Empilage!C36^2/(Empilage!C40^2-Empilage!C36^2)*(1-Empilage!C40^2/Detail_des_effets!C188^2)","v":{"$error":"#VALUE!"}},"MPa",null,"Contrainte radiale",{"$f":"G183*Empilage!G36^2/(Empilage!G40^2-Empilage!G36^2)*(1-Empilage!G40^2/Detail_des_effets!G188^2)","v":{"$error":"#VALUE!"}},"MPa",null,"Contrainte radiale",{"$f":"K183*Empilage!K36^2/(Empilage!K40^2-Empilage!K36^2)*(1-Empilage!K40^2/Detail_des_effets!K188^2)","v":{"$error":"#VALUE!"}},"MPa",null,"Contrainte radiale",{"$f":"O183*Empilage!O36^2/(Empilage!O40^2-Empilage!O36^2)*(1-Empilage!O40^2/Detail_des_effets!O188^2)","v":{"$error":"#VALUE!"}},"MPa",null,"Contrainte radiale",{"$f":"S183*Empilage!S36^2/(Empilage!S40^2-Empilage!S36^2)*(1-Empilage!S40^2/Detail_des_effets!S188^2)","v":{"$error":"#VALUE!"}},"MPa",null,"Contrainte radiale",{"$f":"W183*Empilage!W36^2/(Empilage!W40^2-Empilage!W36^2)*(1-Empilage!W40^2/Detail_des_effets!W188^2)","v":{"$error":"#VALUE!"}},"MPa",null,"Contrainte radiale",{"$f":"AA183*Empilage!AA36^2/(Empilage!AA40^2-Empilage!AA36^2)*(1-Empilage!AA40^2/Detail_des_effets!AA188^2)","v":{"$error":"#VALUE!"}},"MPa",null,"Contrainte radiale",{"$f":"AE183*Empilage!AE36^2/(Empilage!AE40^2-Empilage!AE36^2)*(1-Empilage!AE40^2/Detail_des_effets!AE188^2)","v":{"$error":"#VALUE!"}},"MPa",null,"Contrainte radiale",{"$f":"AI183*Empilage!AI36^2/(Empilage!AI40^2-Empilage!AI36^2)*(1-Empilage!AI40^2/Detail_des_effets!AI188^2)","v":{"$error":"#VALUE!"}},"MPa",null,"Contrainte radiale",{"$f":"AM183*Empilage!AM36^2/(Empilage!AM40^2-Empilage!AM36^2)*(1-Empilage!AM40^2/Detail_des_effets!AM188^2)","v":{"$error":"#VALUE!"}},"MPa"]
[null,"Contrainte tangentielle",{"$f":"C183*Empilage!C36^2/(Empilage!C35^2-Empilage!C36^2)*(1+Empilage!C35^2/Detail_des_effets!C188^2)","v":{"$error":"#VALUE!"}},"MPa",null,"Contrainte tangentielle",{"$f":"G183*Empilage!G36^2/(Empilage!G35^2-Empilage!G36^2)*(1+Empilage!G35^2/Detail_des_effets!G188^2)","v":{"$error":"#VALUE!"}},"MPa",null,"Contrainte tangentielle",{"$f":"K183*Empilage!K36^2/(Empilage!K35^2-Empilage!K36^2)*(1+Empilage!K35^2/Detail_des_effets!K188^2)","v":{"$error":"#VALUE!"}},"MPa",null,"Contrainte tangentielle",{"$f":"O183*Empilage!O36^2/(Empilage!O35^2-Empilage!O36^2)*(1+Empilage!O35^2/Detail_des_effets!O188^2)","v":{"$error":"#VALUE!"}},"MPa",null,"Contrainte tangentielle",{"$f":"S183*Empilage!S36^2/(Empilage!S35^2-Empilage!S36^2)*(1+Empilage!S35^2/Detail_des_effets!S188^2)","v":{"$error":"#VALUE!"}},"MPa",null,"Contrainte tangentielle",{"$f":"W183*Empilage!W36^2/(Empilage!W35^2-Empilage!W36^2)*(1+Empilage!W35^2/Detail_des_effets!W188^2)","v":{"$error":"#VALUE!"}},"MPa",null,"Contrainte tangentielle",{"$f":"AA183*Empilage!AA36^2/(Empilage!AA35^2-Empilage!AA36^2)*(1+Empilage!AA35^2/Detail_des_effets!AA188^2)","v":{"$error":"#VALUE!"}},"MPa",null,"Contrainte tangentielle",{"$f":"AE183*Empilage!AE36^2/(Empilage!AE35^2-Empilage!AE36^2)*(1+Empilage!AE35^2/Detail_des_effets!AE188^2)","v":{"$error":"#VALUE!"}},"MPa",null,"Contrainte tangentielle",{"$f":"AI183*Empilage!AI36^2/(Empilage!AI35^2-Empilage!AI36^2)*(1+Empilage!AI35^2/Detail_des_effets!AI188^2)","v":{"$error":"#VALUE!"}},"MPa",null,"Contrainte tangentielle",{"$f":"AM183*Empilage!AM36^2/(Empilage!AM35^2-Empilage!AM36^2)*(1+Empilage!AM35^2/Detail_des_effets!AM188^2)","v":{"$error":"#VALUE!"}},"MPa"]
[null,"Déformée radiale",{"$f":"C188*((C190-Empilage!C$52*Detail_des_effets!C189)/Empilage!C45)*10^-1","v":{"$error":"#VALUE!"}},"mm au diamètre",null,"Déformée radiale",{"$f":"G188*((G190-Empilage!G$52*Detail_des_effets!G189)/Empilage!G45)*10^-1","v":{"$error":"#VALUE!"}},"mm au diamètre",null,"Déformée radiale",{"$f":"K188*((K190-Empilage!K$52*Detail_des_effets!K189)/Empilage!K45)*10^-1","v":{"$error":"#VALUE!"}},"mm au diamètre",null,"Déformée radiale",{"$f":"O188*((O190-Empilage!O$52*Detail_des_effets!O189)/Empilage!O45)*10^-1","v":{"$error":"#VALUE!"}},"mm au diamètre",null,"Déformée radiale",{"$f":"S188*((S190-Empilage!S$52*Detail_des_effets!S189)/Empilage!S45)*10^-1","v":{"$error":"#VALUE!"}},"mm au diamètre",null,"Déformée radiale",{"$f":"W188*((W190-Empilage!W$52*Detail_des_effets!W189)/Empilage!W45)*10^-1","v":{"$error":"#VALUE!"}},"mm au diamètre",null,"Déformée radiale",{"$f":"AA188*((AA190-Empilage!AA$52*Detail_des_effets!AA189)/Empilage!AA45)*10^-1","v":{"$error":"#VALUE!"}},"mm au diamètre",null,"Déformée radiale",{"$f":"AE188*((AE190-Empilage!AE$52*Detail_des_effets!AE189)/Empilage!AE45)*10^-1","v":{"$error":"#VALUE!"}},"mm au diamètre",null,"Déformée radiale",{"$f":"AI188*((AI190-Empilage!AI$52*Detail_des_effets!AI189)/Empilage!AI45)*10^-1","v":{"$error":"#VALUE!"}},"mm au diamètre",null,"Déformée radiale",{"$f":"AM188*((AM190-Empilage!AM$52*Detail_des_effets!AM189)/Empilage!AM45)*10^-1","v":{"$error":"#VALUE!"}},"mm au diamètre"]
[null,"Effet de la thermique seule en mise en froid",{"$nulls":3},"Effet de la thermique seule en mise en froid",{"$nulls":3},"Effet de la thermique seule en mise en froid",{"$nulls":3},"Effet de la thermique seule en mise en froid",{"$nulls":3},"Effet de la thermique seule en mise en froid",{"$nulls":3},"Effet de la thermique seule en mise en froid",{"$nulls":3},"Effet de la thermique seule en mise en froid",{"$nulls":3},"Effet de la thermique seule en mise en froid",{"$nulls":3},"Effet de la thermique seule en mise en froid",{"$nulls":3},"Effet de la thermique seule en mise en froid"]
[]
[null,"Au niveau du frettage",{"$nulls":3},"Au niveau du frettage",{"$nulls":3},"Au niveau du frettage",{"$nulls":3},"Au niveau du frettage",{"$nulls":3},"Au niveau du frettage",{"$nulls":3},"Au niveau du frettage",{"$nulls":3},"Au niveau du frettage",{"$nulls":3},"Au niveau du frettage",{"$nulls":3},"Au niveau du frettage",{"$nulls":3},"Au niveau du frettage"]
[null,"Déformée axiale",{"$f":"Empilage!C50*10^-5*Empilage!C33","v":{"v":-0.13154988756000002,"d":"-0.132"}},"mm",null,"Déformée axiale",{"$f":"Empilage!G50*10^-5*Empilage!G33","v":{"v":-0.13154988756000002,"d":"-0.132"}},"mm",null,"Déformée axiale",{"$f":"Empilage!K50*10^-5*Empilage!K33","v":{"v":-0.13154988756000002,"d":"-0.132"}},"mm",null,"Déformée axiale",{"$f":"Empilage!O50*10^-5*Empilage!O33","v":{"v":-0.13154988756000002,"d":"-0.132"}},"mm",null,"Déformée axiale",{"$f":"Empilage!S50*10^-5*Empilage!S33","v":{"v":-0.13154988756000002,"d":"-0.132"}},"mm",null,"Déformée axiale",{"$f":"Empilage!W50*10^-5*Empilage!W33","v":{"v":-0.13154988756000002,"d":"-0.132"}},"mm",null,"Déformée axiale",{"$f":"Empilage!AA50*10^-5*Empilage!AA33","v":{"v":-0.13154988756000002,"d":"-0.132"}},"mm",null,"Déformée axiale",{"$f":"Empilage!AE50*10^-5*Empilage!AE33","v":{"v":-0.13154988756000002,"d":"-0.132"}},"mm",null,"Déformée axiale",{"$f":"Empilage!AI50*10^-5*Empilage!AI33","v":{"v":-0.13154988756000002,"d":"-0.132"}},"mm",null,"Déformée axiale",{"$f":"Empilage!AM50*10^-5*Empilage!AM33","v":{"v":-0.13154988756000002,"d":"-0.132"}},"mm"]
[null,"Déformée radiale",{"$f":"Empilage!C50*10^-5*Empilage!C36","v":{"v":-0.06240507000000001,"d":"-0.062"}},"mm",null,"Déformée radiale",{"$f":"Empilage!G50*10^-5*Empilage!G36","v":{"v":-0.06240507000000001,"d":"-0.062"}},"mm",null,"Déformée radiale",{"$f":"Empilage!K50*10^-5*Empilage!K36","v":{"v":-0.06240507000000001,"d":"-0.062"}},"mm",null,"Déformée radiale",{"$f":"Empilage!O50*10^-5*Empilage!O36","v":{"v":-0.06240507000000001,"d":"-0.062"}},"mm",null,"Déformée radiale",{"$f":"Empilage!S50*10^-5*Empilage!S36","v":{"v":-0.06240507000000001,"d":"-0.062"}},"mm",null,"Déformée radiale",{"$f":"Empilage!W50*10^-5*Empilage!W36","v":{"v":-0.06240507000000001,"d":"-0.062"}},"mm",null,"Déformée radiale",{"$f":"Empilage!AA50*10^-5*Empilage!AA36","v":{"v":-0.06240507000000001,"d":"-0.062"}},"mm",null,"Déformée radiale",{"$f":"Empilage!AE50*10^-5*Empilage!AE36","v":{"v":-0.06240507000000001,"d":"-0.062"}},"mm",null,"Déformée radiale",{"$f":"Empilage!AI50*10^-5*Empilage!AI36","v":{"v":-0.06240507000000001,"d":"-0.062"}},"mm",null,"Déformée radiale",{"$f":"Empilage!AM50*10^-5*Empilage!AM36","v":{"v":-0.06240507000000001,"d":"-0.062"}},"mm"]
[null,"Dans la pièce, au diamètre particulier",{"$f":"Empilage!C$37","v":{"v":29,"d":"29.00"}},"mm",null,"Dans la pièce, au diamètre particulier",{"$f":"Empilage!G$37","v":{"v":29,"d":"29.00"}},"mm",null,"Dans la pièce, au diamètre particulier",{"$f":"Empilage!K$37","v":{"v":29,"d":"29.00"}},"mm",null,"Dans la pièce, au diamètre particulier",{"$f":"Empilage!O$37","v":{"v":29,"d":"29.00"}},"mm",null,"Dans la pièce, au diamètre particulier",{"$f":"Empilage!S$37","v":{"v":29,"d":"29.00"}},"mm",null,"Dans la pièce, au diamètre particulier",{"$f":"Empilage!W$37","v":{"v":29,"d":"29.00"}},"mm",null,"Dans la pièce, au diamètre particulier",{"$f":"Empilage!AA$37","v":{"v":29,"d":"29.00"}},"mm",null,"Dans la pièce, au diamètre particulier",{"$f":"Empilage!AE$37","v":{"v":29,"d":"29.00"}},"mm",null,"Dans la pièce, au diamètre particulier",{"$f":"Empilage!AI$37","v":{"v":29,"d":"29.00"}},"mm",null,"Dans la pièce, au diamètre particulier",{"$f":"Empilage!AM$37","v":{"v":29,"d":"29.00"}},"mm"]
[null,"Déformée axiale",{"$f":"Empilage!C50*10^-5*Empilage!C33","v":{"v":-0.13154988756000002,"d":"-0.132"}},"mm",null,"Déformée axiale",{"$f":"Empilage!G50*10^-5*Empilage!G33","v":{"v":-0.13154988756000002,"d":"-0.132"}},"mm",null,"Déformée axiale",{"$f":"Empilage!K50*10^-5*Empilage!K33","v":{"v":-0.13154988756000002,"d":"-0.132"}},"mm",null,"Déformée axiale",{"$f":"Empilage!O50*10^-5*Empilage!O33","v":{"v":-0.13154988756000002,"d":"-0.132"}},"mm",null,"Déformée axiale",{"$f":"Empilage!S50*10^-5*Empilage!S33","v":{"v":-0.13154988756000002,"d":"-0.132"}},"mm",null,"Déformée axiale",{"$f":"Empilage!W50*10^-5*Empilage!W33","v":{"v":-0.13154988756000002,"d":"-0.132"}},"mm",null,"Déformée axiale",{"$f":"Empilage!AA50*10^-5*Empilage!AA33","v":{"v":-0.13154988756000002,"d":"-0.132"}},"mm",null,"Déformée axiale",{"$f":"Empilage!AE50*10^-5*Empilage!AE33","v":{"v":-0.13154988756000002,"d":"-0.132"}},"mm",null,"Déformée axiale",{"$f":"Empilage!AI50*10^-5*Empilage!AI33","v":{"v":-0.13154988756000002,"d":"-0.132"}},"mm",null,"Déformée axiale",{"$f":"Empilage!AM50*10^-5*Empilage!AM33","v":{"v":-0.13154988756000002,"d":"-0.132"}},"mm"]
[null,"Déformée radiale",{"$f":"Empilage!C50*10^-5*C197","v":{"v":-0.0723898812,"d":"-0.072"}},"mm",null,"Déformée radiale",{"$f":"Empilage!G50*10^-5*G197","v":{"v":-0.0723898812,"d":"-0.072"}},"mm",null,"Déformée radiale",{"$f":"Empilage!K50*10^-5*K197","v":{"v":-0.0723898812,"d":"-0.072"}},"mm",null,"Déformée radiale",{"$f":"Empilage!O50*10^-5*O197","v":{"v":-0.0723898812,"d":"-0.072"}},"mm",null,"Déformée radiale",{"$f":"Empilage!S50*10^-5*S197","v":{"v":-0.0723898812,"d":"-0.072"}},"mm",null,"Déformée radiale",{"$f":"Empilage!W50*10^-5*W197","v":{"v":-0.0723898812,"d":"-0.072"}},"mm",null,"Déformée radiale",{"$f":"Empilage!AA50*10^-5*AA197","v":{"v":-0.0723898812,"d":"-0.072"}},"mm",null,"Déformée radiale",{"$f":"Empilage!AE50*10^-5*AE197","v":{"v":-0.0723898812,"d":"-0.072"}},"mm",null,"Déformée radiale",{"$f":"Empilage!AI50*10^-5*AI197","v":{"v":-0.0723898812,"d":"-0.072"}},"mm",null,"Déformée radiale",{"$f":"Empilage!AM50*10^-5*AM197","v":{"v":-0.0723898812,"d":"-0.072"}},"mm"]
[null,"Effet de la thermique seule en fonctionnement",{"$nulls":3},"Effet de la thermique seule en fonctionnement",{"$nulls":3},"Effet de la thermique seule en fonctionnement",{"$nulls":3},"Effet de la thermique seule en fonctionnement",{"$nulls":3},"Effet de la thermique seule en fonctionnement",{"$nulls":3},"Effet de la thermique seule en fonctionnement",{"$nulls":3},"Effet de la thermique seule en fonctionnement",{"$nulls":3},"Effet de la thermique seule en fonctionnement",{"$nulls":3},"Effet de la thermique seule en fonctionnement",{"$nulls":3},"Effet de la thermique seule en fonctionnement"]
[]
[null,"Au niveau du frettage",{"$nulls":3},"Au niveau du frettage",{"$nulls":3},"Au niveau du frettage",{"$nulls":3},"Au niveau du frettage",{"$nulls":3},"Au niveau du frettage",{"$nulls":3},"Au niveau du frettage",{"$nulls":3},"Au niveau du frettage",{"$nulls":3},"Au niveau du frettage",{"$nulls":3},"Au niveau du frettage",{"$nulls":3},"Au niveau du frettage"]
[null,"Déformée axiale",{"$f":"Empilage!C51*10^-5*Empilage!C33","v":{"v":-0.10572718268,"d":"-0.106"}},"mm",null,"Déformée axiale",{"$f":"Empilage!G51*10^-5*Empilage!G33","v":{"v":-0.10572718268,"d":"-0.106"}},"mm",null,"Déformée axiale",{"$f":"Empilage!K51*10^-5*Empilage!K33","v":{"v":-0.10572718268,"d":"-0.106"}},"mm",null,"Déformée axiale",{"$f":"Empilage!O51*10^-5*Empilage!O33","v":{"v":-0.10572718268,"d":"-0.106"}},"mm",null,"Déformée axiale",{"$f":"Empilage!S51*10^-5*Empilage!S33","v":{"v":-0.10572718268,"d":"-0.106"}},"mm",null,"Déformée axiale",{"$f":"Empilage!W51*10^-5*Empilage!W33","v":{"v":-0.10572718268,"d":"-0.106"}},"mm",null,"Déformée axiale",{"$f":"Empilage!AA51*10^-5*Empilage!AA33","v":{"v":-0.10572718268,"d":"-0.106"}},"mm",null,"Déformée axiale",{"$f":"Empilage!AE51*10^-5*Empilage!AE33","v":{"v":-0.10572718268,"d":"-0.106"}},"mm",null,"Déformée axiale",{"$f":"Empilage!AI51*10^-5*Empilage!AI33","v":{"v":-0.10572718268,"d":"-0.106"}},"mm",null,"Déformée axiale",{"$f":"Empilage!AM51*10^-5*Empilage!AM33","v":{"v":-0.10572718268,"d":"-0.106"}},"mm"]
[null,"Déformée radiale",{"$f":"Empilage!C51*10^-5*Empilage!C36","v":{"v":-0.05015521,"d":"-0.050"}},"mm",null,"Déformée radiale",{"$f":"Empilage!G51*10^-5*Empilage!G36","v":{"v":-0.05015521,"d":"-0.050"}},"mm",null,"Déformée radiale",{"$f":"Empilage!K51*10^-5*Empilage!K36","v":{"v":-0.05015521,"d":"-0.050"}},"mm",null,"Déformée radiale",{"$f":"Empilage!O51*10^-5*Empilage!O36","v":{"v":-0.05015521,"d":"-0.050"}},"mm",null,"Déformée radiale",{"$f":"Empilage!S51*10^-5*Empilage!S36","v":{"v":-0.05015521,"d":"-0.050"}},"mm",null,"Déformée radiale",{"$f":"Empilage!W51*10^-5*Empilage!W36","v":{"v":-0.05015521,"d":"-0.050"}},"mm",null,"Déformée radiale",{"$f":"Empilage!AA51*10^-5*Empilage!AA36","v":{"v":-0.05015521,"d":"-0.050"}},"mm",null,"Déformée radiale",{"$f":"Empilage!AE51*10^-5*Empilage!AE36","v":{"v":-0.05015521,"d":"-0.050"}},"mm",null,"Déformée radiale",{"$f":"Empilage!AI51*10^-5*Empilage!AI36","v":{"v":-0.05015521,"d":"-0.050"}},"mm",null,"Déformée radiale",{"$f":"Empilage!AM51*10^-5*Empilage!AM36","v":{"v":-0.05015521,"d":"-0.050"}},"mm"]
[null,"Dans la pièce, au diamètre particulier",{"$f":"Empilage!C$37","v":{"v":29,"d":"29.00"}},"mm",null,"Dans la pièce, au diamètre particulier",{"$f":"Empilage!G$37","v":{"v":29,"d":"29.00"}},"mm",null,"Dans la pièce, au diamètre particulier",{"$f":"Empilage!K$37","v":{"v":29,"d":"29.00"}},"mm",null,"Dans la pièce, au diamètre particulier",{"$f":"Empilage!O$37","v":{"v":29,"d":"29.00"}},"mm",null,"Dans la pièce, au diamètre particulier",{"$f":"Empilage!S$37","v":{"v":29,"d":"29.00"}},"mm",null,"Dans la pièce, au diamètre particulier",{"$f":"Empilage!W$37","v":{"v":29,"d":"29.00"}},"mm",null,"Dans la pièce, au diamètre particulier",{"$f":"Empilage!AA$37","v":{"v":29,"d":"29.00"}},"mm",null,"Dans la pièce, au diamètre particulier",{"$f":"Empilage!AE$37","v":{"v":29,"d":"29.00"}},"mm",null,"Dans la pièce, au diamètre particulier",{"$f":"Empilage!AI$37","v":{"v":29,"d":"29.00"}},"mm",null,"Dans la pièce, au diamètre particulier",{"$f":"Empilage!AM$37","v":{"v":29,"d":"29.00"}},"mm"]
[null,"Déformée axiale",{"$f":"Empilage!C51*10^-5*Empilage!C33","v":{"v":-0.10572718268,"d":"-0.106"}},"mm",null,"Déformée axiale",{"$f":"Empilage!G51*10^-5*Empilage!G33","v":{"v":-0.10572718268,"d":"-0.106"}},"mm",null,"Déformée axiale",{"$f":"Empilage!K51*10^-5*Empilage!K33","v":{"v":-0.10572718268,"d":"-0.106"}},"mm",null,"Déformée axiale",{"$f":"Empilage!O51*10^-5*Empilage!O33","v":{"v":-0.10572718268,"d":"-0.106"}},"mm",null,"Déformée axiale",{"$f":"Empilage!S51*10^-5*Empilage!S33","v":{"v":-0.10572718268,"d":"-0.106"}},"mm",null,"Déformée axiale",{"$f":"Empilage!W51*10^-5*Empilage!W33","v":{"v":-0.10572718268,"d":"-0.106"}},"mm",null,"Déformée axiale",{"$f":"Empilage!AA51*10^-5*Empilage!AA33","v":{"v":-0.10572718268,"d":"-0.106"}},"mm",null,"Déformée axiale",{"$f":"Empilage!AE51*10^-5*Empilage!AE33","v":{"v":-0.10572718268,"d":"-0.106"}},"mm",null,"Déformée axiale",{"$f":"Empilage!AI51*10^-5*Empilage!AI33","v":{"v":-0.10572718268,"d":"-0.106"}},"mm",null,"Déformée axiale",{"$f":"Empilage!AM51*10^-5*Empilage!AM33","v":{"v":-0.10572718268,"d":"-0.106"}},"mm"]
[null,"Déformée radiale",{"$f":"Empilage!C51*10^-5*C205","v":{"v":-0.058180043599999995,"d":"-0.058"}},"mm",null,"Déformée radiale",{"$f":"Empilage!G51*10^-5*G205","v":{"v":-0.058180043599999995,"d":"-0.058"}},"mm",null,"Déformée radiale",{"$f":"Empilage!K51*10^-5*K205","v":{"v":-0.058180043599999995,"d":"-0.058"}},"mm",null,"Déformée radiale",{"$f":"Empilage!O51*10^-5*O205","v":{"v":-0.058180043599999995,"d":"-0.058"}},"mm",null,"Déformée radiale",{"$f":"Empilage!S51*10^-5*S205","v":{"v":-0.058180043599999995,"d":"-0.058"}},"mm",null,"Déformée radiale",{"$f":"Empilage!W51*10^-5*W205","v":{"v":-0.058180043599999995,"d":"-0.058"}},"mm",null,"Déformée radiale",{"$f":"Empilage!AA51*10^-5*AA205","v":{"v":-0.058180043599999995,"d":"-0.058"}},"mm",null,"Déformée radiale",{"$f":"Empilage!AE51*10^-5*AE205","v":{"v":-0.058180043599999995,"d":"-0.058"}},"mm",null,"Déformée radiale",{"$f":"Empilage!AI51*10^-5*AI205","v":{"v":-0.058180043599999995,"d":"-0.058"}},"mm",null,"Déformée radiale",{"$f":"Empilage!AM51*10^-5*AM205","v":{"v":-0.058180043599999995,"d":"-0.058"}},"mm"]

{"sheet":"Matériaux","index":3,"n_rows":60,"n_cols":28,"rows_kept":60,"merged":[[0,0,0,2],[0,7,1,7],[0,8,1,8],[0,9,1,9],[0,15,1,15],[0,16,1,16],[0,17,1,17],[0,18,1,18],[0,19,1,19],[0,25,1,25],[0,26,1,26],[0,27,1,27],[2,3,2,6],[2,10,2,14],[2,20,2,24],[16,1,16,2],[17,1,17,2],[18,1,18,2],[24,1,24,3]]}
["Propriétés matériaux",{"$nulls":6},"Module d'Young Montage (daN/mm²)","Module d'Young MeF (daN/mm²)","Module d'Young Fonctionnemment (daN/mm²)",{"$nulls":5},"Coefficient de dilatation thermique Montage (mm)","Coefficient de dilatation thermique MeF (mm)","Coefficient de dilatation thermique Fonctionnement (mm)","Coefficient de poisson","Masse volumique",{"$nulls":5},"Re 0.2% Montage (daN/mm²)","Re 0.2% MeF (daN/mm²)","Re 0.2% Fonctionnement (daN/mm²)"]
[]
[{"$nulls":3},"Polynômes",{"$nulls":6},"Polynômes",{"$nulls":9},"Polynômes"]
[null,null,"1 - none",0,0,0,0,0,0,0,0,0,0,0,0,0,0,0,0,0,0,0,0,0,0,0,0,0]
[null,null,"2 - Ube2",134.35,-0.0172,{"v":-4e-06,"d":"-4.00E-06"},{"v":0,"d":"0.00E+00"},{"$f":"(D5+E5*D17+F5*D17^2+G5*D17^3)*10^2","v":{"v":12896.700399999998,"d":"12897"}},{"$f":"(D5+E5*D18+F5*D18^2+G5*D18^3)*10^2","v":{"v":13400.44,"d":"13400"}},{"$f":"(D5+E5*D19+F5*D19^2+G5*D19^3)*10^2","v":{"v":13276.96,"d":"13277"}},{"$f":"10.408*10^-6","v":1.0408e-05},{"$f":"0.0624*10^-6","v":6.239999999999999E-8},{"$f":"-0.0002*10^-6","v":-2e-10},{"$f":"0.0000002*10^-6","v":{"v":1.9999999999999998E-13,"d":"2.00E-13"}},{"$f":"-0.00000000002*10^-6","v":{"v":-1.9999999999999998E-17,"d":"-2.00E-17"}},{"$f":"(K5+L5*D17+M5*D17^2+N5*D17^3+O5*D17^4)*($D$17-293)*100000","v":{"v":0,"d":"0.00"}},{"$f":"(K5+L5*D18+M5*D18^2+N5*D18^3+O5*D18^4)*($D$18-293)*100000","v":{"v":-316.06839263999996,"d":"-316.07"}},{"$f":"(K5+L5*D19+M5*D19^2+N5*D19^3+O5*D19^4)*($D$19-293)*100000","v":{"v":-295.33430233999997,"d":"-295.33"}},0.27,8250,115.22,-0.1132,1E-4,{"v":-3e-07,"d":"-3.00E-07"},{"v":0,"d":"0.00E+00"},{"$f":"(U5+V5*D17+W5*D17^2+X5*D17^3+Y5*D17^4)/10","v":{"v":8.30911729,"d":"8.3"}},{"$f":"(U5+V5*D18+W5*D18^2+X5*D18^3+Y5*D18^4)/10","v":{"v":11.299360000000002,"d":"11.3"}},{"$f":"(U5+V5*D19+W5*D19^2+X5*D19^3+Y5*D19^4)/10","v":{"v":10.56233,"d":"10.6"}}]
[null,null,"3 - Inconel 718",{"v":221240,"d":"2.21E+05"},{"v":-43.6,"d":"-4.36E+01"},{"v":-0.02,"d":"-2.00E-02"},{"v":0,"d":"0.00E+00"},{"$f":"(D6+E6*D17+F6*D17^2+G6*D17^3)/10","v":{"v":20674.822,"d":"20675"}},{"$f":"(D6+E6*D18+F6*D18^2+G6*D18^3)/10","v":22036},{"$f":"(D6+E6*D19+F6*D19^2+G6*D19^3)/10","v":{"v":21715.4,"d":"21715"}},{"v":8.9252e-06,"d":"8.93E-06"},{"v":1.1e-08,"d":"1.10E-08"},{"v":-4e-12,"d":"-4.00E-12"},{"v":0,"d":"0.00E+00"},{"v":0,"d":"0.00E+00"},{"$f":"(K6+L6*D17+M6*D17^2+N6*D17^3)*($D$17-293)*100000","v":{"v":0,"d":"0.00"}},{"$f":"(K6+L6*D18+M6*D18^2+N6*D18^3)*($D$18-293)*100000","v":{"v":-249.62028,"d":"-249.62"}},{"$f":"(K6+L6*D19+M6*D19^2+N6*D19^3)*($D$19-293)*100000","v":{"v":-200.62084,"d":"-200.62"}},{"v":0.2795269411764706,"d":"0.28"},8260,{"v":1282.5,"d":"1.28E+03"},{"v":-1.5304,"d":"-1.53E+00"},{"v":0.0026,"d":"2.60E-03"},{"v":-2e-06,"d":"-2.00E-06"},{"v":0,"d":"0.00E+00"},{"$f":"(U6+V6*D17+W6*D17^2+X6*D17^3)/10","v":{"v":100.6992686,"d":"100.7"}},{"$f":"(U6+V6*D18+W6*D18^2+X6*D18^3)/10","v":{"v":125.29159999999999,"d":"125.3"}},{"$f":"(U6+V6*D19+W6*D19^2+X6*D19^3)/10","v":{"v":116.4366,"d":"116.4"}}]
[null,null,"4 - Ta6V-ELI",{"v":122698,"d":"1.23E+05"},{"v":8.2329,"d":"8.23E+00"},{"v":-0.0879,"d":"-8.79E-02"},{"v":4e-05,"d":"4.00E-05"},{"$f":"(D7+E7*D17+F7*D17^2+G7*D17^3)/10","v":{"v":11857.026288000001,"d":"11857"}},{"$f":"(D7+E7*D18+F7*D18^2+G7*D18^3)/10","v":{"v":12282.7818,"d":"12283"}},{"$f":"(D7+E7*D19+F7*D19^2+G7*D19^3)/10","v":{"v":12275.613099999999,"d":"12276"}},{"v":6.3411e-06,"d":"6.341E-06"},{"v":1.21e-08,"d":"1.210E-08"},{"v":-2e-11,"d":"-2.000E-11"},{"v":8e-15,"d":"8.000E-15"},{"v":0,"d":"0.000E+00"},{"$f":"(K7+L7*D17+M7*D17^2+N7*D17^3)*($D$17-293)*100000","v":{"v":0,"d":"0.00"}},{"$f":"(K7+L7*D18+M7*D18^2+N7*D18^3)*($D$18-293)*100000","v":{"v":-179.50197720000003,"d":"-179.50"}},{"$f":"(K7+L7*D19+M7*D19^2+N7*D19^3)*($D$19-293)*100000","v":{"v":-147.6608196,"d":"-147.66"}},0.32,4450,{"v":1477.4,"d":"1.477E+03"},{"v":-1.5639,"d":"-1.564E+00"},{"v":-0.0029,"d":"-2.900E-03"},{"v":0,"d":"0.000E+00"},{"v":0,"d":"0.000E+00"},{"$f":"(U7+V7*D17+W7*D17^2+X7*D17^3)/10","v":{"v":77.02152000000001,"d":"77.0"}},{"$f":"(U7+V7*D18+W7*D18^2+X7*D18^3)/10","v":{"v":144.4962,"d":"144.5"}},{"$f":"(U7+V7*D19+W7*D19^2+X7*D19^3)/10","v":{"v":131.3159,"d":"131.3"}}]
[null,null,"5 - AS7G0,6",{"v":77335,"d":"7.73E+04"},{"v":-55.7,"d":"-5.57E+01"},{"v":0.3,"d":"3.00E-01"},{"v":-0.0005,"d":"-5.00E-04"},{"$f":"(D8+E8*D17+F8*D17^2+G8*D17^3)/10","v":{"v":7419.27215,"d":"7419"}},{"$f":"(D8+E8*D18+F8*D18^2+G8*D18^3)/10","v":{"v":7633.7,"d":"7634"}},{"$f":"(D8+E8*D19+F8*D19^2+G8*D19^3)/10","v":{"v":7438.75,"d":"7439"}},{"v":1.35e-05,"d":"1.35E-05"},{"v":4.07E-8,"d":"4.07E-08"},{"v":-5e-11,"d":"-5.00E-11"},{"v":0,"d":"0.00E+00"},{"v":0,"d":"0.00E+00"},{"$f":"(K8+L8*D17+M8*D17^2+N8*D17^3)*($D$17-293)*100000","v":{"v":0,"d":"0.00"}},{"$f":"(K8+L8*D18+M8*D18^2+N8*D18^3)*($D$18-293)*100000","v":{"v":-390.22619999999995,"d":"-390.23"}},{"$f":"(K8+L8*D19+M8*D19^2+N8*D19^3)*($D$19-293)*100000","v":{"v":-340.18739999999997,"d":"-340.19"}},0.3,2700,{"v":319.42,"d":"3.19E+02"},{"v":-0.4793,"d":"-4.79E-01"},{"v":0.0004,"d":"4.00E-04"},{"v":0,"d":"0.00E+00"},{"v":0,"d":"0.00E+00"},{"$f":"(U8+V8*D17+W8*D17^2+X8*D17^3)/10","v":{"v":21.33247,"d":"21.3"}},{"$f":"(U8+V8*D18+W8*D18^2+X8*D18^3)/10","v":{"v":30.9994,"d":"31.0"}},{"$f":"(U8+V8*D19+W8*D19^2+X8*D19^3)/10","v":{"v":27.9523,"d":"28.0"}}]
[null,null,"6 - Z2CN18-10",{"$f":"202.46*10^3","v":{"v":202460,"d":"2.02E+05"}},{"$f":"-0.013*10^3","v":{"v":-13,"d":"-1.30E+01"}},{"$f":"-0.00005*10^3","v":{"v":-0.05,"d":"-5.00E-02"}},{"v":0,"d":"0.00E+00"},{"$f":"(D9+E9*D17+F9*D17^2+G9*D17^3)/10","v":{"v":19435.855,"d":"19436"}},{"$f":"(D9+E9*D18+F9*D18^2+G9*D18^3)/10","v":20218},{"$f":"(D9+E9*D19+F9*D19^2+G9*D19^3)/10","v":{"v":20088.5,"d":"20089"}},{"$f":"11.38*10^-6","v":{"v":1.138e-05,"d":"1.14E-05"}},{"$f":"0.0164*10^-6","v":{"v":1.64e-08,"d":"1.64E-08"}},{"$f":"-0.000009*10^-6","v":{"v":-9e-12,"d":"-9.00E-12"}},{"v":0,"d":"0.00E+00"},{"v":0,"d":"0.00E+00"},{"$f":"(K9+L9*D17+M9*D17^2+N9*D17^3)*($D$17-293)*100000","v":{"v":0,"d":"0.00"}},{"$f":"(K9+L9*D18+M9*D18^2+N9*D18^3)*($D$18-293)*100000","v":{"v":-319.53012,"d":"-319.53"}},{"$f":"(K9+L9*D19+M9*D19^2+N9*D19^3)*($D$19-293)*100000","v":{"v":-259.49693,"d":"-259.50"}},0.27,7900,{"v":373.13,"d":"3.73E+02"},{"v":-0.1967,"d":"-1.97E-01"},{"v":-0.0031,"d":"-3.10E-03"},{"v":5e-06,"d":"5.00E-06"},{"v":0,"d":"0.00E+00"},{"$f":"(U9+V9*D17+W9*D17^2+X9*D17^3)/10","v":{"v":17.5133785,"d":"17.5"}},{"$f":"(U9+V9*D18+W9*D18^2+X9*D18^3)/10","v":{"v":36.7996,"d":"36.8"}},{"$f":"(U9+V9*D19+W9*D19^2+X9*D19^3)/10","v":{"v":33.3962,"d":"33.4"}}]
[null,null,"7 - EZ6NCT25-15",{"v":206663,"d":"2.07E+05"},{"v":-25.196,"d":"-2.52E+01"},{"v":-0.0289,"d":"-2.89E-02"},{"v":-1e-05,"d":"-1.00E-05"},{"$f":"(D10+E10*D17+F10*D17^2+G10*D17^3)/10","v":{"v":19654.799833,"d":"19655"}},{"$f":"(D10+E10*D18+F10*D18^2+G10*D18^3)/10","v":{"v":20614.744,"d":"20615"}},{"$f":"(D10+E10*D19+F10*D19^2+G10*D19^3)/10","v":{"v":20415.397999999997,"d":"20415"}},{"v":1.168E-5,"d":"1.17E-05"},{"v":1.25e-08,"d":"1.25E-08"},{"v":-6e-12,"d":"-6.00E-12"},{"v":0,"d":"0.00E+00"},{"v":0,"d":"0.00E+00"},{"$f":"(K10+L10*D17+M10*D17^2+N10*D17^3)*($D$17-293)*100000","v":{"v":0,"d":"0.00"}},{"$f":"(K10+L10*D18+M10*D18^2+N10*D18^3)*($D$18-293)*100000","v":{"v":-325.62348,"d":"-325.62"}},{"$f":"(K10+L10*D19+M10*D19^2+N10*D19^3)*($D$19-293)*100000","v":{"v":-258.95492,"d":"-258.95"}},{"v":0.306,"d":"0.31"},7910,{"v":843.54,"d":"8.44E+02"},{"v":-1.0246,"d":"-1.02E+00"},{"v":0.0009,"d":"9.00E-04"},{"v":1e-06,"d":"1.00E-06"},{"v":-1e-09,"d":"-1.00E-09"},{"$f":"(U10+V10*D17+W10*D17^2+X10*D17^3)/10","v":{"v":64.5750057,"d":"64.6"}},{"$f":"(U10+V10*D18+W10*D18^2+X10*D18^3)/10","v":{"v":82.3416,"d":"82.3"}},{"$f":"(U10+V10*D19+W10*D19^2+X10*D19^3)/10","v":{"v":75.9345,"d":"75.9"}}]
[null,null,"8 - SUPER WASPALOY",{"v":235290,"d":"2.35E+05"},{"v":-63.7,"d":"-6.37E+01"},{"v":-0.006,"d":"-6.00E-03"},{"v":3e-06,"d":"3.00E-06"},{"$f":"(D11+E11*D17+F11*D17^2+G11*D17^3)/10","v":{"v":21618.6267271,"d":"21619"}},{"$f":"(D11+E11*D18+F11*D18^2+G11*D18^3)/10","v":{"v":23401.3624,"d":"23401"}},{"$f":"(D11+E11*D19+F11*D19^2+G11*D19^3)/10","v":{"v":22951.0587,"d":"22951"}},{"v":9.2952e-06,"d":"9.30E-06"},{"v":8.9e-09,"d":"8.90E-09"},{"v":-3e-12,"d":"-3.00E-12"},{"v":0,"d":"0.00E+00"},{"v":0,"d":"0.00E+00"},{"$f":"(K11+L11*D17+M11*D17^2+N11*D17^3)*($D$17-293)*100000","v":{"v":0,"d":"0.00"}},{"$f":"(K11+L11*D18+M11*D18^2+N11*D18^3)*($D$18-293)*100000","v":{"v":-258.58560000000006,"d":"-258.59"}},{"$f":"(K11+L11*D19+M11*D19^2+N11*D19^3)*($D$19-293)*100000","v":{"v":-204.45956999999999,"d":"-204.46"}},0.33,8250,{"v":1324,"d":"1.32E+03"},{"v":-2.0746,"d":"-2.07E+00"},{"v":0.0039,"d":"3.90E-03"},{"v":-3e-06,"d":"-3.00E-06"},{"v":0,"d":"0.00E+00"},{"$f":"(U11+V11*D17+W11*D17^2+X11*D17^3)/10","v":{"v":97.54920289999998,"d":"97.5"}},{"$f":"(U11+V11*D18+W11*D18^2+X11*D18^3)/10","v":{"v":128.4044,"d":"128.4"}},{"$f":"(U11+V11*D19+W11*D19^2+X11*D19^3)/10","v":{"v":116.66890000000001,"d":"116.7"}}]
[null,null,"9 - EZ100CD17",{"v":217317,"d":"2.17E+05"},{"v":-69.311,"d":"-6.93E+01"},{"v":0.172,"d":"1.72E-01"},{"v":0,"d":"0.00E+00"},{"$f":"(D12+E12*D17+F12*D17^2+G12*D17^3)/10","v":{"v":21177.4905,"d":"21177"}},{"$f":"(D12+E12*D18+F12*D18^2+G12*D18^3)/10","v":{"v":21599.958,"d":"21600"}},{"$f":"(D12+E12*D19+F12*D19^2+G12*D19^3)/10","v":{"v":21247.221,"d":"21247"}},{"v":6.4706e-06,"d":"6.47E-06"},{"v":1.95e-08,"d":"1.95E-08"},{"v":-4e-11,"d":"-4.00E-11"},{"v":2E-14,"d":"2.00E-14"},{"v":0,"d":"0.00E+00"},{"$f":"(K12+L12*D17+M12*D17^2+N12*D17^3)*($D$17-293)*100000","v":{"v":0,"d":"0.00"}},{"$f":"(K12+L12*D18+M12*D18^2+N12*D18^3)*($D$18-293)*100000","v":{"v":-186.861948,"d":"-186.86"}},{"$f":"(K12+L12*D19+M12*D19^2+N12*D19^3)*($D$19-293)*100000","v":{"v":-160.698454,"d":"-160.70"}},{"v":0.284,"d":"0.28"},7700,{"v":1616.1,"d":"1.62E+03"},{"v":-0.2629,"d":"-2.63E-01"},{"v":-1.4E-3,"d":"-1.40E-03"},{"v":0,"d":"0.00E+00"},{"v":0,"d":"0.00E+00"},{"$f":"(U12+V12*D17+W12*D17^2+X12*D17^3)/10","v":{"v":141.88817,"d":"141.9"}},{"$f":"(U12+V12*D18+W12*D18^2+X12*D18^3)/10","v":{"v":161.0282,"d":"161.0"}},{"$f":"(U12+V12*D19+W12*D19^2+X12*D19^3)/10","v":{"v":158.10989999999998,"d":"158.1"}}]
[null,null,"10 - EZ5CNU17-4(17-4PH)",{"v":206260,"d":"2.06E+05"},{"v":-2.1,"d":"-2.10E+00"},{"v":-0.07,"d":"-7.00E-02"},{"v":0,"d":"0.00E+00"},{"$f":"(D13+E13*D17+F13*D17^2+G13*D17^3)/10","v":{"v":19963.527000000002,"d":"19964"}},{"$f":"(D13+E13*D18+F13*D18^2+G13*D18^3)/10","v":20619},{"$f":"(D13+E13*D19+F13*D19^2+G13*D19^3)/10","v":{"v":20550.4,"d":"20550"}},{"v":6.423e-06,"d":"6.42E-06"},{"v":3.43e-08,"d":"3.43E-08"},{"v":-8e-11,"d":"-8.00E-11"},{"v":9e-14,"d":"9.00E-14"},{"v":-4e-17,"d":"-4.00E-17"},{"$f":"(K13+L13*D17+M13*D17^2+N13*D17^3+O13*D17^4)*($D$17-293)*100000","v":{"v":0,"d":"0.00"}},{"$f":"(K13+L13*D18+M13*D18^2+N13*D18^3+O13*D18^4)*($D$18-293)*100000","v":{"v":-193.22158128,"d":"-193.22"}},{"$f":"(K13+L13*D19+M13*D19^2+N13*D19^3+O13*D19^4)*($D$19-293)*100000","v":{"v":-181.17720768000004,"d":"-181.18"}},0.27,7800,{"v":2332.9,"d":"2.33E+03"},{"v":-7.2497,"d":"-7.25E+00"},{"v":0.0127,"d":"1.27E-02"},{"v":-8e-06,"d":"-8.00E-06"},{"v":-4e-17,"d":"-4.00E-17"},{"$f":"(U13+V13*D17+W13*D17^2+X13*D17^3+Y13*D17^4)/10","v":{"v":109.7790143705198,"d":"109.8"}},{"$f":"(U13+V13*D18+W13*D18^2+X13*D18^3+Y13*D18^4)/10","v":{"v":219.29219999999935,"d":"219.3"}},{"$f":"(U13+V13*D19+W13*D19^2+X13*D19^3+Y13*D19^4)/10","v":{"v":177.74649999973755,"d":"177.7"}}]
[null,null,"11 - Monel K500",{"v":184460,"d":"1.84E+05"},{"v":-18.8,"d":"-1.88E+01"},{"v":0.01,"d":"1.00E-02"},{"v":-3e-05,"d":"-3.00E-05"},{"$f":"(D14+E14*D17+F14*D17^2+G14*D17^3)/10","v":{"v":17905.547729,"d":"17906"}},{"$f":"(D14+E14*D18+F14*D18^2+G14*D18^3)/10","v":{"v":18408.776,"d":"18409"}},{"$f":"(D14+E14*D19+F14*D19^2+G14*D19^3)/10","v":{"v":18282.713,"d":"18283"}},{"v":8.7038e-06,"d":"8.70E-06"},{"v":3.7E-8,"d":"3.70E-08"},{"v":-9e-11,"d":"-9.00E-11"},{"v":9e-14,"d":"9.00E-14"},{"v":-3e-17,"d":"-3.00E-17"},{"$f":"(K14+L14*D17+M14*D17^2+N14*D17^3+O14*D17^4)*($D$17-293)*100000","v":{"v":0,"d":"0.00"}},{"$f":"(K14+L14*D18+M14*D18^2+N14*D18^3+O14*D18^4)*($D$18-293)*100000","v":{"v":-256.85246495999996,"d":"-256.85"}},{"$f":"(K14+L14*D19+M14*D19^2+N14*D19^3+O14*D19^4)*($D$19-293)*100000","v":{"v":-230.77936651000002,"d":"-230.78"}},0.32,8330,{"v":901.93,"d":"9.02E+02"},{"v":-0.6546,"d":"-6.55E-01"},{"v":-0.0017,"d":"-1.70E-03"},{"v":6e-06,"d":"6.00E-06"},{"v":-4e-09,"d":"-4.00E-09"},{"$f":"(U14+V14*D17+W14*D17^2+X14*D17^3+Y14*D17^4)/10","v":{"v":68.5631238796,"d":"68.6"}},{"$f":"(U14+V14*D18+W14*D18^2+X14*D18^3+Y14*D18^4)/10","v":{"v":88.820536,"d":"88.8"}},{"$f":"(U14+V14*D19+W14*D19^2+X14*D19^3+Y14*D19^4)/10","v":{"v":83.335756,"d":"83.3"}}]
[null,null,"12 - PERSO",{"v":0,"d":"0.00E+00"},{"v":0,"d":"0.00E+00"},{"v":0,"d":"0.00E+00"},{"v":0,"d":"0.00E+00"},{"$f":"(D15+E15*D17+F15*D17^2+G15*D17^3)/10","v":0},{"$f":"(D15+E15*D18+F15*D18^2+G15*D18^3)","v":0},{"$f":"(D15+E15*D19+F15*D19^2+G15*D19^3)/10","v":0},{"v":0,"d":"0.00E+00"},{"v":0,"d":"0.00E+00"},{"v":0,"d":"0.00E+00"},{"v":0,"d":"0.00E+00"},{"v":0,"d":"0.00E+00"},{"$f":"(K15+L15*D17+M15*D17^2+N15*D17^3)*($D$17-293)*100000","v":{"v":0,"d":"0.00"}},{"$f":"(K15+L15*D18+M15*D18^2+N15*D18^3)*($D$18-293)*100000","v":{"v":0,"d":"0.00"}},{"$f":"(K15+L15*D19+M15*D19^2+N15*D19^3)*($D$19-293)*100000","v":{"v":0,"d":"0.00"}},0,0,{"v":0,"d":"0.00E+00"},{"v":0,"d":"0.00E+00"},{"v":0,"d":"0.00E+00"},{"v":0,"d":"0.00E+00"},{"v":0,"d":"0.00E+00"},{"$f":"(U15+V15*D17+W15*D17^2+X15*D17^3)/10","v":{"v":0,"d":"0.0"}},{"$f":"(U15+V15*D18+W15*D18^2+X15*D18^3)/10","v":{"v":0,"d":"0.0"}},{"$f":"(U15+V15*D19+W15*D19^2+X15*D19^3)","v":{"v":0,"d":"0.0"}}]
[]
[null,"Température Montage (K)",null,{"$f":"Empilage!D94","v":293}]
[null,"Température MeF (K)",null,{"$f":"Empilage!D95","v":20}]
[null,"Température Fonctionnement (K)",null,{"$f":"Empilage!D96","v":90}]
[]
[null,"Les polynomes peuvent avoir un nombre de termes différents selon les matériaux de sorte à approcher au mieux la valeur vraie."]
[]
[null,"Données matériaux MVision mis à jour le 16 Juin 2015"]
[]
[null,"Démarche pour le matériau perso"]
[]
[null,"Calcul des polynômes à intégrer dans le tableau ci-dessus pour un matériaux PERSO :"]
[]
[null,"Ces calculs doivent être effectué avec les données issues de Mvision où l'on peut récupérer des plages de données"]
[]
[null,"Température","Coefficient"]
[null,20]
[null,30]
[null,40]
[null,50]
[null,60]
[null,70]
[null,80]
[null,90]
[null,100]
[null,110]
[null,120]
[null,130]
[null,140]
[null,150]
[null,160]
[null,170]
[null,180]
[null,190]
[null,200]
[null,210]
[null,220]
[null,230]
[null,240]
[null,250,null,null,"\"Clic droit\" sur la courbe, \"définir une courbe de tendance\" et polynôme de X degré (au mieux par rapport à la courbe d'origine)"]
[null,260,null,null,"Insérer les coefficient dans les cellules vertes de la ligne \"PERSO\" en respectant l'ordre de gauche à droite avec en premier terme le dernier du polynôme."]
[null,270,null,null,"Ré-itérer l'opération pour tous les coefficient voulu en fonction de la température"]
[null,280,null,null,"Attention au degré du polynôme, si celui-ci est impair il y a un risque de rebroussement"]
[null,290]
[null,300]

{"sheet":"Constantes_de_frettage","index":4,"n_rows":58,"n_cols":14,"rows_kept":58,"merged":[[4,1,4,2],[5,1,5,2],[6,1,6,2],[7,1,7,2],[9,1,9,3],[12,1,12,2],[13,1,13,2],[14,1,14,2],[15,1,15,2],[17,1,17,3],[24,1,24,2],[25,1,25,2],[26,1,26,2],[27,1,27,2],[29,1,29,3],[32,1,32,2],[33,1,33,2],[34,1,34,2],[35,1,35,2],[37,1,37,3],[44,1,44,2],[45,1,45,2],[46,1,46,2],[47,1,47,2],[49,1,49,3],[52,1,52,2],[53,1,53,2],[54,1,54,2],[55,1,55,2],[57,1,57,3]]}
[null,"Constantes de frettage au montage"]
[]
[]
[{"$nulls":4},{"$f":"OFFSET(Empilage!C$11,0,(COLUMN(Constantes_de_frettage!E4)-5)*3)","v":"Pièce mâle"},{"$f":"OFFSET(Empilage!D$11,0,(COLUMN(Constantes_de_frettage!F4)-5)*3)","v":"Pièce mâle"},{"$f":"OFFSET(Empilage!E$11,0,(COLUMN(Constantes_de_frettage!G4)-5)*3)","v":"Pièce mâle"},{"$f":"OFFSET(Empilage!F$11,0,(COLUMN(Constantes_de_frettage!H4)-5)*3)","v":"Pièce mâle"},{"$f":"OFFSET(Empilage!G$11,0,(COLUMN(Constantes_de_frettage!I4)-5)*3)","v":"Pièce mâle"},{"$f":"OFFSET(Empilage!H$11,0,(COLUMN(Constantes_de_frettage!J4)-5)*3)","v":"Pièce mâle"},{"$f":"OFFSET(Empilage!I$11,0,(COLUMN(Constantes_de_frettage!K4)-5)*3)","v":"Pièce mâle"},{"$f":"OFFSET(Empilage!J$11,0,(COLUMN(Constantes_de_frettage!L4)-5)*3)","v":"Pièce mâle"},{"$f":"OFFSET(Empilage!K$11,0,(COLUMN(Constantes_de_frettage!M4)-5)*3)","v":"Pièce mâle"},{"$f":"OFFSET(Empilage!L$11,0,(COLUMN(Constantes_de_frettage!N4)-5)*3)","v":"Pièce mâle"}]
[null,"Module d'Young",null,"daN/mm2",{"$f":"OFFSET(Empilage!C$18,0,(COLUMN(Constantes_de_frettage!E5)-5)*3)","v":20674.822},{"$f":"OFFSET(Empilage!D$18,0,(COLUMN(Constantes_de_frettage!F5)-5)*3)","v":20674.822},{"$f":"OFFSET(Empilage!E$18,0,(COLUMN(Constantes_de_frettage!G5)-5)*3)","v":20674.822},{"$f":"OFFSET(Empilage!F$18,0,(COLUMN(Constantes_de_frettage!H5)-5)*3)","v":20674.822},{"$f":"OFFSET(Empilage!G$18,0,(COLUMN(Constantes_de_frettage!I5)-5)*3)","v":20674.822},{"$f":"OFFSET(Empilage!H$18,0,(COLUMN(Constantes_de_frettage!J5)-5)*3)","v":20674.822},{"$f":"OFFSET(Empilage!I$18,0,(COLUMN(Constantes_de_frettage!K5)-5)*3)","v":20674.822},{"$f":"OFFSET(Empilage!J$18,0,(COLUMN(Constantes_de_frettage!L5)-5)*3)","v":20674.822},{"$f":"OFFSET(Empilage!K$18,0,(COLUMN(Constantes_de_frettage!M5)-5)*3)","v":20674.822},{"$f":"OFFSET(Empilage!L$18,0,(COLUMN(Constantes_de_frettage!N5)-5)*3)","v":20674.822}]
[null,"Coefficient de Poisson",null,"-",{"$f":"OFFSET(Empilage!C$27,0,(COLUMN(Constantes_de_frettage!E6)-5)*3)","v":0.2795269411764706},{"$f":"OFFSET(Empilage!D$27,0,(COLUMN(Constantes_de_frettage!F6)-5)*3)","v":0.2795269411764706},{"$f":"OFFSET(Empilage!E$27,0,(COLUMN(Constantes_de_frettage!G6)-5)*3)","v":0.2795269411764706},{"$f":"OFFSET(Empilage!F$27,0,(COLUMN(Constantes_de_frettage!H6)-5)*3)","v":0.2795269411764706},{"$f":"OFFSET(Empilage!G$27,0,(COLUMN(Constantes_de_frettage!I6)-5)*3)","v":0.2795269411764706},{"$f":"OFFSET(Empilage!H$27,0,(COLUMN(Constantes_de_frettage!J6)-5)*3)","v":0.2795269411764706},{"$f":"OFFSET(Empilage!I$27,0,(COLUMN(Constantes_de_frettage!K6)-5)*3)","v":0.2795269411764706},{"$f":"OFFSET(Empilage!J$27,0,(COLUMN(Constantes_de_frettage!L6)-5)*3)","v":0.2795269411764706},{"$f":"OFFSET(Empilage!K$27,0,(COLUMN(Constantes_de_frettage!M6)-5)*3)","v":0.2795269411764706},{"$f":"OFFSET(Empilage!L$27,0,(COLUMN(Constantes_de_frettage!N6)-5)*3)","v":0.2795269411764706}]
[null,"Diamètre extérieur",null,"mm",{"$f":"OFFSET(Empilage!C$15,0,(COLUMN(Constantes_de_frettage!E7)-5)*3)","v":25},{"$f":"OFFSET(Empilage!D$15,0,(COLUMN(Constantes_de_frettage!F7)-5)*3)","v":25},{"$f":"OFFSET(Empilage!E$15,0,(COLUMN(Constantes_de_frettage!G7)-5)*3)","v":25},{"$f":"OFFSET(Empilage!F$15,0,(COLUMN(Constantes_de_frettage!H7)-5)*3)","v":25},{"$f":"OFFSET(Empilage!G$15,0,(COLUMN(Constantes_de_frettage!I7)-5)*3)","v":25},{"$f":"OFFSET(Empilage!H$15,0,(COLUMN(Constantes_de_frettage!J7)-5)*3)","v":25},{"$f":"OFFSET(Empilage!I$15,0,(COLUMN(Constantes_de_frettage!K7)-5)*3)","v":25},{"$f":"OFFSET(Empilage!J$15,0,(COLUMN(Constantes_de_frettage!L7)-5)*3)","v":25},{"$f":"OFFSET(Empilage!K$15,0,(COLUMN(Constantes_de_frettage!M7)-5)*3)","v":25},{"$f":"OFFSET(Empilage!L$15,0,(COLUMN(Constantes_de_frettage!N7)-5)*3)","v":25}]
[null,"Diamètre intérieur",null,"mm",{"$f":"OFFSET(Empilage!C$16,0,(COLUMN(Constantes_de_frettage!E8)-5)*3)","v":0},{"$f":"OFFSET(Empilage!D$16,0,(COLUMN(Constantes_de_frettage!F8)-5)*3)","v":0},{"$f":"OFFSET(Empilage!E$16,0,(COLUMN(Constantes_de_frettage!G8)-5)*3)","v":0},{"$f":"OFFSET(Empilage!F$16,0,(COLUMN(Constantes_de_frettage!H8)-5)*3)","v":0},{"$f":"OFFSET(Empilage!G$16,0,(COLUMN(Constantes_de_frettage!I8)-5)*3)","v":0},{"$f":"OFFSET(Empilage!H$16,0,(COLUMN(Constantes_de_frettage!J8)-5)*3)","v":0},{"$f":"OFFSET(Empilage!I$16,0,(COLUMN(Constantes_de_frettage!K8)-5)*3)","v":0},{"$f":"OFFSET(Empilage!J$16,0,(COLUMN(Constantes_de_frettage!L8)-5)*3)","v":0},{"$f":"OFFSET(Empilage!K$16,0,(COLUMN(Constantes_de_frettage!M8)-5)*3)","v":0},{"$f":"OFFSET(Empilage!L$16,0,(COLUMN(Constantes_de_frettage!N8)-5)*3)","v":0}]
[]
[null,"Constantes",null,null,{"$f":"-(1-E6+(1+E6)*(E8/E7)^2)*E7^2/(E7^2-E8^2)/E5/10","v":{"v":-3.4847848209940064E-6,"d":"-3.48E-06"}},{"$f":"-(1-F6+(1+F6)*(F8/F7)^2)*F7^2/(F7^2-F8^2)/F5/10","v":{"v":-3.4847848209940064E-6,"d":"-3.48E-06"}},{"$f":"-(1-G6+(1+G6)*(G8/G7)^2)*G7^2/(G7^2-G8^2)/G5/10","v":{"v":-3.4847848209940064E-6,"d":"-3.48E-06"}},{"$f":"-(1-H6+(1+H6)*(H8/H7)^2)*H7^2/(H7^2-H8^2)/H5/10","v":{"v":-3.4847848209940064E-6,"d":"-3.48E-06"}},{"$f":"-(1-I6+(1+I6)*(I8/I7)^2)*I7^2/(I7^2-I8^2)/I5/10","v":{"v":-3.4847848209940064E-6,"d":"-3.48E-06"}},{"$f":"-(1-J6+(1+J6)*(J8/J7)^2)*J7^2/(J7^2-J8^2)/J5/10","v":{"v":-3.4847848209940064E-6,"d":"-3.48E-06"}},{"$f":"-(1-K6+(1+K6)*(K8/K7)^2)*K7^2/(K7^2-K8^2)/K5/10","v":{"v":-3.4847848209940064E-6,"d":"-3.48E-06"}},{"$f":"-(1-L6+(1+L6)*(L8/L7)^2)*L7^2/(L7^2-L8^2)/L5/10","v":{"v":-3.4847848209940064E-6,"d":"-3.48E-06"}},{"$f":"-(1-M6+(1+M6)*(M8/M7)^2)*M7^2/(M7^2-M8^2)/M5/10","v":{"v":-3.4847848209940064E-6,"d":"-3.48E-06"}},{"$f":"-(1-N6+(1+N6)*(N8/N7)^2)*N7^2/(N7^2-N8^2)/N5/10","v":{"v":-3.4847848209940064E-6,"d":"-3.48E-06"}}]
[]
[{"$nulls":4},{"$f":"OFFSET(Empilage!C$31,0,(COLUMN(Constantes_de_frettage!E12)-5)*3)","v":"Pièce femelle"},{"$f":"OFFSET(Empilage!D$31,0,(COLUMN(Constantes_de_frettage!F12)-5)*3)","v":"Pièce femelle"},{"$f":"OFFSET(Empilage!E$31,0,(COLUMN(Constantes_de_frettage!G12)-5)*3)","v":"Pièce femelle"},{"$f":"OFFSET(Empilage!F$31,0,(COLUMN(Constantes_de_frettage!H12)-5)*3)","v":"Pièce femelle"},{"$f":"OFFSET(Empilage!G$31,0,(COLUMN(Constantes_de_frettage!I12)-5)*3)","v":"Pièce femelle"},{"$f":"OFFSET(Empilage!H$31,0,(COLUMN(Constantes_de_frettage!J12)-5)*3)","v":"Pièce femelle"},{"$f":"OFFSET(Empilage!I$31,0,(COLUMN(Constantes_de_frettage!K12)-5)*3)","v":"Pièce femelle"},{"$f":"OFFSET(Empilage!J$31,0,(COLUMN(Constantes_de_frettage!L12)-5)*3)","v":"Pièce femelle"},{"$f":"OFFSET(Empilage!K$31,0,(COLUMN(Constantes_de_frettage!M12)-5)*3)","v":"Pièce femelle"},{"$f":"OFFSET(Empilage!L$31,0,(COLUMN(Constantes_de_frettage!N12)-5)*3)","v":"Pièce femelle"}]
[null,"Module d'Young",null,"daN/mm2",{"$f":"OFFSET(Empilage!C$43,0,(COLUMN(Constantes_de_frettage!E13)-5)*3)","v":20674.822},{"$f":"OFFSET(Empilage!D$43,0,(COLUMN(Constantes_de_frettage!F13)-5)*3)","v":20674.822},{"$f":"OFFSET(Empilage!E$43,0,(COLUMN(Constantes_de_frettage!G13)-5)*3)","v":20674.822},{"$f":"OFFSET(Empilage!F$43,0,(COLUMN(Constantes_de_frettage!H13)-5)*3)","v":20674.822},{"$f":"OFFSET(Empilage!G$43,0,(COLUMN(Constantes_de_frettage!I13)-5)*3)","v":20674.822},{"$f":"OFFSET(Empilage!H$43,0,(COLUMN(Constantes_de_frettage!J13)-5)*3)","v":20674.822},{"$f":"OFFSET(Empilage!I$43,0,(COLUMN(Constantes_de_frettage!K13)-5)*3)","v":20674.822},{"$f":"OFFSET(Empilage!J$43,0,(COLUMN(Constantes_de_frettage!L13)-5)*3)","v":20674.822},{"$f":"OFFSET(Empilage!K$43,0,(COLUMN(Constantes_de_frettage!M13)-5)*3)","v":20674.822},{"$f":"OFFSET(Empilage!L$43,0,(COLUMN(Constantes_de_frettage!N13)-5)*3)","v":20674.822}]
[null,"Coefficient de Poisson",null,"-",{"$f":"OFFSET(Empilage!C$52,0,(COLUMN(Constantes_de_frettage!E14)-5)*3)","v":0.2795269411764706},{"$f":"OFFSET(Empilage!D$52,0,(COLUMN(Constantes_de_frettage!F14)-5)*3)","v":0.2795269411764706},{"$f":"OFFSET(Empilage!E$52,0,(COLUMN(Constantes_de_frettage!G14)-5)*3)","v":0.2795269411764706},{"$f":"OFFSET(Empilage!F$52,0,(COLUMN(Constantes_de_frettage!H14)-5)*3)","v":0.2795269411764706},{"$f":"OFFSET(Empilage!G$52,0,(COLUMN(Constantes_de_frettage!I14)-5)*3)","v":0.2795269411764706},{"$f":"OFFSET(Empilage!H$52,0,(COLUMN(Constantes_de_frettage!J14)-5)*3)","v":0.2795269411764706},{"$f":"OFFSET(Empilage!I$52,0,(COLUMN(Constantes_de_frettage!K14)-5)*3)","v":0.2795269411764706},{"$f":"OFFSET(Empilage!J$52,0,(COLUMN(Constantes_de_frettage!L14)-5)*3)","v":0.2795269411764706},{"$f":"OFFSET(Empilage!K$52,0,(COLUMN(Constantes_de_frettage!M14)-5)*3)","v":0.2795269411764706},{"$f":"OFFSET(Empilage!L$52,0,(COLUMN(Constantes_de_frettage!N14)-5)*3)","v":0.2795269411764706}]
[null,"Diamètre extérieur",null,"mm",{"$f":"OFFSET(Empilage!C$35,0,(COLUMN(Constantes_de_frettage!E15)-5)*3)","v":30},{"$f":"OFFSET(Empilage!D$35,0,(COLUMN(Constantes_de_frettage!F15)-5)*3)","v":30},{"$f":"OFFSET(Empilage!E$35,0,(COLUMN(Constantes_de_frettage!G15)-5)*3)","v":30},{"$f":"OFFSET(Empilage!F$35,0,(COLUMN(Constantes_de_frettage!H15)-5)*3)","v":30},{"$f":"OFFSET(Empilage!G$35,0,(COLUMN(Constantes_de_frettage!I15)-5)*3)","v":30},{"$f":"OFFSET(Empilage!H$35,0,(COLUMN(Constantes_de_frettage!J15)-5)*3)","v":30},{"$f":"OFFSET(Empilage!I$35,0,(COLUMN(Constantes_de_frettage!K15)-5)*3)","v":30},{"$f":"OFFSET(Empilage!J$35,0,(COLUMN(Constantes_de_frettage!L15)-5)*3)","v":30},{"$f":"OFFSET(Empilage!K$35,0,(COLUMN(Constantes_de_frettage!M15)-5)*3)","v":30},{"$f":"OFFSET(Empilage!L$35,0,(COLUMN(Constantes_de_frettage!N15)-5)*3)","v":30}]
[null,"Diamètre intérieur",null,"mm",{"$f":"OFFSET(Empilage!C$36,0,(COLUMN(Constantes_de_frettage!E16)-5)*3)","v":25},{"$f":"OFFSET(Empilage!D$36,0,(COLUMN(Constantes_de_frettage!F16)-5)*3)","v":25},{"$f":"OFFSET(Empilage!E$36,0,(COLUMN(Constantes_de_frettage!G16)-5)*3)","v":25},{"$f":"OFFSET(Empilage!F$36,0,(COLUMN(Constantes_de_frettage!H16)-5)*3)","v":25},{"$f":"OFFSET(Empilage!G$36,0,(COLUMN(Constantes_de_frettage!I16)-5)*3)","v":25},{"$f":"OFFSET(Empilage!H$36,0,(COLUMN(Constantes_de_frettage!J16)-5)*3)","v":25},{"$f":"OFFSET(Empilage!I$36,0,(COLUMN(Constantes_de_frettage!K16)-5)*3)","v":25},{"$f":"OFFSET(Empilage!J$36,0,(COLUMN(Constantes_de_frettage!L16)-5)*3)","v":25},{"$f":"OFFSET(Empilage!K$36,0,(COLUMN(Constantes_de_frettage!M16)-5)*3)","v":25},{"$f":"OFFSET(Empilage!L$36,0,(COLUMN(Constantes_de_frettage!N16)-5)*3)","v":25}]
[]
[null,"Constantes",null,null,{"$f":"(1-E14+(1+E14)*(E15/E7)^2)*E16^2/(E15^2-E7^2)/E13/10","v":{"v":2.8174276357160488E-5,"d":"2.82E-05"}},{"$f":"(1-F14+(1+F14)*(F15/F7)^2)*F16^2/(F15^2-F7^2)/F13/10","v":{"v":2.8174276357160488E-5,"d":"2.82E-05"}},{"$f":"(1-G14+(1+G14)*(G15/G7)^2)*G16^2/(G15^2-G7^2)/G13/10","v":{"v":2.8174276357160488E-5,"d":"2.82E-05"}},{"$f":"(1-H14+(1+H14)*(H15/H7)^2)*H16^2/(H15^2-H7^2)/H13/10","v":{"v":2.8174276357160488E-5,"d":"2.82E-05"}},{"$f":"(1-I14+(1+I14)*(I15/I7)^2)*I16^2/(I15^2-I7^2)/I13/10","v":{"v":2.8174276357160488E-5,"d":"2.82E-05"}},{"$f":"(1-J14+(1+J14)*(J15/J7)^2)*J16^2/(J15^2-J7^2)/J13/10","v":{"v":2.8174276357160488E-5,"d":"2.82E-05"}},{"$f":"(1-K14+(1+K14)*(K15/K7)^2)*K16^2/(K15^2-K7^2)/K13/10","v":{"v":2.8174276357160488E-5,"d":"2.82E-05"}},{"$f":"(1-L14+(1+L14)*(L15/L7)^2)*L16^2/(L15^2-L7^2)/L13/10","v":{"v":2.8174276357160488E-5,"d":"2.82E-05"}},{"$f":"(1-M14+(1+M14)*(M15/M7)^2)*M16^2/(M15^2-M7^2)/M13/10","v":{"v":2.8174276357160488E-5,"d":"2.82E-05"}},{"$f":"(1-N14+(1+N14)*(N15/N7)^2)*N16^2/(N15^2-N7^2)/N13/10","v":{"v":2.8174276357160488E-5,"d":"2.82E-05"}}]
[]
[]
[null,"Constantes de frettage à la mise en froid"]
[]
[]
[{"$nulls":4},{"$f":"OFFSET(Empilage!C$11,0,(COLUMN(Constantes_de_frettage!E24)-5)*3)","v":"Pièce mâle"},{"$f":"OFFSET(Empilage!D$11,0,(COLUMN(Constantes_de_frettage!F24)-5)*3)","v":"Pièce mâle"},{"$f":"OFFSET(Empilage!E$11,0,(COLUMN(Constantes_de_frettage!G24)-5)*3)","v":"Pièce mâle"},{"$f":"OFFSET(Empilage!F$11,0,(COLUMN(Constantes_de_frettage!H24)-5)*3)","v":"Pièce mâle"},{"$f":"OFFSET(Empilage!G$11,0,(COLUMN(Constantes_de_frettage!I24)-5)*3)","v":"Pièce mâle"},{"$f":"OFFSET(Empilage!H$11,0,(COLUMN(Constantes_de_frettage!J24)-5)*3)","v":"Pièce mâle"},{"$f":"OFFSET(Empilage!I$11,0,(COLUMN(Constantes_de_frettage!K24)-5)*3)","v":"Pièce mâle"},{"$f":"OFFSET(Empilage!J$11,0,(COLUMN(Constantes_de_frettage!L24)-5)*3)","v":"Pièce mâle"},{"$f":"OFFSET(Empilage!K$11,0,(COLUMN(Constantes_de_frettage!M24)-5)*3)","v":"Pièce mâle"},{"$f":"OFFSET(Empilage!L$11,0,(COLUMN(Constantes_de_frettage!N24)-5)*3)","v":"Pièce mâle"}]
[null,"Module d'Young",null,"daN/mm2",{"$f":"OFFSET(Empilage!C$19,0,(COLUMN(Constantes_de_frettage!E25)-5)*3)","v":22036},{"$f":"OFFSET(Empilage!D$19,0,(COLUMN(Constantes_de_frettage!F25)-5)*3)","v":22036},{"$f":"OFFSET(Empilage!E$19,0,(COLUMN(Constantes_de_frettage!G25)-5)*3)","v":22036},{"$f":"OFFSET(Empilage!F$19,0,(COLUMN(Constantes_de_frettage!H25)-5)*3)","v":22036},{"$f":"OFFSET(Empilage!G$19,0,(COLUMN(Constantes_de_frettage!I25)-5)*3)","v":22036},{"$f":"OFFSET(Empilage!H$19,0,(COLUMN(Constantes_de_frettage!J25)-5)*3)","v":22036},{"$f":"OFFSET(Empilage!I$19,0,(COLUMN(Constantes_de_frettage!K25)-5)*3)","v":22036},{"$f":"OFFSET(Empilage!J$19,0,(COLUMN(Constantes_de_frettage!L25)-5)*3)","v":22036},{"$f":"OFFSET(Empilage!K$19,0,(COLUMN(Constantes_de_frettage!M25)-5)*3)","v":22036},{"$f":"OFFSET(Empilage!L$19,0,(COLUMN(Constantes_de_frettage!N25)-5)*3)","v":22036}]
[null,"Coefficient de Poisson",null,"-",{"$f":"OFFSET(Empilage!C$27,0,(COLUMN(Constantes_de_frettage!E26)-5)*3)","v":0.2795269411764706},{"$f":"OFFSET(Empilage!D$27,0,(COLUMN(Constantes_de_frettage!F26)-5)*3)","v":0.2795269411764706},{"$f":"OFFSET(Empilage!E$27,0,(COLUMN(Constantes_de_frettage!G26)-5)*3)","v":0.2795269411764706},{"$f":"OFFSET(Empilage!F$27,0,(COLUMN(Constantes_de_frettage!H26)-5)*3)","v":0.2795269411764706},{"$f":"OFFSET(Empilage!G$27,0,(COLUMN(Constantes_de_frettage!I26)-5)*3)","v":0.2795269411764706},{"$f":"OFFSET(Empilage!H$27,0,(COLUMN(Constantes_de_frettage!J26)-5)*3)","v":0.2795269411764706},{"$f":"OFFSET(Empilage!I$27,0,(COLUMN(Constantes_de_frettage!K26)-5)*3)","v":0.2795269411764706},{"$f":"OFFSET(Empilage!J$27,0,(COLUMN(Constantes_de_frettage!L26)-5)*3)","v":0.2795269411764706},{"$f":"OFFSET(Empilage!K$27,0,(COLUMN(Constantes_de_frettage!M26)-5)*3)","v":0.2795269411764706},{"$f":"OFFSET(Empilage!L$27,0,(COLUMN(Constantes_de_frettage!N26)-5)*3)","v":0.2795269411764706}]
[null,"Diamètre extérieur",null,"mm",{"$f":"OFFSET(Empilage!C$15,0,(COLUMN(Constantes_de_frettage!E27)-5)*3)","v":25},{"$f":"OFFSET(Empilage!D$15,0,(COLUMN(Constantes_de_frettage!F27)-5)*3)","v":25},{"$f":"OFFSET(Empilage!E$15,0,(COLUMN(Constantes_de_frettage!G27)-5)*3)","v":25},{"$f":"OFFSET(Empilage!F$15,0,(COLUMN(Constantes_de_frettage!H27)-5)*3)","v":25},{"$f":"OFFSET(Empilage!G$15,0,(COLUMN(Constantes_de_frettage!I27)-5)*3)","v":25},{"$f":"OFFSET(Empilage!H$15,0,(COLUMN(Constantes_de_frettage!J27)-5)*3)","v":25},{"$f":"OFFSET(Empilage!I$15,0,(COLUMN(Constantes_de_frettage!K27)-5)*3)","v":25},{"$f":"OFFSET(Empilage!J$15,0,(COLUMN(Constantes_de_frettage!L27)-5)*3)","v":25},{"$f":"OFFSET(Empilage!K$15,0,(COLUMN(Constantes_de_frettage!M27)-5)*3)","v":25},{"$f":"OFFSET(Empilage!L$15,0,(COLUMN(Constantes_de_frettage!N27)-5)*3)","v":25}]
[null,"Diamètre intérieur",null,"mm",{"$f":"OFFSET(Empilage!C$16,0,(COLUMN(Constantes_de_frettage!E28)-5)*3)","v":0},{"$f":"OFFSET(Empilage!D$16,0,(COLUMN(Constantes_de_frettage!F28)-5)*3)","v":0},{"$f":"OFFSET(Empilage!E$16,0,(COLUMN(Constantes_de_frettage!G28)-5)*3)","v":0},{"$f":"OFFSET(Empilage!F$16,0,(COLUMN(Constantes_de_frettage!H28)-5)*3)","v":0},{"$f":"OFFSET(Empilage!G$16,0,(COLUMN(Constantes_de_frettage!I28)-5)*3)","v":0},{"$f":"OFFSET(Empilage!H$16,0,(COLUMN(Constantes_de_frettage!J28)-5)*3)","v":0},{"$f":"OFFSET(Empilage!I$16,0,(COLUMN(Constantes_de_frettage!K28)-5)*3)","v":0},{"$f":"OFFSET(Empilage!J$16,0,(COLUMN(Constantes_de_frettage!L28)-5)*3)","v":0},{"$f":"OFFSET(Empilage!K$16,0,(COLUMN(Constantes_de_frettage!M28)-5)*3)","v":0},{"$f":"OFFSET(Empilage!L$16,0,(COLUMN(Constantes_de_frettage!N28)-5)*3)","v":0}]
[]
[null,"Constantes",null,null,{"$f":"-(1-E26+(1+E26)*(E28/E27)^2)*E27^2/(E27^2-E28^2)/E25/10","v":{"v":-3.269527404354372E-6,"d":"-3.27E-06"}},{"$f":"-(1-F26+(1+F26)*(F28/F27)^2)*F27^2/(F27^2-F28^2)/F25/10","v":{"v":-3.269527404354372E-6,"d":"-3.27E-06"}},{"$f":"-(1-G26+(1+G26)*(G28/G27)^2)*G27^2/(G27^2-G28^2)/G25/10","v":{"v":-3.269527404354372E-6,"d":"-3.27E-06"}},{"$f":"-(1-H26+(1+H26)*(H28/H27)^2)*H27^2/(H27^2-H28^2)/H25/10","v":{"v":-3.269527404354372E-6,"d":"-3.27E-06"}},{"$f":"-(1-I26+(1+I26)*(I28/I27)^2)*I27^2/(I27^2-I28^2)/I25/10","v":{"v":-3.269527404354372E-6,"d":"-3.27E-06"}},{"$f":"-(1-J26+(1+J26)*(J28/J27)^2)*J27^2/(J27^2-J28^2)/J25/10","v":{"v":-3.269527404354372E-6,"d":"-3.27E-06"}},{"$f":"-(1-K26+(1+K26)*(K28/K27)^2)*K27^2/(K27^2-K28^2)/K25/10","v":{"v":-3.269527404354372E-6,"d":"-3.27E-06"}},{"$f":"-(1-L26+(1+L26)*(L28/L27)^2)*L27^2/(L27^2-L28^2)/L25/10","v":{"v":-3.269527404354372E-6,"d":"-3.27E-06"}},{"$f":"-(1-M26+(1+M26)*(M28/M27)^2)*M27^2/(M27^2-M28^2)/M25/10","v":{"v":-3.269527404354372E-6,"d":"-3.27E-06"}},{"$f":"-(1-N26+(1+N26)*(N28/N27)^2)*N27^2/(N27^2-N28^2)/N25/10","v":{"v":-3.269527404354372E-6,"d":"-3.27E-06"}}]
[]
[{"$nulls":4},{"$f":"OFFSET(Empilage!C$31,0,(COLUMN(Constantes_de_frettage!E32)-5)*3)","v":"Pièce femelle"},{"$f":"OFFSET(Empilage!D$31,0,(COLUMN(Constantes_de_frettage!F32)-5)*3)","v":"Pièce femelle"},{"$f":"OFFSET(Empilage!E$31,0,(COLUMN(Constantes_de_frettage!G32)-5)*3)","v":"Pièce femelle"},{"$f":"OFFSET(Empilage!F$31,0,(COLUMN(Constantes_de_frettage!H32)-5)*3)","v":"Pièce femelle"},{"$f":"OFFSET(Empilage!G$31,0,(COLUMN(Constantes_de_frettage!I32)-5)*3)","v":"Pièce femelle"},{"$f":"OFFSET(Empilage!H$31,0,(COLUMN(Constantes_de_frettage!J32)-5)*3)","v":"Pièce femelle"},{"$f":"OFFSET(Empilage!I$31,0,(COLUMN(Constantes_de_frettage!K32)-5)*3)","v":"Pièce femelle"},{"$f":"OFFSET(Empilage!J$31,0,(COLUMN(Constantes_de_frettage!L32)-5)*3)","v":"Pièce femelle"},{"$f":"OFFSET(Empilage!K$31,0,(COLUMN(Constantes_de_frettage!M32)-5)*3)","v":"Pièce femelle"},{"$f":"OFFSET(Empilage!L$31,0,(COLUMN(Constantes_de_frettage!N32)-5)*3)","v":"Pièce femelle"}]
[null,"Module d'Young",null,"daN/mm2",{"$f":"OFFSET(Empilage!C$44,0,(COLUMN(Constantes_de_frettage!E33)-5)*3)","v":22036},{"$f":"OFFSET(Empilage!D$44,0,(COLUMN(Constantes_de_frettage!F33)-5)*3)","v":22036},{"$f":"OFFSET(Empilage!E$44,0,(COLUMN(Constantes_de_frettage!G33)-5)*3)","v":22036},{"$f":"OFFSET(Empilage!F$44,0,(COLUMN(Constantes_de_frettage!H33)-5)*3)","v":22036},{"$f":"OFFSET(Empilage!G$44,0,(COLUMN(Constantes_de_frettage!I33)-5)*3)","v":22036},{"$f":"OFFSET(Empilage!H$44,0,(COLUMN(Constantes_de_frettage!J33)-5)*3)","v":22036},{"$f":"OFFSET(Empilage!I$44,0,(COLUMN(Constantes_de_frettage!K33)-5)*3)","v":22036},{"$f":"OFFSET(Empilage!J$44,0,(COLUMN(Constantes_de_frettage!L33)-5)*3)","v":22036},{"$f":"OFFSET(Empilage!K$44,0,(COLUMN(Constantes_de_frettage!M33)-5)*3)","v":22036},{"$f":"OFFSET(Empilage!L$44,0,(COLUMN(Constantes_de_frettage!N33)-5)*3)","v":22036}]
[null,"Coefficient de Poisson",null,"-",{"$f":"OFFSET(Empilage!C$52,0,(COLUMN(Constantes_de_frettage!E34)-5)*3)","v":0.2795269411764706},{"$f":"OFFSET(Empilage!D$52,0,(COLUMN(Constantes_de_frettage!F34)-5)*3)","v":0.2795269411764706},{"$f":"OFFSET(Empilage!E$52,0,(COLUMN(Constantes_de_frettage!G34)-5)*3)","v":0.2795269411764706},{"$f":"OFFSET(Empilage!F$52,0,(COLUMN(Constantes_de_frettage!H34)-5)*3)","v":0.2795269411764706},{"$f":"OFFSET(Empilage!G$52,0,(COLUMN(Constantes_de_frettage!I34)-5)*3)","v":0.2795269411764706},{"$f":"OFFSET(Empilage!H$52,0,(COLUMN(Constantes_de_frettage!J34)-5)*3)","v":0.2795269411764706},{"$f":"OFFSET(Empilage!I$52,0,(COLUMN(Constantes_de_frettage!K34)-5)*3)","v":0.2795269411764706},{"$f":"OFFSET(Empilage!J$52,0,(COLUMN(Constantes_de_frettage!L34)-5)*3)","v":0.2795269411764706},{"$f":"OFFSET(Empilage!K$52,0,(COLUMN(Constantes_de_frettage!M34)-5)*3)","v":0.2795269411764706},{"$f":"OFFSET(Empilage!L$52,0,(COLUMN(Constantes_de_frettage!N34)-5)*3)","v":0.2795269411764706}]
[null,"Diamètre extérieur",null,"mm",{"$f":"OFFSET(Empilage!C$35,0,(COLUMN(Constantes_de_frettage!E35)-5)*3)","v":30},{"$f":"OFFSET(Empilage!D$35,0,(COLUMN(Constantes_de_frettage!F35)-5)*3)","v":30},{"$f":"OFFSET(Empilage!E$35,0,(COLUMN(Constantes_de_frettage!G35)-5)*3)","v":30},{"$f":"OFFSET(Empilage!F$35,0,(COLUMN(Constantes_de_frettage!H35)-5)*3)","v":30},{"$f":"OFFSET(Empilage!G$35,0,(COLUMN(Constantes_de_frettage!I35)-5)*3)","v":30},{"$f":"OFFSET(Empilage!H$35,0,(COLUMN(Constantes_de_frettage!J35)-5)*3)","v":30},{"$f":"OFFSET(Empilage!I$35,0,(COLUMN(Constantes_de_frettage!K35)-5)*3)","v":30},{"$f":"OFFSET(Empilage!J$35,0,(COLUMN(Constantes_de_frettage!L35)-5)*3)","v":30},{"$f":"OFFSET(Empilage!K$35,0,(COLUMN(Constantes_de_frettage!M35)-5)*3)","v":30},{"$f":"OFFSET(Empilage!L$35,0,(COLUMN(Constantes_de_frettage!N35)-5)*3)","v":30}]
[null,"Diamètre intérieur",null,"mm",{"$f":"OFFSET(Empilage!C$36,0,(COLUMN(Constantes_de_frettage!E36)-5)*3)","v":25},{"$f":"OFFSET(Empilage!D$36,0,(COLUMN(Constantes_de_frettage!F36)-5)*3)","v":25},{"$f":"OFFSET(Empilage!E$36,0,(COLUMN(Constantes_de_frettage!G36)-5)*3)","v":25},{"$f":"OFFSET(Empilage!F$36,0,(COLUMN(Constantes_de_frettage!H36)-5)*3)","v":25},{"$f":"OFFSET(Empilage!G$36,0,(COLUMN(Constantes_de_frettage!I36)-5)*3)","v":25},{"$f":"OFFSET(Empilage!H$36,0,(COLUMN(Constantes_de_frettage!J36)-5)*3)","v":25},{"$f":"OFFSET(Empilage!I$36,0,(COLUMN(Constantes_de_frettage!K36)-5)*3)","v":25},{"$f":"OFFSET(Empilage!J$36,0,(COLUMN(Constantes_de_frettage!L36)-5)*3)","v":25},{"$f":"OFFSET(Empilage!K$36,0,(COLUMN(Constantes_de_frettage!M36)-5)*3)","v":25},{"$f":"OFFSET(Empilage!L$36,0,(COLUMN(Constantes_de_frettage!N36)-5)*3)","v":25}]
[]
[null,"Constantes",null,null,{"$f":"(1-E34+(1+E34)*(E35/E27)^2)*E36^2/(E35^2-E27^2)/E33/10","v":{"v":2.6433933048788418E-5,"d":"2.64E-05"}},{"$f":"(1-F34+(1+F34)*(F35/F27)^2)*F36^2/(F35^2-F27^2)/F33/10","v":{"v":2.6433933048788418E-5,"d":"2.64E-05"}},{"$f":"(1-G34+(1+G34)*(G35/G27)^2)*G36^2/(G35^2-G27^2)/G33/10","v":{"v":2.6433933048788418E-5,"d":"2.64E-05"}},{"$f":"(1-H34+(1+H34)*(H35/H27)^2)*H36^2/(H35^2-H27^2)/H33/10","v":{"v":2.6433933048788418E-5,"d":"2.64E-05"}},{"$f":"(1-I34+(1+I34)*(I35/I27)^2)*I36^2/(I35^2-I27^2)/I33/10","v":{"v":2.6433933048788418E-5,"d":"2.64E-05"}},{"$f":"(1-J34+(1+J34)*(J35/J27)^2)*J36^2/(J35^2-J27^2)/J33/10","v":{"v":2.6433933048788418E-5,"d":"2.64E-05"}},{"$f":"(1-K34+(1+K34)*(K35/K27)^2)*K36^2/(K35^2-K27^2)/K33/10","v":{"v":2.6433933048788418E-5,"d":"2.64E-05"}},{"$f":"(1-L34+(1+L34)*(L35/L27)^2)*L36^2/(L35^2-L27^2)/L33/10","v":{"v":2.6433933048788418E-5,"d":"2.64E-05"}},{"$f":"(1-M34+(1+M34)*(M35/M27)^2)*M36^2/(M35^2-M27^2)/M33/10","v":{"v":2.6433933048788418E-5,"d":"2.64E-05"}},{"$f":"(1-N34+(1+N34)*(N35/N27)^2)*N36^2/(N35^2-N27^2)/N33/10","v":{"v":2.6433933048788418E-5,"d":"2.64E-05"}}]
[]
[]
[null,"Constantes de frettage en fonctionnement"]
[]
[]
[{"$nulls":4},{"$f":"OFFSET(Empilage!C$11,0,(COLUMN(Constantes_de_frettage!E44)-5)*3)","v":"Pièce mâle"},{"$f":"OFFSET(Empilage!D$11,0,(COLUMN(Constantes_de_frettage!F44)-5)*3)","v":"Pièce mâle"},{"$f":"OFFSET(Empilage!E$11,0,(COLUMN(Constantes_de_frettage!G44)-5)*3)","v":"Pièce mâle"},{"$f":"OFFSET(Empilage!F$11,0,(COLUMN(Constantes_de_frettage!H44)-5)*3)","v":"Pièce mâle"},{"$f":"OFFSET(Empilage!G$11,0,(COLUMN(Constantes_de_frettage!I44)-5)*3)","v":"Pièce mâle"},{"$f":"OFFSET(Empilage!H$11,0,(COLUMN(Constantes_de_frettage!J44)-5)*3)","v":"Pièce mâle"},{"$f":"OFFSET(Empilage!I$11,0,(COLUMN(Constantes_de_frettage!K44)-5)*3)","v":"Pièce mâle"},{"$f":"OFFSET(Empilage!J$11,0,(COLUMN(Constantes_de_frettage!L44)-5)*3)","v":"Pièce mâle"},{"$f":"OFFSET(Empilage!K$11,0,(COLUMN(Constantes_de_frettage!M44)-5)*3)","v":"Pièce mâle"},{"$f":"OFFSET(Empilage!L$11,0,(COLUMN(Constantes_de_frettage!N44)-5)*3)","v":"Pièce mâle"}]
[null,"Module d'Young",null,"daN/mm2",{"$f":"OFFSET(Empilage!C$20,0,(COLUMN(Constantes_de_frettage!E45)-5)*3)","v":21715.4},{"$f":"OFFSET(Empilage!D$20,0,(COLUMN(Constantes_de_frettage!F45)-5)*3)","v":21715.4},{"$f":"OFFSET(Empilage!E$20,0,(COLUMN(Constantes_de_frettage!G45)-5)*3)","v":21715.4},{"$f":"OFFSET(Empilage!F$20,0,(COLUMN(Constantes_de_frettage!H45)-5)*3)","v":21715.4},{"$f":"OFFSET(Empilage!G$20,0,(COLUMN(Constantes_de_frettage!I45)-5)*3)","v":21715.4},{"$f":"OFFSET(Empilage!H$20,0,(COLUMN(Constantes_de_frettage!J45)-5)*3)","v":21715.4},{"$f":"OFFSET(Empilage!I$20,0,(COLUMN(Constantes_de_frettage!K45)-5)*3)","v":21715.4},{"$f":"OFFSET(Empilage!J$20,0,(COLUMN(Constantes_de_frettage!L45)-5)*3)","v":21715.4},{"$f":"OFFSET(Empilage!K$20,0,(COLUMN(Constantes_de_frettage!M45)-5)*3)","v":21715.4},{"$f":"OFFSET(Empilage!L$20,0,(COLUMN(Constantes_de_frettage!N45)-5)*3)","v":21715.4}]
[null,"Coefficient de Poisson",null,"-",{"$f":"OFFSET(Empilage!C$27,0,(COLUMN(Constantes_de_frettage!E46)-5)*3)","v":0.2795269411764706},{"$f":"OFFSET(Empilage!D$27,0,(COLUMN(Constantes_de_frettage!F46)-5)*3)","v":0.2795269411764706},{"$f":"OFFSET(Empilage!E$27,0,(COLUMN(Constantes_de_frettage!G46)-5)*3)","v":0.2795269411764706},{"$f":"OFFSET(Empilage!F$27,0,(COLUMN(Constantes_de_frettage!H46)-5)*3)","v":0.2795269411764706},{"$f":"OFFSET(Empilage!G$27,0,(COLUMN(Constantes_de_frettage!I46)-5)*3)","v":0.2795269411764706},{"$f":"OFFSET(Empilage!H$27,0,(COLUMN(Constantes_de_frettage!J46)-5)*3)","v":0.2795269411764706},{"$f":"OFFSET(Empilage!I$27,0,(COLUMN(Constantes_de_frettage!K46)-5)*3)","v":0.2795269411764706},{"$f":"OFFSET(Empilage!J$27,0,(COLUMN(Constantes_de_frettage!L46)-5)*3)","v":0.2795269411764706},{"$f":"OFFSET(Empilage!K$27,0,(COLUMN(Constantes_de_frettage!M46)-5)*3)","v":0.2795269411764706},{"$f":"OFFSET(Empilage!L$27,0,(COLUMN(Constantes_de_frettage!N46)-5)*3)","v":0.2795269411764706}]
[null,"Diamètre extérieur",null,"mm",{"$f":"OFFSET(Empilage!C$15,0,(COLUMN(Constantes_de_frettage!E47)-5)*3)","v":25},{"$f":"OFFSET(Empilage!D$15,0,(COLUMN(Constantes_de_frettage!F47)-5)*3)","v":25},{"$f":"OFFSET(Empilage!E$15,0,(COLUMN(Constantes_de_frettage!G47)-5)*3)","v":25},{"$f":"OFFSET(Empilage!F$15,0,(COLUMN(Constantes_de_frettage!H47)-5)*3)","v":25},{"$f":"OFFSET(Empilage!G$15,0,(COLUMN(Constantes_de_frettage!I47)-5)*3)","v":25},{"$f":"OFFSET(Empilage!H$15,0,(COLUMN(Constantes_de_frettage!J47)-5)*3)","v":25},{"$f":"OFFSET(Empilage!I$15,0,(COLUMN(Constantes_de_frettage!K47)-5)*3)","v":25},{"$f":"OFFSET(Empilage!J$15,0,(COLUMN(Constantes_de_frettage!L47)-5)*3)","v":25},{"$f":"OFFSET(Empilage!K$15,0,(COLUMN(Constantes_de_frettage!M47)-5)*3)","v":25},{"$f":"OFFSET(Empilage!L$15,0,(COLUMN(Constantes_de_frettage!N47)-5)*3)","v":25}]
[null,"Diamètre intérieur",null,"mm",{"$f":"OFFSET(Empilage!C$16,0,(COLUMN(Constantes_de_frettage!E48)-5)*3)","v":0},{"$f":"OFFSET(Empilage!D$16,0,(COLUMN(Constantes_de_frettage!F48)-5)*3)","v":0},{"$f":"OFFSET(Empilage!E$16,0,(COLUMN(Constantes_de_frettage!G48)-5)*3)","v":0},{"$f":"OFFSET(Empilage!F$16,0,(COLUMN(Constantes_de_frettage!H48)-5)*3)","v":0},{"$f":"OFFSET(Empilage!G$16,0,(COLUMN(Constantes_de_frettage!I48)-5)*3)","v":0},{"$f":"OFFSET(Empilage!H$16,0,(COLUMN(Constantes_de_frettage!J48)-5)*3)","v":0},{"$f":"OFFSET(Empilage!I$16,0,(COLUMN(Constantes_de_frettage!K48)-5)*3)","v":0},{"$f":"OFFSET(Empilage!J$16,0,(COLUMN(Constantes_de_frettage!L48)-5)*3)","v":0},{"$f":"OFFSET(Empilage!K$16,0,(COLUMN(Constantes_de_frettage!M48)-5)*3)","v":0},{"$f":"OFFSET(Empilage!L$16,0,(COLUMN(Constantes_de_frettage!N48)-5)*3)","v":0}]
[]
[null,"Constantes",null,null,{"$f":"-(1-E46+(1+E46)*(E48/E47)^2)*E47^2/(E47^2-E48^2)/E45/10","v":{"v":-3.3177977786434024E-6,"d":"-3.32E-06"}},{"$f":"-(1-F46+(1+F46)*(F48/F47)^2)*F47^2/(F47^2-F48^2)/F45/10","v":{"v":-3.3177977786434024E-6,"d":"-3.32E-06"}},{"$f":"-(1-G46+(1+G46)*(G48/G47)^2)*G47^2/(G47^2-G48^2)/G45/10","v":{"v":-3.3177977786434024E-6,"d":"-3.32E-06"}},{"$f":"-(1-H46+(1+H46)*(H48/H47)^2)*H47^2/(H47^2-H48^2)/H45/10","v":{"v":-3.3177977786434024E-6,"d":"-3.32E-06"}},{"$f":"-(1-I46+(1+I46)*(I48/I47)^2)*I47^2/(I47^2-I48^2)/I45/10","v":{"v":-3.3177977786434024E-6,"d":"-3.32E-06"}},{"$f":"-(1-J46+(1+J46)*(J48/J47)^2)*J47^2/(J47^2-J48^2)/J45/10","v":{"v":-3.3177977786434024E-6,"d":"-3.32E-06"}},{"$f":"-(1-K46+(1+K46)*(K48/K47)^2)*K47^2/(K47^2-K48^2)/K45/10","v":{"v":-3.3177977786434024E-6,"d":"-3.32E-06"}},{"$f":"-(1-L46+(1+L46)*(L48/L47)^2)*L47^2/(L47^2-L48^2)/L45/10","v":{"v":-3.3177977786434024E-6,"d":"-3.32E-06"}},{"$f":"-(1-M46+(1+M46)*(M48/M47)^2)*M47^2/(M47^2-M48^2)/M45/10","v":{"v":-3.3177977786434024E-6,"d":"-3.32E-06"}},{"$f":"-(1-N46+(1+N46)*(N48/N47)^2)*N47^2/(N47^2-N48^2)/N45/10","v":{"v":-3.3177977786434024E-6,"d":"-3.32E-06"}}]
[]
[{"$nulls":4},{"$f":"OFFSET(Empilage!C$31,0,(COLUMN(Constantes_de_frettage!E52)-5)*3)","v":"Pièce femelle"},{"$f":"OFFSET(Empilage!D$31,0,(COLUMN(Constantes_de_frettage!F52)-5)*3)","v":"Pièce femelle"},{"$f":"OFFSET(Empilage!E$31,0,(COLUMN(Constantes_de_frettage!G52)-5)*3)","v":"Pièce femelle"},{"$f":"OFFSET(Empilage!F$31,0,(COLUMN(Constantes_de_frettage!H52)-5)*3)","v":"Pièce femelle"},{"$f":"OFFSET(Empilage!G$31,0,(COLUMN(Constantes_de_frettage!I52)-5)*3)","v":"Pièce femelle"},{"$f":"OFFSET(Empilage!H$31,0,(COLUMN(Constantes_de_frettage!J52)-5)*3)","v":"Pièce femelle"},{"$f":"OFFSET(Empilage!I$31,0,(COLUMN(Constantes_de_frettage!K52)-5)*3)","v":"Pièce femelle"},{"$f":"OFFSET(Empilage!J$31,0,(COLUMN(Constantes_de_frettage!L52)-5)*3)","v":"Pièce femelle"},{"$f":"OFFSET(Empilage!K$31,0,(COLUMN(Constantes_de_frettage!M52)-5)*3)","v":"Pièce femelle"},{"$f":"OFFSET(Empilage!L$31,0,(COLUMN(Constantes_de_frettage!N52)-5)*3)","v":"Pièce femelle"}]
[null,"Module d'Young",null,"daN/mm2",{"$f":"OFFSET(Empilage!C$45,0,(COLUMN(Constantes_de_frettage!E53)-5)*3)","v":21715.4},{"$f":"OFFSET(Empilage!D$45,0,(COLUMN(Constantes_de_frettage!F53)-5)*3)","v":21715.4},{"$f":"OFFSET(Empilage!E$45,0,(COLUMN(Constantes_de_frettage!G53)-5)*3)","v":21715.4},{"$f":"OFFSET(Empilage!F$45,0,(COLUMN(Constantes_de_frettage!H53)-5)*3)","v":21715.4},{"$f":"OFFSET(Empilage!G$45,0,(COLUMN(Constantes_de_frettage!I53)-5)*3)","v":21715.4},{"$f":"OFFSET(Empilage!H$45,0,(COLUMN(Constantes_de_frettage!J53)-5)*3)","v":21715.4},{"$f":"OFFSET(Empilage!I$45,0,(COLUMN(Constantes_de_frettage!K53)-5)*3)","v":21715.4},{"$f":"OFFSET(Empilage!J$45,0,(COLUMN(Constantes_de_frettage!L53)-5)*3)","v":21715.4},{"$f":"OFFSET(Empilage!K$45,0,(COLUMN(Constantes_de_frettage!M53)-5)*3)","v":21715.4},{"$f":"OFFSET(Empilage!L$45,0,(COLUMN(Constantes_de_frettage!N53)-5)*3)","v":21715.4}]
[null,"Coefficient de Poisson",null,"-",{"$f":"OFFSET(Empilage!C$52,0,(COLUMN(Constantes_de_frettage!E54)-5)*3)","v":0.2795269411764706},{"$f":"OFFSET(Empilage!D$52,0,(COLUMN(Constantes_de_frettage!F54)-5)*3)","v":0.2795269411764706},{"$f":"OFFSET(Empilage!E$52,0,(COLUMN(Constantes_de_frettage!G54)-5)*3)","v":0.2795269411764706},{"$f":"OFFSET(Empilage!F$52,0,(COLUMN(Constantes_de_frettage!H54)-5)*3)","v":0.2795269411764706},{"$f":"OFFSET(Empilage!G$52,0,(COLUMN(Constantes_de_frettage!I54)-5)*3)","v":0.2795269411764706},{"$f":"OFFSET(Empilage!H$52,0,(COLUMN(Constantes_de_frettage!J54)-5)*3)","v":0.2795269411764706},{"$f":"OFFSET(Empilage!I$52,0,(COLUMN(Constantes_de_frettage!K54)-5)*3)","v":0.2795269411764706},{"$f":"OFFSET(Empilage!J$52,0,(COLUMN(Constantes_de_frettage!L54)-5)*3)","v":0.2795269411764706},{"$f":"OFFSET(Empilage!K$52,0,(COLUMN(Constantes_de_frettage!M54)-5)*3)","v":0.2795269411764706},{"$f":"OFFSET(Empilage!L$52,0,(COLUMN(Constantes_de_frettage!N54)-5)*3)","v":0.2795269411764706}]
[null,"Diamètre extérieur",null,"mm",{"$f":"OFFSET(Empilage!C$35,0,(COLUMN(Constantes_de_frettage!E55)-5)*3)","v":30},{"$f":"OFFSET(Empilage!D$35,0,(COLUMN(Constantes_de_frettage!F55)-5)*3)","v":30},{"$f":"OFFSET(Empilage!E$35,0,(COLUMN(Constantes_de_frettage!G55)-5)*3)","v":30},{"$f":"OFFSET(Empilage!F$35,0,(COLUMN(Constantes_de_frettage!H55)-5)*3)","v":30},{"$f":"OFFSET(Empilage!G$35,0,(COLUMN(Constantes_de_frettage!I55)-5)*3)","v":30},{"$f":"OFFSET(Empilage!H$35,0,(COLUMN(Constantes_de_frettage!J55)-5)*3)","v":30},{"$f":"OFFSET(Empilage!I$35,0,(COLUMN(Constantes_de_frettage!K55)-5)*3)","v":30},{"$f":"OFFSET(Empilage!J$35,0,(COLUMN(Constantes_de_frettage!L55)-5)*3)","v":30},{"$f":"OFFSET(Empilage!K$35,0,(COLUMN(Constantes_de_frettage!M55)-5)*3)","v":30},{"$f":"OFFSET(Empilage!L$35,0,(COLUMN(Constantes_de_frettage!N55)-5)*3)","v":30}]
[null,"Diamètre intérieur",null,"mm",{"$f":"OFFSET(Empilage!C$36,0,(COLUMN(Constantes_de_frettage!E56)-5)*3)","v":25},{"$f":"OFFSET(Empilage!D$36,0,(COLUMN(Constantes_de_frettage!F56)-5)*3)","v":25},{"$f":"OFFSET(Empilage!E$36,0,(COLUMN(Constantes_de_frettage!G56)-5)*3)","v":25},{"$f":"OFFSET(Empilage!F$36,0,(COLUMN(Constantes_de_frettage!H56)-5)*3)","v":25},{"$f":"OFFSET(Empilage!G$36,0,(COLUMN(Constantes_de_frettage!I56)-5)*3)","v":25},{"$f":"OFFSET(Empilage!H$36,0,(COLUMN(Constantes_de_frettage!J56)-5)*3)","v":25},{"$f":"OFFSET(Empilage!I$36,0,(COLUMN(Constantes_de_frettage!K56)-5)*3)","v":25},{"$f":"OFFSET(Empilage!J$36,0,(COLUMN(Constantes_de_frettage!L56)-5)*3)","v":25},{"$f":"OFFSET(Empilage!K$36,0,(COLUMN(Constantes_de_frettage!M56)-5)*3)","v":25},{"$f":"OFFSET(Empilage!L$36,0,(COLUMN(Constantes_de_frettage!N56)-5)*3)","v":25}]
[]
[null,"Constantes",null,null,{"$f":"(1-E54+(1+E54)*(E55/E47)^2)*E56^2/(E55^2-E47^2)/E53/10","v":{"v":2.6824196130999272E-5,"d":"2.68E-05"}},{"$f":"(1-F54+(1+F54)*(F55/F47)^2)*F56^2/(F55^2-F47^2)/F53/10","v":{"v":2.6824196130999272E-5,"d":"2.68E-05"}},{"$f":"(1-G54+(1+G54)*(G55/G47)^2)*G56^2/(G55^2-G47^2)/G53/10","v":{"v":2.6824196130999272E-5,"d":"2.68E-05"}},{"$f":"(1-H54+(1+H54)*(H55/H47)^2)*H56^2/(H55^2-H47^2)/H53/10","v":{"v":2.6824196130999272E-5,"d":"2.68E-05"}},{"$f":"(1-I54+(1+I54)*(I55/I47)^2)*I56^2/(I55^2-I47^2)/I53/10","v":{"v":2.6824196130999272E-5,"d":"2.68E-05"}},{"$f":"(1-J54+(1+J54)*(J55/J47)^2)*J56^2/(J55^2-J47^2)/J53/10","v":{"v":2.6824196130999272E-5,"d":"2.68E-05"}},{"$f":"(1-K54+(1+K54)*(K55/K47)^2)*K56^2/(K55^2-K47^2)/K53/10","v":{"v":2.6824196130999272E-5,"d":"2.68E-05"}},{"$f":"(1-L54+(1+L54)*(L55/L47)^2)*L56^2/(L55^2-L47^2)/L53/10","v":{"v":2.6824196130999272E-5,"d":"2.68E-05"}},{"$f":"(1-M54+(1+M54)*(M55/M47)^2)*M56^2/(M55^2-M47^2)/M53/10","v":{"v":2.6824196130999272E-5,"d":"2.68E-05"}},{"$f":"(1-N54+(1+N54)*(N55/N47)^2)*N56^2/(N55^2-N47^2)/N53/10","v":{"v":2.6824196130999272E-5,"d":"2.68E-05"}}]

{"sheet":"Type_piece","index":5,"n_rows":8,"n_cols":7,"rows_kept":8,"merged":[[3,3,3,6]]}
[]
[null,"Type de pièce choisie :"]
[]
[null,"Type",null,"Coeff géométrique"]
[null,"1 - Profil cylindrique",null,1,1,1,1]
[null,"2 - Profil avec variation de diamètre","Variation/distance axial",-1.9E-3,0.0282]
[null,null,"Variation/distance radiale",{"v":0.0006,"d":"6.00E-04"},-0.0017]
[null,null,"Variation/épaisseur",{"v":2e-06,"d":"2.00E-06"},-1E-4,1.5E-3,0.022]