{"text_format":"3","workbook":"xlsx","n_sheets":3,"sheets":["DONNEES","CALCULS","RESULTATS"],"not_rendered":{"macros":1,"external_links":1,"defined_names":1},"read":"whole","date_system":"1900"}

{"sheet":"DONNEES","index":0,"n_rows":25,"n_cols":11,"rows_kept":25,"merged":[[5,10,5,11],[6,10,6,11],[7,10,7,11],[8,10,8,11],[9,10,9,11]]}
["Phase","Sous-phase","date début","durée (jours)","date fin","noms","Type de trx",null,"dates clé"]
[1,"1.1","2014-01-01",40,{"$f":"IFERROR(IF(OR(C2,D2)=\"\",\"\",A2+C2),\"\")","v":"2014-01-02"},"réalisation parking","terrassement"]
[null,"1.2","2014-02-01",40,{"$f":"IFERROR(IF(OR(C3,D3)=\"\",\"\",A3+C3),\"\")","v":"2014-02-01"},"mise en place réseaux","terrassement"]
[null,"1.3","2014-03-01",80,"2014-03-01","terrassement","réseaux"]
[null,"1.4","2014-02-01",64,"2014-02-01","fouilles","tout"]
[null,"1.5","2014-01-01",76,"2014-01-01","démolition","voiries",{"$nulls":3},"Type de trx"]
[{"$nulls":4},"",{"$nulls":5},"terrassement"]
[{"$nulls":4},"",{"$nulls":5},"voiries"]
[2,"2.1","2014-12-01",732,"2014-12-03","construction cloture","réseaux",{"$nulls":3},"réseaux"]
[null,"2.2","2015-01-01",732,"2015-01-01","etc","réseaux",{"$nulls":3},"tout"]
[null,"2.3","2014-02-01",27,"2014-02-01","etc","réseaux"]
[{"$nulls":4},""]
[3,"3.1","2015-04-01",77,"2015-04-04","etc","tout"]
[null,"3.2","2015-12-01",2,"2015-12-01","etc","voiries"]
[{"$nulls":4},""]
[{"$nulls":4},""]
[{"$nulls":4},""]
[{"$nulls":4},""]
[{"$nulls":4},""]
[]
[]
[]
[{"$nulls":5},"Q1 : comment on fait apparaître la deuxième boite ?"]
[{"$nulls":5},"Q2 : comment afficher automatiquement les num des phases et ss-ph ?"]
[{"$nulls":5},"Q3 : comment importer sur autocad ?"]

{"sheet":"CALCULS","index":1,"n_rows":35,"n_cols":2,"rows_kept":35}
[{"$f":"IF(type_trx=\"\",\"\",type_trx)","v":"Type de trx"},"Diminutif"]
[{"$f":"IF(type_trx=\"\",\"\",type_trx)","v":"terrassement"},{"$f":"IF(A2=\"terrassement\",\"T\",IF(A2=\"réseaux\",\"R\",IF(A2=\"voiries\",\"V\",IF(A2=\"tout\",\"TT\",\"\"))))","v":"T"}]
[{"$f":"IF(type_trx=\"\",\"\",type_trx)","v":"terrassement"},{"$f":"IF(A3=\"terrassement\",\"T\",IF(A3=\"réseaux\",\"R\",IF(A3=\"voiries\",\"V\",IF(A3=\"tout\",\"TT\",\"\"))))","v":"T"}]
[{"$f":"IF(type_trx=\"\",\"\",type_trx)","v":"réseaux"},"R"]
[{"$f":"IF(type_trx=\"\",\"\",type_trx)","v":"tout"},"TT"]
[{"$f":"IF(type_trx=\"\",\"\",type_trx)","v":"voiries"},"V"]
[{"$f":"IF(type_trx=\"\",\"\",type_trx)","v":""},""]
[{"$f":"IF(type_trx=\"\",\"\",type_trx)","v":""},""]
[{"$f":"IF(type_trx=\"\",\"\",type_trx)","v":"réseaux"},"R"]
[{"$f":"IF(type_trx=\"\",\"\",type_trx)","v":"réseaux"},"R"]
[{"$f":"IF(type_trx=\"\",\"\",type_trx)","v":"réseaux"},"R"]
[{"$f":"IF(type_trx=\"\",\"\",type_trx)","v":""},""]
[{"$f":"IF(type_trx=\"\",\"\",type_trx)","v":"tout"},"TT"]
[{"$f":"IF(type_trx=\"\",\"\",type_trx)","v":"voiries"},"V"]
[{"$f":"IF(type_trx=\"\",\"\",type_trx)","v":""},""]
[{"$f":"IF(type_trx=\"\",\"\",type_trx)","v":""},""]
[{"$f":"IF(type_trx=\"\",\"\",type_trx)","v":""},""]
[{"$f":"IF(type_trx=\"\",\"\",type_trx)","v":""},""]
[{"$f":"IF(type_trx=\"\",\"\",type_trx)","v":""},""]
[{"$f":"IF(type_trx=\"\",\"\",type_trx)","v":""},""]
[{"$f":"IF(type_trx=\"\",\"\",type_trx)","v":""},""]
[{"$f":"IF(type_trx=\"\",\"\",type_trx)","v":""},""]
[{"$f":"IF(type_trx=\"\",\"\",type_trx)","v":""},""]
[{"$f":"IF(type_trx=\"\",\"\",type_trx)","v":""},""]
[{"$f":"IF(type_trx=\"\",\"\",type_trx)","v":""},""]
[{"$f":"IF(type_trx=\"\",\"\",type_trx)","v":""},""]
[{"$f":"IF(type_trx=\"\",\"\",type_trx)","v":""},""]
[{"$f":"IF(type_trx=\"\",\"\",type_trx)","v":""},""]
[{"$f":"IF(type_trx=\"\",\"\",type_trx)","v":""},""]
[{"$f":"IF(type_trx=\"\",\"\",type_trx)","v":""},""]
[{"$f":"IF(type_trx=\"\",\"\",type_trx)","v":""},""]
[{"$f":"IF(type_trx=\"\",\"\",type_trx)","v":""},""]
[{"$f":"IF(type_trx=\"\",\"\",type_trx)","v":""},""]
[{"$f":"IF(type_trx=\"\",\"\",type_trx)","v":""},""]
[{"$f":"IF(type_trx=\"\",\"\",type_trx)","v":""},""]

{"sheet":"RESULTATS","index":2,"n_rows":15,"n_cols":15,"rows_kept":15,"merged":[[0,0,1,1],[0,3,0,14]]}
[{"$nulls":3},2014]
[{"$nulls":3},{"$f":"MIN([1]Données!C2:D14)","v":"2014-01-01"},{"$f":"D2+31","v":"2014-02-01"},{"$f":"E2+28","v":"2014-03-01"},{"$f":"F2+31","v":"2014-04-01"},{"$f":"G2+30","v":"2014-05-01"},{"$f":"H2+31","v":"2014-06-01"},{"$f":"I2+30","v":"2014-07-01"},"2014-08-01","2014-09-01",{"$f":"L2+30","v":"2014-10-01"},"2014-11-01",{"$f":"N2+30","v":"2014-12-01"}]
[{"$f":"IF(DONNEES!A2=\"\",\"\",DONNEES!A2)","v":1},{"$f":"IF(DONNEES!B2=\"\",\"\",DONNEES!B2)","v":"1.1"},{"$f":"IF(DONNEES!F2=\"\",\"\",DONNEES!F2)","v":"réalisation parking"},{"$f":"IF(AND(D$2>=[1]Données!$C2,[1]Planning!C$2<=[1]Données!$C2+[1]Données!$E2-1),\"=\",\"\")","v":"="},{"$f":"IF(AND(E$2>=[1]Données!$C2,[1]Planning!D$2<=[1]Données!$C2+[1]Données!$E2-1),\"=\",\"\")","v":""},{"$f":"IF(AND(F$2>=[1]Données!$C2,[1]Planning!E$2<=[1]Données!$C2+[1]Données!$E2-1),\"=\",\"\")","v":""},{"$f":"IF(AND(G$2>=[1]Données!$C2,[1]Planning!F$2<=[1]Données!$C2+[1]Données!$E2-1),\"=\",\"\")","v":""},{"$f":"IF(AND(H$2>=[1]Données!$C2,[1]Planning!G$2<=[1]Données!$C2+[1]Données!$E2-1),\"=\",\"\")","v":""},{"$f":"IF(AND(I$2>=[1]Données!$C2,[1]Planning!H$2<=[1]Données!$C2+[1]Données!$E2-1),\"=\",\"\")","v":""},{"$f":"IF(AND(J$2>=[1]Données!$C2,[1]Planning!I$2<=[1]Données!$C2+[1]Données!$E2-1),\"=\",\"\")","v":""},{"$f":"IF(AND(K$2>=[1]Données!$C2,[1]Planning!J$2<=[1]Données!$C2+[1]Données!$E2-1),\"=\",\"\")","v":""},{"$f":"IF(AND(L$2>=[1]Données!$C2,[1]Planning!K$2<=[1]Données!$C2+[1]Données!$E2-1),\"=\",\"\")","v":""},{"$f":"IF(AND(M$2>=[1]Données!$C2,[1]Planning!L$2<=[1]Données!$C2+[1]Données!$E2-1),\"=\",\"\")","v":""},{"$f":"IF(AND(N$2>=[1]Données!$C2,[1]Planning!M$2<=[1]Données!$C2+[1]Données!$E2-1),\"=\",\"\")","v":""},{"$f":"IF(AND(O$2>=[1]Données!$C2,[1]Planning!N$2<=[1]Données!$C2+[1]Données!$E2-1),\"=\",\"\")","v":""}]
[{"$f":"IF(DONNEES!A3=\"\",\"\",DONNEES!A3)","v":""},{"$f":"IF(DONNEES!B3=\"\",\"\",DONNEES!B3)","v":"1.2"},{"$f":"IF(DONNEES!F3=\"\",\"\",DONNEES!F3)","v":"mise en place réseaux"},{"$f":"IF(AND(D$2>=[1]Données!$C3,[1]Planning!C$2<=[1]Données!$C3+[1]Données!$E3-1),\"=\",\"\")","v":""},{"$f":"IF(AND(E$2>=[1]Données!$C3,[1]Planning!D$2<=[1]Données!$C3+[1]Données!$E3-1),\"=\",\"\")","v":"="},{"$f":"IF(AND(F$2>=[1]Données!$C3,[1]Planning!E$2<=[1]Données!$C3+[1]Données!$E3-1),\"=\",\"\")","v":"="},{"$f":"IF(AND(G$2>=[1]Données!$C3,[1]Planning!F$2<=[1]Données!$C3+[1]Données!$E3-1),\"=\",\"\")","v":""},{"$f":"IF(AND(H$2>=[1]Données!$C3,[1]Planning!G$2<=[1]Données!$C3+[1]Données!$E3-1),\"=\",\"\")","v":""},{"$f":"IF(AND(I$2>=[1]Données!$C3,[1]Planning!H$2<=[1]Données!$C3+[1]Données!$E3-1),\"=\",\"\")","v":""},{"$f":"IF(AND(J$2>=[1]Données!$C3,[1]Planning!I$2<=[1]Données!$C3+[1]Données!$E3-1),\"=\",\"\")","v":""},{"$f":"IF(AND(K$2>=[1]Données!$C3,[1]Planning!J$2<=[1]Données!$C3+[1]Données!$E3-1),\"=\",\"\")","v":""},{"$f":"IF(AND(L$2>=[1]Données!$C3,[1]Planning!K$2<=[1]Données!$C3+[1]Données!$E3-1),\"=\",\"\")","v":""},{"$f":"IF(AND(M$2>=[1]Données!$C3,[1]Planning!L$2<=[1]Données!$C3+[1]Données!$E3-1),\"=\",\"\")","v":""},{"$f":"IF(AND(N$2>=[1]Données!$C3,[1]Planning!M$2<=[1]Données!$C3+[1]Données!$E3-1),\"=\",\"\")","v":""},{"$f":"IF(AND(O$2>=[1]Données!$C3,[1]Planning!N$2<=[1]Données!$C3+[1]Données!$E3-1),\"=\",\"\")","v":""}]
[{"$f":"IF(DONNEES!A4=\"\",\"\",DONNEES!A4)","v":""},{"$f":"IF(DONNEES!B4=\"\",\"\",DONNEES!B4)","v":"1.3"},{"$f":"IF(DONNEES!F4=\"\",\"\",DONNEES!F4)","v":"terrassement"},{"$f":"IF(AND(D$2>=[1]Données!$C4,[1]Planning!C$2<=[1]Données!$C4+[1]Données!$E4-1),\"=\",\"\")","v":""},{"$f":"IF(AND(E$2>=[1]Données!$C4,[1]Planning!D$2<=[1]Données!$C4+[1]Données!$E4-1),\"=\",\"\")","v":""},{"$f":"IF(AND(F$2>=[1]Données!$C4,[1]Planning!E$2<=[1]Données!$C4+[1]Données!$E4-1),\"=\",\"\")","v":"="},{"$f":"IF(AND(G$2>=[1]Données!$C4,[1]Planning!F$2<=[1]Données!$C4+[1]Données!$E4-1),\"=\",\"\")","v":"="},{"$f":"IF(AND(H$2>=[1]Données!$C4,[1]Planning!G$2<=[1]Données!$C4+[1]Données!$E4-1),\"=\",\"\")","v":"="},{"$f":"IF(AND(I$2>=[1]Données!$C4,[1]Planning!H$2<=[1]Données!$C4+[1]Données!$E4-1),\"=\",\"\")","v":""},{"$f":"IF(AND(J$2>=[1]Données!$C4,[1]Planning!I$2<=[1]Données!$C4+[1]Données!$E4-1),\"=\",\"\")","v":""},{"$f":"IF(AND(K$2>=[1]Données!$C4,[1]Planning!J$2<=[1]Données!$C4+[1]Données!$E4-1),\"=\",\"\")","v":""},{"$f":"IF(AND(L$2>=[1]Données!$C4,[1]Planning!K$2<=[1]Données!$C4+[1]Données!$E4-1),\"=\",\"\")","v":""},{"$f":"IF(AND(M$2>=[1]Données!$C4,[1]Planning!L$2<=[1]Données!$C4+[1]Données!$E4-1),\"=\",\"\")","v":""},{"$f":"IF(AND(N$2>=[1]Données!$C4,[1]Planning!M$2<=[1]Données!$C4+[1]Données!$E4-1),\"=\",\"\")","v":""},{"$f":"IF(AND(O$2>=[1]Données!$C4,[1]Planning!N$2<=[1]Données!$C4+[1]Données!$E4-1),\"=\",\"\")","v":""}]
[{"$f":"IF(DONNEES!A5=\"\",\"\",DONNEES!A5)","v":""},{"$f":"IF(DONNEES!B5=\"\",\"\",DONNEES!B5)","v":"1.4"},{"$f":"IF(DONNEES!F5=\"\",\"\",DONNEES!F5)","v":"fouilles"},{"$f":"IF(AND(D$2>=[1]Données!$C5,[1]Planning!C$2<=[1]Données!$C5+[1]Données!$E5-1),\"=\",\"\")","v":""},{"$f":"IF(AND(E$2>=[1]Données!$C5,[1]Planning!D$2<=[1]Données!$C5+[1]Données!$E5-1),\"=\",\"\")","v":"="},{"$f":"IF(AND(F$2>=[1]Données!$C5,[1]Planning!E$2<=[1]Données!$C5+[1]Données!$E5-1),\"=\",\"\")","v":"="},{"$f":"IF(AND(G$2>=[1]Données!$C5,[1]Planning!F$2<=[1]Données!$C5+[1]Données!$E5-1),\"=\",\"\")","v":"="},{"$f":"IF(AND(H$2>=[1]Données!$C5,[1]Planning!G$2<=[1]Données!$C5+[1]Données!$E5-1),\"=\",\"\")","v":""},{"$f":"IF(AND(I$2>=[1]Données!$C5,[1]Planning!H$2<=[1]Données!$C5+[1]Données!$E5-1),\"=\",\"\")","v":""},{"$f":"IF(AND(J$2>=[1]Données!$C5,[1]Planning!I$2<=[1]Données!$C5+[1]Données!$E5-1),\"=\",\"\")","v":""},{"$f":"IF(AND(K$2>=[1]Données!$C5,[1]Planning!J$2<=[1]Données!$C5+[1]Données!$E5-1),\"=\",\"\")","v":""},{"$f":"IF(AND(L$2>=[1]Données!$C5,[1]Planning!K$2<=[1]Données!$C5+[1]Données!$E5-1),\"=\",\"\")","v":""},{"$f":"IF(AND(M$2>=[1]Données!$C5,[1]Planning!L$2<=[1]Données!$C5+[1]Données!$E5-1),\"=\",\"\")","v":""},{"$f":"IF(AND(N$2>=[1]Données!$C5,[1]Planning!M$2<=[1]Données!$C5+[1]Données!$E5-1),\"=\",\"\")","v":""},{"$f":"IF(AND(O$2>=[1]Données!$C5,[1]Planning!N$2<=[1]Données!$C5+[1]Données!$E5-1),\"=\",\"\")","v":""}]
[{"$f":"IF(DONNEES!A6=\"\",\"\",DONNEES!A6)","v":""},{"$f":"IF(DONNEES!B6=\"\",\"\",DONNEES!B6)","v":"1.5"},{"$f":"IF(DONNEES!F6=\"\",\"\",DONNEES!F6)","v":"démolition"},{"$f":"IF(AND(D$2>=[1]Données!$C6,[1]Planning!C$2<=[1]Données!$C6+[1]Données!$E6-1),\"=\",\"\")","v":"="},{"$f":"IF(AND(E$2>=[1]Données!$C6,[1]Planning!D$2<=[1]Données!$C6+[1]Données!$E6-1),\"=\",\"\")","v":"="},{"$f":"IF(AND(F$2>=[1]Données!$C6,[1]Planning!E$2<=[1]Données!$C6+[1]Données!$E6-1),\"=\",\"\")","v":"="},{"$f":"IF(AND(G$2>=[1]Données!$C6,[1]Planning!F$2<=[1]Données!$C6+[1]Données!$E6-1),\"=\",\"\")","v":""},{"$f":"IF(AND(H$2>=[1]Données!$C6,[1]Planning!G$2<=[1]Données!$C6+[1]Données!$E6-1),\"=\",\"\")","v":""},{"$f":"IF(AND(I$2>=[1]Données!$C6,[1]Planning!H$2<=[1]Données!$C6+[1]Données!$E6-1),\"=\",\"\")","v":""},{"$f":"IF(AND(J$2>=[1]Données!$C6,[1]Planning!I$2<=[1]Données!$C6+[1]Données!$E6-1),\"=\",\"\")","v":""},{"$f":"IF(AND(K$2>=[1]Données!$C6,[1]Planning!J$2<=[1]Données!$C6+[1]Données!$E6-1),\"=\",\"\")","v":""},{"$f":"IF(AND(L$2>=[1]Données!$C6,[1]Planning!K$2<=[1]Données!$C6+[1]Données!$E6-1),\"=\",\"\")","v":""},{"$f":"IF(AND(M$2>=[1]Données!$C6,[1]Planning!L$2<=[1]Données!$C6+[1]Données!$E6-1),\"=\",\"\")","v":""},{"$f":"IF(AND(N$2>=[1]Données!$C6,[1]Planning!M$2<=[1]Données!$C6+[1]Données!$E6-1),\"=\",\"\")","v":""},{"$f":"IF(AND(O$2>=[1]Données!$C6,[1]Planning!N$2<=[1]Données!$C6+[1]Données!$E6-1),\"=\",\"\")","v":""}]
[{"$f":"IF(DONNEES!A7=\"\",\"\",DONNEES!A7)","v":""},{"$f":"IF(DONNEES!B7=\"\",\"\",DONNEES!B7)","v":""},{"$f":"IF(DONNEES!F7=\"\",\"\",DONNEES!F7)","v":""},{"$f":"IF(AND(D$2>=[1]Données!$C7,[1]Planning!C$2<=[1]Données!$C7+[1]Données!$E7-1),\"=\",\"\")","v":""},{"$f":"IF(AND(E$2>=[1]Données!$C7,[1]Planning!D$2<=[1]Données!$C7+[1]Données!$E7-1),\"=\",\"\")","v":""},{"$f":"IF(AND(F$2>=[1]Données!$C7,[1]Planning!E$2<=[1]Données!$C7+[1]Données!$E7-1),\"=\",\"\")","v":""},{"$f":"IF(AND(G$2>=[1]Données!$C7,[1]Planning!F$2<=[1]Données!$C7+[1]Données!$E7-1),\"=\",\"\")","v":""},{"$f":"IF(AND(H$2>=[1]Données!$C7,[1]Planning!G$2<=[1]Données!$C7+[1]Données!$E7-1),\"=\",\"\")","v":""},{"$f":"IF(AND(I$2>=[1]Données!$C7,[1]Planning!H$2<=[1]Données!$C7+[1]Données!$E7-1),\"=\",\"\")","v":""},{"$f":"IF(AND(J$2>=[1]Données!$C7,[1]Planning!I$2<=[1]Données!$C7+[1]Données!$E7-1),\"=\",\"\")","v":""},{"$f":"IF(AND(K$2>=[1]Données!$C7,[1]Planning!J$2<=[1]Données!$C7+[1]Données!$E7-1),\"=\",\"\")","v":""},{"$f":"IF(AND(L$2>=[1]Données!$C7,[1]Planning!K$2<=[1]Données!$C7+[1]Données!$E7-1),\"=\",\"\")","v":"="},{"$f":"IF(AND(M$2>=[1]Données!$C7,[1]Planning!L$2<=[1]Données!$C7+[1]Données!$E7-1),\"=\",\"\")","v":"="},{"$f":"IF(AND(N$2>=[1]Données!$C7,[1]Planning!M$2<=[1]Données!$C7+[1]Données!$E7-1),\"=\",\"\")","v":""},{"$f":"IF(AND(O$2>=[1]Données!$C7,[1]Planning!N$2<=[1]Données!$C7+[1]Données!$E7-1),\"=\",\"\")","v":""}]
[{"$f":"IF(DONNEES!A8=\"\",\"\",DONNEES!A8)","v":""},{"$f":"IF(DONNEES!B8=\"\",\"\",DONNEES!B8)","v":""},{"$f":"IF(DONNEES!F8=\"\",\"\",DONNEES!F8)","v":""},{"$f":"IF(AND(D$2>=[1]Données!$C8,[1]Planning!C$2<=[1]Données!$C8+[1]Données!$E8-1),\"=\",\"\")","v":""},{"$f":"IF(AND(E$2>=[1]Données!$C8,[1]Planning!D$2<=[1]Données!$C8+[1]Données!$E8-1),\"=\",\"\")","v":""},{"$f":"IF(AND(F$2>=[1]Données!$C8,[1]Planning!E$2<=[1]Données!$C8+[1]Données!$E8-1),\"=\",\"\")","v":""},{"$f":"IF(AND(G$2>=[1]Données!$C8,[1]Planning!F$2<=[1]Données!$C8+[1]Données!$E8-1),\"=\",\"\")","v":""},{"$f":"IF(AND(H$2>=[1]Données!$C8,[1]Planning!G$2<=[1]Données!$C8+[1]Données!$E8-1),\"=\",\"\")","v":"="},{"$f":"IF(AND(I$2>=[1]Données!$C8,[1]Planning!H$2<=[1]Données!$C8+[1]Données!$E8-1),\"=\",\"\")","v":"="},{"$f":"IF(AND(J$2>=[1]Données!$C8,[1]Planning!I$2<=[1]Données!$C8+[1]Données!$E8-1),\"=\",\"\")","v":""},{"$f":"IF(AND(K$2>=[1]Données!$C8,[1]Planning!J$2<=[1]Données!$C8+[1]Données!$E8-1),\"=\",\"\")","v":""},{"$f":"IF(AND(L$2>=[1]Données!$C8,[1]Planning!K$2<=[1]Données!$C8+[1]Données!$E8-1),\"=\",\"\")","v":""},{"$f":"IF(AND(M$2>=[1]Données!$C8,[1]Planning!L$2<=[1]Données!$C8+[1]Données!$E8-1),\"=\",\"\")","v":""},{"$f":"IF(AND(N$2>=[1]Données!$C8,[1]Planning!M$2<=[1]Données!$C8+[1]Données!$E8-1),\"=\",\"\")","v":""},{"$f":"IF(AND(O$2>=[1]Données!$C8,[1]Planning!N$2<=[1]Données!$C8+[1]Données!$E8-1),\"=\",\"\")","v":""}]
[{"$f":"IF(DONNEES!A9=\"\",\"\",DONNEES!A9)","v":2},{"$f":"IF(DONNEES!B9=\"\",\"\",DONNEES!B9)","v":"2.1"},{"$f":"IF(DONNEES!F9=\"\",\"\",DONNEES!F9)","v":"construction cloture"},{"$f":"IF(AND(D$2>=[1]Données!$C9,[1]Planning!C$2<=[1]Données!$C9+[1]Données!$E9-1),\"=\",\"\")","v":""},{"$f":"IF(AND(E$2>=[1]Données!$C9,[1]Planning!D$2<=[1]Données!$C9+[1]Données!$E9-1),\"=\",\"\")","v":""},{"$f":"IF(AND(F$2>=[1]Données!$C9,[1]Planning!E$2<=[1]Données!$C9+[1]Données!$E9-1),\"=\",\"\")","v":""},{"$f":"IF(AND(G$2>=[1]Données!$C9,[1]Planning!F$2<=[1]Données!$C9+[1]Données!$E9-1),\"=\",\"\")","v":""},{"$f":"IF(AND(H$2>=[1]Données!$C9,[1]Planning!G$2<=[1]Données!$C9+[1]Données!$E9-1),\"=\",\"\")","v":""},{"$f":"IF(AND(I$2>=[1]Données!$C9,[1]Planning!H$2<=[1]Données!$C9+[1]Données!$E9-1),\"=\",\"\")","v":""},{"$f":"IF(AND(J$2>=[1]Données!$C9,[1]Planning!I$2<=[1]Données!$C9+[1]Données!$E9-1),\"=\",\"\")","v":""},{"$f":"IF(AND(K$2>=[1]Données!$C9,[1]Planning!J$2<=[1]Données!$C9+[1]Données!$E9-1),\"=\",\"\")","v":""},{"$f":"IF(AND(L$2>=[1]Données!$C9,[1]Planning!K$2<=[1]Données!$C9+[1]Données!$E9-1),\"=\",\"\")","v":""},{"$f":"IF(AND(M$2>=[1]Données!$C9,[1]Planning!L$2<=[1]Données!$C9+[1]Données!$E9-1),\"=\",\"\")","v":""},{"$f":"IF(AND(N$2>=[1]Données!$C9,[1]Planning!M$2<=[1]Données!$C9+[1]Données!$E9-1),\"=\",\"\")","v":""},{"$f":"IF(AND(O$2>=[1]Données!$C9,[1]Planning!N$2<=[1]Données!$C9+[1]Données!$E9-1),\"=\",\"\")","v":"="}]
[{"$f":"IF(DONNEES!A10=\"\",\"\",DONNEES!A10)","v":""},{"$f":"IF(DONNEES!B10=\"\",\"\",DONNEES!B10)","v":"2.2"},{"$f":"IF(DONNEES!F10=\"\",\"\",DONNEES!F10)","v":"etc"},{"$f":"IF(AND(D$2>=[1]Données!$C10,[1]Planning!C$2<=[1]Données!$C10+[1]Données!$E10-1),\"=\",\"\")","v":""},{"$f":"IF(AND(E$2>=[1]Données!$C10,[1]Planning!D$2<=[1]Données!$C10+[1]Données!$E10-1),\"=\",\"\")","v":""},{"$f":"IF(AND(F$2>=[1]Données!$C10,[1]Planning!E$2<=[1]Données!$C10+[1]Données!$E10-1),\"=\",\"\")","v":""},{"$f":"IF(AND(G$2>=[1]Données!$C10,[1]Planning!F$2<=[1]Données!$C10+[1]Données!$E10-1),\"=\",\"\")","v":""},{"$f":"IF(AND(H$2>=[1]Données!$C10,[1]Planning!G$2<=[1]Données!$C10+[1]Données!$E10-1),\"=\",\"\")","v":""},{"$f":"IF(AND(I$2>=[1]Données!$C10,[1]Planning!H$2<=[1]Données!$C10+[1]Données!$E10-1),\"=\",\"\")","v":""},{"$f":"IF(AND(J$2>=[1]Données!$C10,[1]Planning!I$2<=[1]Données!$C10+[1]Données!$E10-1),\"=\",\"\")","v":""},{"$f":"IF(AND(K$2>=[1]Données!$C10,[1]Planning!J$2<=[1]Données!$C10+[1]Données!$E10-1),\"=\",\"\")","v":""},{"$f":"IF(AND(L$2>=[1]Données!$C10,[1]Planning!K$2<=[1]Données!$C10+[1]Données!$E10-1),\"=\",\"\")","v":""},{"$f":"IF(AND(M$2>=[1]Données!$C10,[1]Planning!L$2<=[1]Données!$C10+[1]Données!$E10-1),\"=\",\"\")","v":""},{"$f":"IF(AND(N$2>=[1]Données!$C10,[1]Planning!M$2<=[1]Données!$C10+[1]Données!$E10-1),\"=\",\"\")","v":""},{"$f":"IF(AND(O$2>=[1]Données!$C10,[1]Planning!N$2<=[1]Données!$C10+[1]Données!$E10-1),\"=\",\"\")","v":""}]
[{"$f":"IF(DONNEES!A11=\"\",\"\",DONNEES!A11)","v":""},{"$f":"IF(DONNEES!B11=\"\",\"\",DONNEES!B11)","v":"2.3"},{"$f":"IF(DONNEES!F11=\"\",\"\",DONNEES!F11)","v":"etc"},{"$f":"IF(AND(D$2>=[1]Données!$C11,[1]Planning!C$2<=[1]Données!$C11+[1]Données!$E11-1),\"=\",\"\")","v":""},{"$f":"IF(AND(E$2>=[1]Données!$C11,[1]Planning!D$2<=[1]Données!$C11+[1]Données!$E11-1),\"=\",\"\")","v":"="},{"$f":"IF(AND(F$2>=[1]Données!$C11,[1]Planning!E$2<=[1]Données!$C11+[1]Données!$E11-1),\"=\",\"\")","v":"="},{"$f":"IF(AND(G$2>=[1]Données!$C11,[1]Planning!F$2<=[1]Données!$C11+[1]Données!$E11-1),\"=\",\"\")","v":""},{"$f":"IF(AND(H$2>=[1]Données!$C11,[1]Planning!G$2<=[1]Données!$C11+[1]Données!$E11-1),\"=\",\"\")","v":""},{"$f":"IF(AND(I$2>=[1]Données!$C11,[1]Planning!H$2<=[1]Données!$C11+[1]Données!$E11-1),\"=\",\"\")","v":""},{"$f":"IF(AND(J$2>=[1]Données!$C11,[1]Planning!I$2<=[1]Données!$C11+[1]Données!$E11-1),\"=\",\"\")","v":""},{"$f":"IF(AND(K$2>=[1]Données!$C11,[1]Planning!J$2<=[1]Données!$C11+[1]Données!$E11-1),\"=\",\"\")","v":""},{"$f":"IF(AND(L$2>=[1]Données!$C11,[1]Planning!K$2<=[1]Données!$C11+[1]Données!$E11-1),\"=\",\"\")","v":""},{"$f":"IF(AND(M$2>=[1]Données!$C11,[1]Planning!L$2<=[1]Données!$C11+[1]Données!$E11-1),\"=\",\"\")","v":""},{"$f":"IF(AND(N$2>=[1]Données!$C11,[1]Planning!M$2<=[1]Données!$C11+[1]Données!$E11-1),\"=\",\"\")","v":""},{"$f":"IF(AND(O$2>=[1]Données!$C11,[1]Planning!N$2<=[1]Données!$C11+[1]Données!$E11-1),\"=\",\"\")","v":""}]
[{"$f":"IF(DONNEES!A12=\"\",\"\",DONNEES!A12)","v":""},{"$f":"IF(DONNEES!B12=\"\",\"\",DONNEES!B12)","v":""},{"$f":"IF(DONNEES!F12=\"\",\"\",DONNEES!F12)","v":""},{"$f":"IF(AND(D$2>=[1]Données!$C12,[1]Planning!C$2<=[1]Données!$C12+[1]Données!$E12-1),\"=\",\"\")","v":""},{"$f":"IF(AND(E$2>=[1]Données!$C12,[1]Planning!D$2<=[1]Données!$C12+[1]Données!$E12-1),\"=\",\"\")","v":""},{"$f":"IF(AND(F$2>=[1]Données!$C12,[1]Planning!E$2<=[1]Données!$C12+[1]Données!$E12-1),\"=\",\"\")","v":""},{"$f":"IF(AND(G$2>=[1]Données!$C12,[1]Planning!F$2<=[1]Données!$C12+[1]Données!$E12-1),\"=\",\"\")","v":""},{"$f":"IF(AND(H$2>=[1]Données!$C12,[1]Planning!G$2<=[1]Données!$C12+[1]Données!$E12-1),\"=\",\"\")","v":""},{"$f":"IF(AND(I$2>=[1]Données!$C12,[1]Planning!H$2<=[1]Données!$C12+[1]Données!$E12-1),\"=\",\"\")","v":""},{"$f":"IF(AND(J$2>=[1]Données!$C12,[1]Planning!I$2<=[1]Données!$C12+[1]Données!$E12-1),\"=\",\"\")","v":""},{"$f":"IF(AND(K$2>=[1]Données!$C12,[1]Planning!J$2<=[1]Données!$C12+[1]Données!$E12-1),\"=\",\"\")","v":"="},{"$f":"IF(AND(L$2>=[1]Données!$C12,[1]Planning!K$2<=[1]Données!$C12+[1]Données!$E12-1),\"=\",\"\")","v":"="},{"$f":"IF(AND(M$2>=[1]Données!$C12,[1]Planning!L$2<=[1]Données!$C12+[1]Données!$E12-1),\"=\",\"\")","v":"="},{"$f":"IF(AND(N$2>=[1]Données!$C12,[1]Planning!M$2<=[1]Données!$C12+[1]Données!$E12-1),\"=\",\"\")","v":""},{"$f":"IF(AND(O$2>=[1]Données!$C12,[1]Planning!N$2<=[1]Données!$C12+[1]Données!$E12-1),\"=\",\"\")","v":""}]
[{"$f":"IF(DONNEES!A13=\"\",\"\",DONNEES!A13)","v":3},{"$f":"IF(DONNEES!B13=\"\",\"\",DONNEES!B13)","v":"3.1"},{"$f":"IF(DONNEES!F13=\"\",\"\",DONNEES!F13)","v":"etc"},{"$f":"IF(AND(D$2>=[1]Données!$C13,[1]Planning!C$2<=[1]Données!$C13+[1]Données!$E13-1),\"=\",\"\")","v":""},{"$f":"IF(AND(E$2>=[1]Données!$C13,[1]Planning!D$2<=[1]Données!$C13+[1]Données!$E13-1),\"=\",\"\")","v":""},{"$f":"IF(AND(F$2>=[1]Données!$C13,[1]Planning!E$2<=[1]Données!$C13+[1]Données!$E13-1),\"=\",\"\")","v":""},{"$f":"IF(AND(G$2>=[1]Données!$C13,[1]Planning!F$2<=[1]Données!$C13+[1]Données!$E13-1),\"=\",\"\")","v":""},{"$f":"IF(AND(H$2>=[1]Données!$C13,[1]Planning!G$2<=[1]Données!$C13+[1]Données!$E13-1),\"=\",\"\")","v":""},{"$f":"IF(AND(I$2>=[1]Données!$C13,[1]Planning!H$2<=[1]Données!$C13+[1]Données!$E13-1),\"=\",\"\")","v":""},{"$f":"IF(AND(J$2>=[1]Données!$C13,[1]Planning!I$2<=[1]Données!$C13+[1]Données!$E13-1),\"=\",\"\")","v":""},{"$f":"IF(AND(K$2>=[1]Données!$C13,[1]Planning!J$2<=[1]Données!$C13+[1]Données!$E13-1),\"=\",\"\")","v":""},{"$f":"IF(AND(L$2>=[1]Données!$C13,[1]Planning!K$2<=[1]Données!$C13+[1]Données!$E13-1),\"=\",\"\")","v":""},{"$f":"IF(AND(M$2>=[1]Données!$C13,[1]Planning!L$2<=[1]Données!$C13+[1]Données!$E13-1),\"=\",\"\")","v":""},{"$f":"IF(AND(N$2>=[1]Données!$C13,[1]Planning!M$2<=[1]Données!$C13+[1]Données!$E13-1),\"=\",\"\")","v":""},{"$f":"IF(AND(O$2>=[1]Données!$C13,[1]Planning!N$2<=[1]Données!$C13+[1]Données!$E13-1),\"=\",\"\")","v":""}]
[{"$f":"IF(DONNEES!A14=\"\",\"\",DONNEES!A14)","v":""},{"$f":"IF(DONNEES!B14=\"\",\"\",DONNEES!B14)","v":"3.2"},{"$f":"IF(DONNEES!F14=\"\",\"\",DONNEES!F14)","v":"etc"},{"$f":"IF(AND(D$2>=[1]Données!$C14,[1]Planning!C$2<=[1]Données!$C14+[1]Données!$E14-1),\"=\",\"\")","v":""},{"$f":"IF(AND(E$2>=[1]Données!$C14,[1]Planning!D$2<=[1]Données!$C14+[1]Données!$E14-1),\"=\",\"\")","v":""},{"$f":"IF(AND(F$2>=[1]Données!$C14,[1]Planning!E$2<=[1]Données!$C14+[1]Données!$E14-1),\"=\",\"\")","v":""},{"$f":"IF(AND(G$2>=[1]Données!$C14,[1]Planning!F$2<=[1]Données!$C14+[1]Données!$E14-1),\"=\",\"\")","v":""},{"$f":"IF(AND(H$2>=[1]Données!$C14,[1]Planning!G$2<=[1]Données!$C14+[1]Données!$E14-1),\"=\",\"\")","v":""},{"$f":"IF(AND(I$2>=[1]Données!$C14,[1]Planning!H$2<=[1]Données!$C14+[1]Données!$E14-1),\"=\",\"\")","v":""},{"$f":"IF(AND(J$2>=[1]Données!$C14,[1]Planning!I$2<=[1]Données!$C14+[1]Données!$E14-1),\"=\",\"\")","v":""},{"$f":"IF(AND(K$2>=[1]Données!$C14,[1]Planning!J$2<=[1]Données!$C14+[1]Données!$E14-1),\"=\",\"\")","v":""},{"$f":"IF(AND(L$2>=[1]Données!$C14,[1]Planning!K$2<=[1]Données!$C14+[1]Données!$E14-1),\"=\",\"\")","v":""},{"$f":"IF(AND(M$2>=[1]Données!$C14,[1]Planning!L$2<=[1]Données!$C14+[1]Données!$E14-1),\"=\",\"\")","v":""},{"$f":"IF(AND(N$2>=[1]Données!$C14,[1]Planning!M$2<=[1]Données!$C14+[1]Données!$E14-1),\"=\",\"\")","v":""},{"$f":"IF(AND(O$2>=[1]Données!$C14,[1]Planning!N$2<=[1]Données!$C14+[1]Données!$E14-1),\"=\",\"\")","v":""}]