{"text_format":"3","workbook":"xlsx","n_sheets":4,"sheets":["Feuil1","Base","Résultat","Impression"],"not_rendered":{"charts":2,"macros":1,"defined_names":4},"read":"whole","date_system":"1900"}

{"sheet":"Feuil1","index":0,"n_rows":11,"n_cols":13,"rows_kept":11}
["Client","Date","Oppération","Parcelle","Culture","Surface","Produit","Observation","Campagne"]
["Florian","15/12/2014","Moisson","Sous la route",{"$f":"VLOOKUP(Tableau1[Parcelle],Tableau7[[Parcelles]:[Campagne]],3,0)","v":"Blé"},{"$f":"VLOOKUP(Tableau1[Parcelle],Tableau7[[Parcelles]:[Campagne]],2,0)","v":{"v":10,"d":"10.00"}},"Urée 46%","","2013/2014"]
["Florian","16/12/2014","Pulvérisation","La plaine",{"$f":"VLOOKUP(Tableau1[Parcelle],Tableau7[[Parcelles]:[Campagne]],3,0)","v":"Tournesol"},{"$f":"VLOOKUP(Tableau1[Parcelle],Tableau7[[Parcelles]:[Campagne]],2,0)","v":{"v":20,"d":"20.00"}},"","","2013/2014","",null,null,""]
["Florian","17/12/2014","Labour","Coteau",{"$f":"VLOOKUP(Tableau1[Parcelle],Tableau7[[Parcelles]:[Campagne]],3,0)","v":"Tournesol"},{"$f":"VLOOKUP(Tableau1[Parcelle],Tableau7[[Parcelles]:[Campagne]],2,0)","v":8.35},"","","2013/2014"]
["Florian","15/12/2014","Moisson","Devant la maison",{"$f":"VLOOKUP(Tableau1[Parcelle],Tableau7[[Parcelles]:[Campagne]],3,0)","v":"Tournesol"},{"$f":"VLOOKUP(Tableau1[Parcelle],Tableau7[[Parcelles]:[Campagne]],2,0)","v":2.35},"Axial","","2013/2014"]
["Florian","15/12/2014","Labour","Coteau",{"$f":"VLOOKUP(Tableau1[Parcelle],Tableau7[[Parcelles]:[Campagne]],3,0)","v":"Tournesol"},{"$f":"VLOOKUP(Tableau1[Parcelle],Tableau7[[Parcelles]:[Campagne]],2,0)","v":8.35},"","","2013/2014"]
["Durand","13/12/2014","Pulvérisation","Bouscas",{"$f":"VLOOKUP(Tableau1[Parcelle],Tableau7[[Parcelles]:[Campagne]],3,0)","v":"Blé"},{"$f":"VLOOKUP(Tableau1[Parcelle],Tableau7[[Parcelles]:[Campagne]],2,0)","v":{"v":10,"d":"10.00"}},"Amonitrate 33.5%",null,"2013/2014"]
["Florian","17/12/2014","Moisson","sgdsfd",{"$f":"VLOOKUP(Tableau1[Parcelle],Tableau7[[Parcelles]:[Campagne]],3,0)","v":"Maïs"},{"$f":"VLOOKUP(Tableau1[Parcelle],Tableau7[[Parcelles]:[Campagne]],2,0)","v":{"v":55,"d":"55.00"}},"Urée 46%","","2013/2014"]
["Durand","17/12/2014","Engrais","sgdsfd",{"$f":"VLOOKUP(Tableau1[Parcelle],Tableau7[[Parcelles]:[Campagne]],3,0)","v":"Maïs"},{"$f":"VLOOKUP(Tableau1[Parcelle],Tableau7[[Parcelles]:[Campagne]],2,0)","v":{"v":55,"d":"55.00"}},"Amonitrate 33.5%","","2013/2014"]
["Durand","18/12/2014","Moisson","Sous la route",{"$f":"VLOOKUP(Tableau1[Parcelle],Tableau7[[Parcelles]:[Campagne]],3,0)","v":"Blé"},{"$f":"VLOOKUP(Tableau1[Parcelle],Tableau7[[Parcelles]:[Campagne]],2,0)","v":{"v":10,"d":"10.00"}},"","55","2013/2014"]
["Durand","18/12/2014","Pulvérisation","Sous la route",{"$f":"VLOOKUP(Tableau1[Parcelle],Tableau7[[Parcelles]:[Campagne]],3,0)","v":"Blé"},{"$f":"VLOOKUP(Tableau1[Parcelle],Tableau7[[Parcelles]:[Campagne]],2,0)","v":{"v":10,"d":"10.00"}},"Axial","","2013/2014"]

{"sheet":"Base","index":1,"n_rows":500,"n_cols":38,"rows_kept":500}
["Opération","Tarrif",{"$nulls":3},"Cultures",null,"Produits",null,"Client","Parcelles","Surface","Culture","Campagne",null,"Campagne","Campagne en cour (1 oui ; 0 non)",{"$nulls":12},"Clients","Adresse","Code postal","Ville","Téléphone",null,"Campagne","Client","Parcelle"]
["Labour",{"v":90,"d":"090.00€"},{"$nulls":3},"Blé",null,"Roundup",null,"Durand","Bouscas",{"v":10,"d":"010.00"},"Blé","2013/2014",null,"2013/2014",0,{"$nulls":12},"Durand","St Gauzens",81390,"ST Gauzens","06-15-45-85-58",null,{"$f":"IF(N2>0,Tableau7[[#This Row],[Campagne]],)","v":"2013/2014"},{"$f":"IF(J2>0,Tableau7[[#This Row],[Client]],)","v":"Durand"},{"$f":"IF(K2>0,Tableau7[[#This Row],[Parcelles]],)","v":"Bouscas"}]
["Pulvérisation",{"v":15,"d":"015.00€"},{"$nulls":3},"Maïs",null,"Amonitrate 33.5%",null,"Durand","Sous la route",{"v":10,"d":"010.00"},"Blé","2013/2014",null,"2014/2015",0,{"$nulls":12},"Florian","Le Bouscas",81600,"Cadalen","06-45-68-85-27",null,{"$f":"IF(N3>0,Tableau7[[#This Row],[Campagne]],)","v":"2013/2014"},{"$f":"IF(J3>0,Tableau7[[#This Row],[Client]],)","v":"Durand"},{"$f":"IF(K3>0,Tableau7[[#This Row],[Parcelles]],)","v":"Sous la route"}]
["Moisson",{"v":90,"d":"090.00€"},{"$nulls":3},"Tournesol",null,"Urée 46%",null,"Florian","La plaine",{"v":20,"d":"020.00"},"Tournesol","2013/2014",null,"2015/2016",0,{"$nulls":12},"Moi","Callepe",81120,"Lombers","06-45-68-85-27",null,{"$f":"IF(N4>0,Tableau7[[#This Row],[Campagne]],)","v":"2013/2014"},{"$f":"IF(J4>0,Tableau7[[#This Row],[Client]],)","v":"Florian"},{"$f":"IF(K4>0,Tableau7[[#This Row],[Parcelles]],)","v":"La plaine"}]
["Engrais",{"v":15,"d":"015.00€"},{"$nulls":3},"Colza",null,"Axial",null,"Florian","Devant la maison",{"v":2.35,"d":"002.35"},"Tournesol","2013/2014",null,"2016/2017",1,{"$nulls":12},"Tisse","Le Bouscas","81600","Cadalen","",null,{"$f":"IF(N5>0,Tableau7[[#This Row],[Campagne]],)","v":"2013/2014"},{"$f":"IF(J5>0,Tableau7[[#This Row],[Client]],)","v":"Florian"},{"$f":"IF(K5>0,Tableau7[[#This Row],[Parcelles]],)","v":"Devant la maison"}]
["Déchaumage",{"v":30,"d":"030.00€"},{"$nulls":7},"Moi","Coteau",{"v":8.35,"d":"008.35"},"Tournesol","2013/2014",{"$nulls":15},"","",{"$nulls":4},{"$f":"IF(N6>0,Tableau7[[#This Row],[Campagne]],)","v":"2013/2014"},{"$f":"IF(J6>0,Tableau7[[#This Row],[Client]],)","v":"Moi"},{"$f":"IF(K6>0,Tableau7[[#This Row],[Parcelles]],)","v":"Coteau"}]
[{"$nulls":9},"Moi","Au dessus",{"v":7.35,"d":"007.35"},"Blé","2013/2014",{"$nulls":21},{"$f":"IF(N7>0,Tableau7[[#This Row],[Campagne]],)","v":"2013/2014"},{"$f":"IF(J7>0,Tableau7[[#This Row],[Client]],)","v":"Moi"},{"$f":"IF(K7>0,Tableau7[[#This Row],[Parcelles]],)","v":"Au dessus"}]
[{"$nulls":9},"Moi","Devant la maison",{"v":86.5,"d":"086.50"},"Blé","2013/2014",{"$nulls":21},{"$f":"IF(N8>0,Tableau7[[#This Row],[Campagne]],)","v":"2013/2014"},{"$f":"IF(J8>0,Tableau7[[#This Row],[Client]],)","v":"Moi"},{"$f":"IF(K8>0,Tableau7[[#This Row],[Parcelles]],)","v":"Devant la maison"}]
[{"$nulls":9},"Florian","Plateau",{"v":15,"d":"015.00"},"Tournesol","2013/2014",{"$nulls":21},{"$f":"IF(N9>0,Tableau7[[#This Row],[Campagne]],)","v":"2013/2014"},{"$f":"IF(J9>0,Tableau7[[#This Row],[Client]],)","v":"Florian"},{"$f":"IF(K9>0,Tableau7[[#This Row],[Parcelles]],)","v":"Plateau"}]
[{"$nulls":9},"Florian","Essais",{"v":4.25,"d":"004.25"},"Blé","2014/2015",{"$nulls":21},{"$f":"IF(N10>0,Tableau7[[#This Row],[Campagne]],)","v":"2014/2015"},{"$f":"IF(J10>0,Tableau7[[#This Row],[Client]],)","v":"Florian"},{"$f":"IF(K10>0,Tableau7[[#This Row],[Parcelles]],)","v":"Essais"}]
[{"$nulls":9},"Durand","sgfsd",{"v":15,"d":"015.00"},"Tournesol","2013/2014",{"$nulls":21},{"$f":"IF(N11>0,Tableau7[[#This Row],[Campagne]],)","v":"2013/2014"},{"$f":"IF(J11>0,Tableau7[[#This Row],[Client]],)","v":"Durand"},{"$f":"IF(K11>0,Tableau7[[#This Row],[Parcelles]],)","v":"sgfsd"}]
[{"$nulls":9},"Florian","klhk",{"v":85,"d":"085.00"},"Maïs","2013/2014",{"$nulls":21},{"$f":"IF(N12>0,Tableau7[[#This Row],[Campagne]],)","v":"2013/2014"},{"$f":"IF(J12>0,Tableau7[[#This Row],[Client]],)","v":"Florian"},{"$f":"IF(K12>0,Tableau7[[#This Row],[Parcelles]],)","v":"klhk"}]
[{"$nulls":9},"Florian","sgdsfd",{"v":55,"d":"055.00"},"Maïs","2014/2015",{"$nulls":21},{"$f":"IF(N13>0,Tableau7[[#This Row],[Campagne]],)","v":"2014/2015"},{"$f":"IF(J13>0,Tableau7[[#This Row],[Client]],)","v":"Florian"},{"$f":"IF(K13>0,Tableau7[[#This Row],[Parcelles]],)","v":"sgdsfd"}]
[{"$nulls":9},"Florian","dsfh",{"v":45,"d":"045.00"},"Maïs","2014/2015",{"$nulls":21},{"$f":"IF(N14>0,Tableau7[[#This Row],[Campagne]],)","v":"2014/2015"},{"$f":"IF(J14>0,Tableau7[[#This Row],[Client]],)","v":"Florian"},{"$f":"IF(K14>0,Tableau7[[#This Row],[Parcelles]],)","v":"dsfh"}]
[{"$nulls":9},"Moi","zetrf",{"v":85,"d":"085.00"},"Tournesol","2014/2015",{"$nulls":21},{"$f":"IF(N15>0,Tableau7[[#This Row],[Campagne]],)","v":"2014/2015"},{"$f":"IF(J15>0,Tableau7[[#This Row],[Client]],)","v":"Moi"},{"$f":"IF(K15>0,Tableau7[[#This Row],[Parcelles]],)","v":"zetrf"}]
[{"$nulls":9},"Florian","Essais",{"v":45,"d":"045.00"},"Maïs","2013/2014",{"$nulls":21},{"$f":"IF(N16>0,Tableau7[[#This Row],[Campagne]],)","v":"2013/2014"},{"$f":"IF(J16>0,Tableau7[[#This Row],[Client]],)","v":"Florian"},{"$f":"IF(K16>0,Tableau7[[#This Row],[Parcelles]],)","v":"Essais"}]
[{"$nulls":9},"Florian","Essais0",{"v":15,"d":"015.00"},"Maïs","2015/2016",{"$nulls":21},{"$f":"IF(N17>0,Tableau7[[#This Row],[Campagne]],)","v":"2015/2016"},{"$f":"IF(J17>0,Tableau7[[#This Row],[Client]],)","v":"Florian"},{"$f":"IF(K17>0,Tableau7[[#This Row],[Parcelles]],)","v":"Essais0"}]
[{"$nulls":35},{"$f":"IF(N18>0,Tableau7[[#This Row],[Campagne]],)","v":0},{"$f":"IF(J18>0,Tableau7[[#This Row],[Client]],)","v":0},{"$f":"IF(K18>0,Tableau7[[#This Row],[Parcelles]],)","v":0}]
[{"$nulls":35},{"$f":"IF(N19>0,Tableau7[[#This Row],[Campagne]],)","v":0},{"$f":"IF(J19>0,Tableau7[[#This Row],[Client]],)","v":0},{"$f":"IF(K19>0,Tableau7[[#This Row],[Parcelles]],)","v":0}]
[{"$nulls":35},{"$f":"IF(N20>0,Tableau7[[#This Row],[Campagne]],)","v":0},{"$f":"IF(J20>0,Tableau7[[#This Row],[Client]],)","v":0},{"$f":"IF(K20>0,Tableau7[[#This Row],[Parcelles]],)","v":0}]
[{"$nulls":35},{"$f":"IF(N21>0,Tableau7[[#This Row],[Campagne]],)","v":0},{"$f":"IF(J21>0,Tableau7[[#This Row],[Client]],)","v":0},{"$f":"IF(K21>0,Tableau7[[#This Row],[Parcelles]],)","v":0}]
[{"$nulls":35},{"$f":"IF(N22>0,Tableau7[[#This Row],[Campagne]],)","v":0},{"$f":"IF(J22>0,Tableau7[[#This Row],[Client]],)","v":0},{"$f":"IF(K22>0,Tableau7[[#This Row],[Parcelles]],)","v":0}]
[{"$nulls":35},{"$f":"IF(N23>0,Tableau7[[#This Row],[Campagne]],)","v":0},{"$f":"IF(J23>0,Tableau7[[#This Row],[Client]],)","v":0},{"$f":"IF(K23>0,Tableau7[[#This Row],[Parcelles]],)","v":0}]
[{"$nulls":35},{"$f":"IF(N24>0,Tableau7[[#This Row],[Campagne]],)","v":0},{"$f":"IF(J24>0,Tableau7[[#This Row],[Client]],)","v":0},{"$f":"IF(K24>0,Tableau7[[#This Row],[Parcelles]],)","v":0}]
[{"$nulls":35},{"$f":"IF(N25>0,Tableau7[[#This Row],[Campagne]],)","v":0},{"$f":"IF(J25>0,Tableau7[[#This Row],[Client]],)","v":0},{"$f":"IF(K25>0,Tableau7[[#This Row],[Parcelles]],)","v":0}]
[{"$nulls":35},{"$f":"IF(N26>0,Tableau7[[#This Row],[Campagne]],)","v":0},{"$f":"IF(J26>0,Tableau7[[#This Row],[Client]],)","v":0},{"$f":"IF(K26>0,Tableau7[[#This Row],[Parcelles]],)","v":0}]
[{"$nulls":35},{"$f":"IF(N27>0,Tableau7[[#This Row],[Campagne]],)","v":0},{"$f":"IF(J27>0,Tableau7[[#This Row],[Client]],)","v":0},{"$f":"IF(K27>0,Tableau7[[#This Row],[Parcelles]],)","v":0}]
[{"$nulls":35},{"$f":"IF(N28>0,Tableau7[[#This Row],[Campagne]],)","v":0},{"$f":"IF(J28>0,Tableau7[[#This Row],[Client]],)","v":0},{"$f":"IF(K28>0,Tableau7[[#This Row],[Parcelles]],)","v":0}]
[{"$nulls":35},{"$f":"IF(N29>0,Tableau7[[#This Row],[Campagne]],)","v":0},{"$f":"IF(J29>0,Tableau7[[#This Row],[Client]],)","v":0},{"$f":"IF(K29>0,Tableau7[[#This Row],[Parcelles]],)","v":0}]
[{"$nulls":35},{"$f":"IF(N30>0,Tableau7[[#This Row],[Campagne]],)","v":0},{"$f":"IF(J30>0,Tableau7[[#This Row],[Client]],)","v":0},{"$f":"IF(K30>0,Tableau7[[#This Row],[Parcelles]],)","v":0}]
[{"$nulls":35},{"$f":"IF(N31>0,Tableau7[[#This Row],[Campagne]],)","v":0},{"$f":"IF(J31>0,Tableau7[[#This Row],[Client]],)","v":0},{"$f":"IF(K31>0,Tableau7[[#This Row],[Parcelles]],)","v":0}]
[{"$nulls":35},{"$f":"IF(N32>0,Tableau7[[#This Row],[Campagne]],)","v":0},{"$f":"IF(J32>0,Tableau7[[#This Row],[Client]],)","v":0},{"$f":"IF(K32>0,Tableau7[[#This Row],[Parcelles]],)","v":0}]
[{"$nulls":35},{"$f":"IF(N33>0,Tableau7[[#This Row],[Campagne]],)","v":0},{"$f":"IF(J33>0,Tableau7[[#This Row],[Client]],)","v":0},{"$f":"IF(K33>0,Tableau7[[#This Row],[Parcelles]],)","v":0}]
[{"$nulls":35},{"$f":"IF(N34>0,Tableau7[[#This Row],[Campagne]],)","v":0},{"$f":"IF(J34>0,Tableau7[[#This Row],[Client]],)","v":0},{"$f":"IF(K34>0,Tableau7[[#This Row],[Parcelles]],)","v":0}]
[{"$nulls":35},{"$f":"IF(N35>0,Tableau7[[#This Row],[Campagne]],)","v":0},{"$f":"IF(J35>0,Tableau7[[#This Row],[Client]],)","v":0},{"$f":"IF(K35>0,Tableau7[[#This Row],[Parcelles]],)","v":0}]
[{"$nulls":35},{"$f":"IF(N36>0,Tableau7[[#This Row],[Campagne]],)","v":0},{"$f":"IF(J36>0,Tableau7[[#This Row],[Client]],)","v":0},{"$f":"IF(K36>0,Tableau7[[#This Row],[Parcelles]],)","v":0}]
[{"$nulls":35},{"$f":"IF(N37>0,Tableau7[[#This Row],[Campagne]],)","v":0},{"$f":"IF(J37>0,Tableau7[[#This Row],[Client]],)","v":0},{"$f":"IF(K37>0,Tableau7[[#This Row],[Parcelles]],)","v":0}]
[{"$nulls":35},{"$f":"IF(N38>0,Tableau7[[#This Row],[Campagne]],)","v":0},{"$f":"IF(J38>0,Tableau7[[#This Row],[Client]],)","v":0},{"$f":"IF(K38>0,Tableau7[[#This Row],[Parcelles]],)","v":0}]
[{"$nulls":35},{"$f":"IF(N39>0,Tableau7[[#This Row],[Campagne]],)","v":0},{"$f":"IF(J39>0,Tableau7[[#This Row],[Client]],)","v":0},{"$f":"IF(K39>0,Tableau7[[#This Row],[Parcelles]],)","v":0}]
[{"$nulls":35},{"$f":"IF(N40>0,Tableau7[[#This Row],[Campagne]],)","v":0},{"$f":"IF(J40>0,Tableau7[[#This Row],[Client]],)","v":0},{"$f":"IF(K40>0,Tableau7[[#This Row],[Parcelles]],)","v":0}]
[{"$nulls":35},{"$f":"IF(N41>0,Tableau7[[#This Row],[Campagne]],)","v":0},{"$f":"IF(J41>0,Tableau7[[#This Row],[Client]],)","v":0},{"$f":"IF(K41>0,Tableau7[[#This Row],[Parcelles]],)","v":0}]
[{"$nulls":35},{"$f":"IF(N42>0,Tableau7[[#This Row],[Campagne]],)","v":0},{"$f":"IF(J42>0,Tableau7[[#This Row],[Client]],)","v":0},{"$f":"IF(K42>0,Tableau7[[#This Row],[Parcelles]],)","v":0}]
[{"$nulls":35},{"$f":"IF(N43>0,Tableau7[[#This Row],[Campagne]],)","v":0},{"$f":"IF(J43>0,Tableau7[[#This Row],[Client]],)","v":0},{"$f":"IF(K43>0,Tableau7[[#This Row],[Parcelles]],)","v":0}]
[{"$nulls":35},{"$f":"IF(N44>0,Tableau7[[#This Row],[Campagne]],)","v":0},{"$f":"IF(J44>0,Tableau7[[#This Row],[Client]],)","v":0},{"$f":"IF(K44>0,Tableau7[[#This Row],[Parcelles]],)","v":0}]
[{"$nulls":35},{"$f":"IF(N45>0,Tableau7[[#This Row],[Campagne]],)","v":0},{"$f":"IF(J45>0,Tableau7[[#This Row],[Client]],)","v":0},{"$f":"IF(K45>0,Tableau7[[#This Row],[Parcelles]],)","v":0}]
[{"$nulls":35},{"$f":"IF(N46>0,Tableau7[[#This Row],[Campagne]],)","v":0},{"$f":"IF(J46>0,Tableau7[[#This Row],[Client]],)","v":0},{"$f":"IF(K46>0,Tableau7[[#This Row],[Parcelles]],)","v":0}]
[{"$nulls":35},{"$f":"IF(N47>0,Tableau7[[#This Row],[Campagne]],)","v":0},{"$f":"IF(J47>0,Tableau7[[#This Row],[Client]],)","v":0},{"$f":"IF(K47>0,Tableau7[[#This Row],[Parcelles]],)","v":0}]
[{"$nulls":35},{"$f":"IF(N48>0,Tableau7[[#This Row],[Campagne]],)","v":0},{"$f":"IF(J48>0,Tableau7[[#This Row],[Client]],)","v":0},{"$f":"IF(K48>0,Tableau7[[#This Row],[Parcelles]],)","v":0}]
[{"$nulls":35},{"$f":"IF(N49>0,Tableau7[[#This Row],[Campagne]],)","v":0},{"$f":"IF(J49>0,Tableau7[[#This Row],[Client]],)","v":0},{"$f":"IF(K49>0,Tableau7[[#This Row],[Parcelles]],)","v":0}]
[{"$nulls":35},{"$f":"IF(N50>0,Tableau7[[#This Row],[Campagne]],)","v":0},{"$f":"IF(J50>0,Tableau7[[#This Row],[Client]],)","v":0},{"$f":"IF(K50>0,Tableau7[[#This Row],[Parcelles]],)","v":0}]
[{"$nulls":35},{"$f":"IF(N51>0,Tableau7[[#This Row],[Campagne]],)","v":0},{"$f":"IF(J51>0,Tableau7[[#This Row],[Client]],)","v":0},{"$f":"IF(K51>0,Tableau7[[#This Row],[Parcelles]],)","v":0}]
[{"$nulls":35},{"$f":"IF(N52>0,Tableau7[[#This Row],[Campagne]],)","v":0},{"$f":"IF(J52>0,Tableau7[[#This Row],[Client]],)","v":0},{"$f":"IF(K52>0,Tableau7[[#This Row],[Parcelles]],)","v":0}]
[{"$nulls":35},{"$f":"IF(N53>0,Tableau7[[#This Row],[Campagne]],)","v":0},{"$f":"IF(J53>0,Tableau7[[#This Row],[Client]],)","v":0},{"$f":"IF(K53>0,Tableau7[[#This Row],[Parcelles]],)","v":0}]
[{"$nulls":35},{"$f":"IF(N54>0,Tableau7[[#This Row],[Campagne]],)","v":0},{"$f":"IF(J54>0,Tableau7[[#This Row],[Client]],)","v":0},{"$f":"IF(K54>0,Tableau7[[#This Row],[Parcelles]],)","v":0}]
[{"$nulls":35},{"$f":"IF(N55>0,Tableau7[[#This Row],[Campagne]],)","v":0},{"$f":"IF(J55>0,Tableau7[[#This Row],[Client]],)","v":0},{"$f":"IF(K55>0,Tableau7[[#This Row],[Parcelles]],)","v":0}]
[{"$nulls":35},{"$f":"IF(N56>0,Tableau7[[#This Row],[Campagne]],)","v":0},{"$f":"IF(J56>0,Tableau7[[#This Row],[Client]],)","v":0},{"$f":"IF(K56>0,Tableau7[[#This Row],[Parcelles]],)","v":0}]
[{"$nulls":35},{"$f":"IF(N57>0,Tableau7[[#This Row],[Campagne]],)","v":0},{"$f":"IF(J57>0,Tableau7[[#This Row],[Client]],)","v":0},{"$f":"IF(K57>0,Tableau7[[#This Row],[Parcelles]],)","v":0}]
[{"$nulls":35},{"$f":"IF(N58>0,Tableau7[[#This Row],[Campagne]],)","v":0},{"$f":"IF(J58>0,Tableau7[[#This Row],[Client]],)","v":0},{"$f":"IF(K58>0,Tableau7[[#This Row],[Parcelles]],)","v":0}]
[{"$nulls":35},{"$f":"IF(N59>0,Tableau7[[#This Row],[Campagne]],)","v":0},{"$f":"IF(J59>0,Tableau7[[#This Row],[Client]],)","v":0},{"$f":"IF(K59>0,Tableau7[[#This Row],[Parcelles]],)","v":0}]
[{"$nulls":35},{"$f":"IF(N60>0,Tableau7[[#This Row],[Campagne]],)","v":0},{"$f":"IF(J60>0,Tableau7[[#This Row],[Client]],)","v":0},{"$f":"IF(K60>0,Tableau7[[#This Row],[Parcelles]],)","v":0}]
[{"$nulls":35},{"$f":"IF(N61>0,Tableau7[[#This Row],[Campagne]],)","v":0},{"$f":"IF(J61>0,Tableau7[[#This Row],[Client]],)","v":0},{"$f":"IF(K61>0,Tableau7[[#This Row],[Parcelles]],)","v":0}]
[{"$nulls":35},{"$f":"IF(N62>0,Tableau7[[#This Row],[Campagne]],)","v":0},{"$f":"IF(J62>0,Tableau7[[#This Row],[Client]],)","v":0},{"$f":"IF(K62>0,Tableau7[[#This Row],[Parcelles]],)","v":0}]
[{"$nulls":35},{"$f":"IF(N63>0,Tableau7[[#This Row],[Campagne]],)","v":0},{"$f":"IF(J63>0,Tableau7[[#This Row],[Client]],)","v":0},{"$f":"IF(K63>0,Tableau7[[#This Row],[Parcelles]],)","v":0}]
[{"$nulls":35},{"$f":"IF(N64>0,Tableau7[[#This Row],[Campagne]],)","v":0},{"$f":"IF(J64>0,Tableau7[[#This Row],[Client]],)","v":0},{"$f":"IF(K64>0,Tableau7[[#This Row],[Parcelles]],)","v":0}]
[{"$nulls":35},{"$f":"IF(N65>0,Tableau7[[#This Row],[Campagne]],)","v":0},{"$f":"IF(J65>0,Tableau7[[#This Row],[Client]],)","v":0},{"$f":"IF(K65>0,Tableau7[[#This Row],[Parcelles]],)","v":0}]
[{"$nulls":35},{"$f":"IF(N66>0,Tableau7[[#This Row],[Campagne]],)","v":0},{"$f":"IF(J66>0,Tableau7[[#This Row],[Client]],)","v":0},{"$f":"IF(K66>0,Tableau7[[#This Row],[Parcelles]],)","v":0}]
[{"$nulls":35},{"$f":"IF(N67>0,Tableau7[[#This Row],[Campagne]],)","v":0},{"$f":"IF(J67>0,Tableau7[[#This Row],[Client]],)","v":0},{"$f":"IF(K67>0,Tableau7[[#This Row],[Parcelles]],)","v":0}]
[{"$nulls":35},{"$f":"IF(N68>0,Tableau7[[#This Row],[Campagne]],)","v":0},{"$f":"IF(J68>0,Tableau7[[#This Row],[Client]],)","v":0},{"$f":"IF(K68>0,Tableau7[[#This Row],[Parcelles]],)","v":0}]
[{"$nulls":35},{"$f":"IF(N69>0,Tableau7[[#This Row],[Campagne]],)","v":0},{"$f":"IF(J69>0,Tableau7[[#This Row],[Client]],)","v":0},{"$f":"IF(K69>0,Tableau7[[#This Row],[Parcelles]],)","v":0}]
[{"$nulls":35},{"$f":"IF(N70>0,Tableau7[[#This Row],[Campagne]],)","v":0},{"$f":"IF(J70>0,Tableau7[[#This Row],[Client]],)","v":0},{"$f":"IF(K70>0,Tableau7[[#This Row],[Parcelles]],)","v":0}]
[{"$nulls":35},{"$f":"IF(N71>0,Tableau7[[#This Row],[Campagne]],)","v":0},{"$f":"IF(J71>0,Tableau7[[#This Row],[Client]],)","v":0},{"$f":"IF(K71>0,Tableau7[[#This Row],[Parcelles]],)","v":0}]
[{"$nulls":35},{"$f":"IF(N72>0,Tableau7[[#This Row],[Campagne]],)","v":0},{"$f":"IF(J72>0,Tableau7[[#This Row],[Client]],)","v":0},{"$f":"IF(K72>0,Tableau7[[#This Row],[Parcelles]],)","v":0}]
[{"$nulls":35},{"$f":"IF(N73>0,Tableau7[[#This Row],[Campagne]],)","v":0},{"$f":"IF(J73>0,Tableau7[[#This Row],[Client]],)","v":0},{"$f":"IF(K73>0,Tableau7[[#This Row],[Parcelles]],)","v":0}]
[{"$nulls":35},{"$f":"IF(N74>0,Tableau7[[#This Row],[Campagne]],)","v":0},{"$f":"IF(J74>0,Tableau7[[#This Row],[Client]],)","v":0},{"$f":"IF(K74>0,Tableau7[[#This Row],[Parcelles]],)","v":0}]
[{"$nulls":35},{"$f":"IF(N75>0,Tableau7[[#This Row],[Campagne]],)","v":0},{"$f":"IF(J75>0,Tableau7[[#This Row],[Client]],)","v":0},{"$f":"IF(K75>0,Tableau7[[#This Row],[Parcelles]],)","v":0}]
[{"$nulls":35},{"$f":"IF(N76>0,Tableau7[[#This Row],[Campagne]],)","v":0},{"$f":"IF(J76>0,Tableau7[[#This Row],[Client]],)","v":0},{"$f":"IF(K76>0,Tableau7[[#This Row],[Parcelles]],)","v":0}]
[{"$nulls":35},{"$f":"IF(N77>0,Tableau7[[#This Row],[Campagne]],)","v":0},{"$f":"IF(J77>0,Tableau7[[#This Row],[Client]],)","v":0},{"$f":"IF(K77>0,Tableau7[[#This Row],[Parcelles]],)","v":0}]
[{"$nulls":35},{"$f":"IF(N78>0,Tableau7[[#This Row],[Campagne]],)","v":0},{"$f":"IF(J78>0,Tableau7[[#This Row],[Client]],)","v":0},{"$f":"IF(K78>0,Tableau7[[#This Row],[Parcelles]],)","v":0}]
[{"$nulls":35},{"$f":"IF(N79>0,Tableau7[[#This Row],[Campagne]],)","v":0},{"$f":"IF(J79>0,Tableau7[[#This Row],[Client]],)","v":0},{"$f":"IF(K79>0,Tableau7[[#This Row],[Parcelles]],)","v":0}]
[{"$nulls":35},{"$f":"IF(N80>0,Tableau7[[#This Row],[Campagne]],)","v":0},{"$f":"IF(J80>0,Tableau7[[#This Row],[Client]],)","v":0},{"$f":"IF(K80>0,Tableau7[[#This Row],[Parcelles]],)","v":0}]
[{"$nulls":35},{"$f":"IF(N81>0,Tableau7[[#This Row],[Campagne]],)","v":0},{"$f":"IF(J81>0,Tableau7[[#This Row],[Client]],)","v":0},{"$f":"IF(K81>0,Tableau7[[#This Row],[Parcelles]],)","v":0}]
[{"$nulls":35},{"$f":"IF(N82>0,Tableau7[[#This Row],[Campagne]],)","v":0},{"$f":"IF(J82>0,Tableau7[[#This Row],[Client]],)","v":0},{"$f":"IF(K82>0,Tableau7[[#This Row],[Parcelles]],)","v":0}]
[{"$nulls":35},{"$f":"IF(N83>0,Tableau7[[#This Row],[Campagne]],)","v":0},{"$f":"IF(J83>0,Tableau7[[#This Row],[Client]],)","v":0},{"$f":"IF(K83>0,Tableau7[[#This Row],[Parcelles]],)","v":0}]
[{"$nulls":35},{"$f":"IF(N84>0,Tableau7[[#This Row],[Campagne]],)","v":0},{"$f":"IF(J84>0,Tableau7[[#This Row],[Client]],)","v":0},{"$f":"IF(K84>0,Tableau7[[#This Row],[Parcelles]],)","v":0}]
[{"$nulls":35},{"$f":"IF(N85>0,Tableau7[[#This Row],[Campagne]],)","v":0},{"$f":"IF(J85>0,Tableau7[[#This Row],[Client]],)","v":0},{"$f":"IF(K85>0,Tableau7[[#This Row],[Parcelles]],)","v":0}]
[{"$nulls":35},{"$f":"IF(N86>0,Tableau7[[#This Row],[Campagne]],)","v":0},{"$f":"IF(J86>0,Tableau7[[#This Row],[Client]],)","v":0},{"$f":"IF(K86>0,Tableau7[[#This Row],[Parcelles]],)","v":0}]
[{"$nulls":35},{"$f":"IF(N87>0,Tableau7[[#This Row],[Campagne]],)","v":0},{"$f":"IF(J87>0,Tableau7[[#This Row],[Client]],)","v":0},{"$f":"IF(K87>0,Tableau7[[#This Row],[Parcelles]],)","v":0}]
[{"$nulls":35},{"$f":"IF(N88>0,Tableau7[[#This Row],[Campagne]],)","v":0},{"$f":"IF(J88>0,Tableau7[[#This Row],[Client]],)","v":0},{"$f":"IF(K88>0,Tableau7[[#This Row],[Parcelles]],)","v":0}]
[{"$nulls":35},{"$f":"IF(N89>0,Tableau7[[#This Row],[Campagne]],)","v":0},{"$f":"IF(J89>0,Tableau7[[#This Row],[Client]],)","v":0},{"$f":"IF(K89>0,Tableau7[[#This Row],[Parcelles]],)","v":0}]
[{"$nulls":35},{"$f":"IF(N90>0,Tableau7[[#This Row],[Campagne]],)","v":0},{"$f":"IF(J90>0,Tableau7[[#This Row],[Client]],)","v":0},{"$f":"IF(K90>0,Tableau7[[#This Row],[Parcelles]],)","v":0}]
[{"$nulls":35},{"$f":"IF(N91>0,Tableau7[[#This Row],[Campagne]],)","v":0},{"$f":"IF(J91>0,Tableau7[[#This Row],[Client]],)","v":0},{"$f":"IF(K91>0,Tableau7[[#This Row],[Parcelles]],)","v":0}]
[{"$nulls":35},{"$f":"IF(N92>0,Tableau7[[#This Row],[Campagne]],)","v":0},{"$f":"IF(J92>0,Tableau7[[#This Row],[Client]],)","v":0},{"$f":"IF(K92>0,Tableau7[[#This Row],[Parcelles]],)","v":0}]
[{"$nulls":35},{"$f":"IF(N93>0,Tableau7[[#This Row],[Campagne]],)","v":0},{"$f":"IF(J93>0,Tableau7[[#This Row],[Client]],)","v":0},{"$f":"IF(K93>0,Tableau7[[#This Row],[Parcelles]],)","v":0}]
[{"$nulls":35},{"$f":"IF(N94>0,Tableau7[[#This Row],[Campagne]],)","v":0},{"$f":"IF(J94>0,Tableau7[[#This Row],[Client]],)","v":0},{"$f":"IF(K94>0,Tableau7[[#This Row],[Parcelles]],)","v":0}]
[{"$nulls":35},{"$f":"IF(N95>0,Tableau7[[#This Row],[Campagne]],)","v":0},{"$f":"IF(J95>0,Tableau7[[#This Row],[Client]],)","v":0},{"$f":"IF(K95>0,Tableau7[[#This Row],[Parcelles]],)","v":0}]
[{"$nulls":35},{"$f":"IF(N96>0,Tableau7[[#This Row],[Campagne]],)","v":0},{"$f":"IF(J96>0,Tableau7[[#This Row],[Client]],)","v":0},{"$f":"IF(K96>0,Tableau7[[#This Row],[Parcelles]],)","v":0}]
[{"$nulls":35},{"$f":"IF(N97>0,Tableau7[[#This Row],[Campagne]],)","v":0},{"$f":"IF(J97>0,Tableau7[[#This Row],[Client]],)","v":0},{"$f":"IF(K97>0,Tableau7[[#This Row],[Parcelles]],)","v":0}]
[{"$nulls":35},{"$f":"IF(N98>0,Tableau7[[#This Row],[Campagne]],)","v":0},{"$f":"IF(J98>0,Tableau7[[#This Row],[Client]],)","v":0},{"$f":"IF(K98>0,Tableau7[[#This Row],[Parcelles]],)","v":0}]
[{"$nulls":35},{"$f":"IF(N99>0,Tableau7[[#This Row],[Campagne]],)","v":0},{"$f":"IF(J99>0,Tableau7[[#This Row],[Client]],)","v":0},{"$f":"IF(K99>0,Tableau7[[#This Row],[Parcelles]],)","v":0}]
[{"$nulls":35},{"$f":"IF(N100>0,Tableau7[[#This Row],[Campagne]],)","v":0},{"$f":"IF(J100>0,Tableau7[[#This Row],[Client]],)","v":0},{"$f":"IF(K100>0,Tableau7[[#This Row],[Parcelles]],)","v":0}]
[{"$nulls":35},{"$f":"IF(N101>0,Tableau7[[#This Row],[Campagne]],)","v":0},{"$f":"IF(J101>0,Tableau7[[#This Row],[Client]],)","v":0},{"$f":"IF(K101>0,Tableau7[[#This Row],[Parcelles]],)","v":0}]
[{"$nulls":35},{"$f":"IF(N102>0,Tableau7[[#This Row],[Campagne]],)","v":0},{"$f":"IF(J102>0,Tableau7[[#This Row],[Client]],)","v":0},{"$f":"IF(K102>0,Tableau7[[#This Row],[Parcelles]],)","v":0}]
[{"$nulls":35},{"$f":"IF(N103>0,Tableau7[[#This Row],[Campagne]],)","v":0},{"$f":"IF(J103>0,Tableau7[[#This Row],[Client]],)","v":0},{"$f":"IF(K103>0,Tableau7[[#This Row],[Parcelles]],)","v":0}]
[{"$nulls":35},{"$f":"IF(N104>0,Tableau7[[#This Row],[Campagne]],)","v":0},{"$f":"IF(J104>0,Tableau7[[#This Row],[Client]],)","v":0},{"$f":"IF(K104>0,Tableau7[[#This Row],[Parcelles]],)","v":0}]
[{"$nulls":35},{"$f":"IF(N105>0,Tableau7[[#This Row],[Campagne]],)","v":0},{"$f":"IF(J105>0,Tableau7[[#This Row],[Client]],)","v":0},{"$f":"IF(K105>0,Tableau7[[#This Row],[Parcelles]],)","v":0}]
[{"$nulls":35},{"$f":"IF(N106>0,Tableau7[[#This Row],[Campagne]],)","v":0},{"$f":"IF(J106>0,Tableau7[[#This Row],[Client]],)","v":0},{"$f":"IF(K106>0,Tableau7[[#This Row],[Parcelles]],)","v":0}]
[{"$nulls":35},{"$f":"IF(N107>0,Tableau7[[#This Row],[Campagne]],)","v":0},{"$f":"IF(J107>0,Tableau7[[#This Row],[Client]],)","v":0},{"$f":"IF(K107>0,Tableau7[[#This Row],[Parcelles]],)","v":0}]
[{"$nulls":35},{"$f":"IF(N108>0,Tableau7[[#This Row],[Campagne]],)","v":0},{"$f":"IF(J108>0,Tableau7[[#This Row],[Client]],)","v":0},{"$f":"IF(K108>0,Tableau7[[#This Row],[Parcelles]],)","v":0}]
[{"$nulls":35},{"$f":"IF(N109>0,Tableau7[[#This Row],[Campagne]],)","v":0},{"$f":"IF(J109>0,Tableau7[[#This Row],[Client]],)","v":0},{"$f":"IF(K109>0,Tableau7[[#This Row],[Parcelles]],)","v":0}]
[{"$nulls":35},{"$f":"IF(N110>0,Tableau7[[#This Row],[Campagne]],)","v":0},{"$f":"IF(J110>0,Tableau7[[#This Row],[Client]],)","v":0},{"$f":"IF(K110>0,Tableau7[[#This Row],[Parcelles]],)","v":0}]
[{"$nulls":35},{"$f":"IF(N111>0,Tableau7[[#This Row],[Campagne]],)","v":0},{"$f":"IF(J111>0,Tableau7[[#This Row],[Client]],)","v":0},{"$f":"IF(K111>0,Tableau7[[#This Row],[Parcelles]],)","v":0}]
[{"$nulls":35},{"$f":"IF(N112>0,Tableau7[[#This Row],[Campagne]],)","v":0},{"$f":"IF(J112>0,Tableau7[[#This Row],[Client]],)","v":0},{"$f":"IF(K112>0,Tableau7[[#This Row],[Parcelles]],)","v":0}]
[{"$nulls":35},{"$f":"IF(N113>0,Tableau7[[#This Row],[Campagne]],)","v":0},{"$f":"IF(J113>0,Tableau7[[#This Row],[Client]],)","v":0},{"$f":"IF(K113>0,Tableau7[[#This Row],[Parcelles]],)","v":0}]
[{"$nulls":35},{"$f":"IF(N114>0,Tableau7[[#This Row],[Campagne]],)","v":0},{"$f":"IF(J114>0,Tableau7[[#This Row],[Client]],)","v":0},{"$f":"IF(K114>0,Tableau7[[#This Row],[Parcelles]],)","v":0}]
[{"$nulls":35},{"$f":"IF(N115>0,Tableau7[[#This Row],[Campagne]],)","v":0},{"$f":"IF(J115>0,Tableau7[[#This Row],[Client]],)","v":0},{"$f":"IF(K115>0,Tableau7[[#This Row],[Parcelles]],)","v":0}]
[{"$nulls":35},{"$f":"IF(N116>0,Tableau7[[#This Row],[Campagne]],)","v":0},{"$f":"IF(J116>0,Tableau7[[#This Row],[Client]],)","v":0},{"$f":"IF(K116>0,Tableau7[[#This Row],[Parcelles]],)","v":0}]
[{"$nulls":35},{"$f":"IF(N117>0,Tableau7[[#This Row],[Campagne]],)","v":0},{"$f":"IF(J117>0,Tableau7[[#This Row],[Client]],)","v":0},{"$f":"IF(K117>0,Tableau7[[#This Row],[Parcelles]],)","v":0}]
[{"$nulls":35},{"$f":"IF(N118>0,Tableau7[[#This Row],[Campagne]],)","v":0},{"$f":"IF(J118>0,Tableau7[[#This Row],[Client]],)","v":0},{"$f":"IF(K118>0,Tableau7[[#This Row],[Parcelles]],)","v":0}]
[{"$nulls":35},{"$f":"IF(N119>0,Tableau7[[#This Row],[Campagne]],)","v":0},{"$f":"IF(J119>0,Tableau7[[#This Row],[Client]],)","v":0},{"$f":"IF(K119>0,Tableau7[[#This Row],[Parcelles]],)","v":0}]
[{"$nulls":35},{"$f":"IF(N120>0,Tableau7[[#This Row],[Campagne]],)","v":0},{"$f":"IF(J120>0,Tableau7[[#This Row],[Client]],)","v":0},{"$f":"IF(K120>0,Tableau7[[#This Row],[Parcelles]],)","v":0}]
[{"$nulls":35},{"$f":"IF(N121>0,Tableau7[[#This Row],[Campagne]],)","v":0},{"$f":"IF(J121>0,Tableau7[[#This Row],[Client]],)","v":0},{"$f":"IF(K121>0,Tableau7[[#This Row],[Parcelles]],)","v":0}]
[{"$nulls":35},{"$f":"IF(N122>0,Tableau7[[#This Row],[Campagne]],)","v":0},{"$f":"IF(J122>0,Tableau7[[#This Row],[Client]],)","v":0},{"$f":"IF(K122>0,Tableau7[[#This Row],[Parcelles]],)","v":0}]
[{"$nulls":35},{"$f":"IF(N123>0,Tableau7[[#This Row],[Campagne]],)","v":0},{"$f":"IF(J123>0,Tableau7[[#This Row],[Client]],)","v":0},{"$f":"IF(K123>0,Tableau7[[#This Row],[Parcelles]],)","v":0}]
[{"$nulls":35},{"$f":"IF(N124>0,Tableau7[[#This Row],[Campagne]],)","v":0},{"$f":"IF(J124>0,Tableau7[[#This Row],[Client]],)","v":0},{"$f":"IF(K124>0,Tableau7[[#This Row],[Parcelles]],)","v":0}]
[{"$nulls":35},{"$f":"IF(N125>0,Tableau7[[#This Row],[Campagne]],)","v":0},{"$f":"IF(J125>0,Tableau7[[#This Row],[Client]],)","v":0},{"$f":"IF(K125>0,Tableau7[[#This Row],[Parcelles]],)","v":0}]
[{"$nulls":35},{"$f":"IF(N126>0,Tableau7[[#This Row],[Campagne]],)","v":0},{"$f":"IF(J126>0,Tableau7[[#This Row],[Client]],)","v":0},{"$f":"IF(K126>0,Tableau7[[#This Row],[Parcelles]],)","v":0}]
[{"$nulls":35},{"$f":"IF(N127>0,Tableau7[[#This Row],[Campagne]],)","v":0},{"$f":"IF(J127>0,Tableau7[[#This Row],[Client]],)","v":0},{"$f":"IF(K127>0,Tableau7[[#This Row],[Parcelles]],)","v":0}]
[{"$nulls":35},{"$f":"IF(N128>0,Tableau7[[#This Row],[Campagne]],)","v":0},{"$f":"IF(J128>0,Tableau7[[#This Row],[Client]],)","v":0},{"$f":"IF(K128>0,Tableau7[[#This Row],[Parcelles]],)","v":0}]
[{"$nulls":35},{"$f":"IF(N129>0,Tableau7[[#This Row],[Campagne]],)","v":0},{"$f":"IF(J129>0,Tableau7[[#This Row],[Client]],)","v":0},{"$f":"IF(K129>0,Tableau7[[#This Row],[Parcelles]],)","v":0}]
[{"$nulls":35},{"$f":"IF(N130>0,Tableau7[[#This Row],[Campagne]],)","v":0},{"$f":"IF(J130>0,Tableau7[[#This Row],[Client]],)","v":0},{"$f":"IF(K130>0,Tableau7[[#This Row],[Parcelles]],)","v":0}]
[{"$nulls":35},{"$f":"IF(N131>0,Tableau7[[#This Row],[Campagne]],)","v":0},{"$f":"IF(J131>0,Tableau7[[#This Row],[Client]],)","v":0},{"$f":"IF(K131>0,Tableau7[[#This Row],[Parcelles]],)","v":0}]
[{"$nulls":35},{"$f":"IF(N132>0,Tableau7[[#This Row],[Campagne]],)","v":0},{"$f":"IF(J132>0,Tableau7[[#This Row],[Client]],)","v":0},{"$f":"IF(K132>0,Tableau7[[#This Row],[Parcelles]],)","v":0}]
[{"$nulls":35},{"$f":"IF(N133>0,Tableau7[[#This Row],[Campagne]],)","v":0},{"$f":"IF(J133>0,Tableau7[[#This Row],[Client]],)","v":0},{"$f":"IF(K133>0,Tableau7[[#This Row],[Parcelles]],)","v":0}]
[{"$nulls":35},{"$f":"IF(N134>0,Tableau7[[#This Row],[Campagne]],)","v":0},{"$f":"IF(J134>0,Tableau7[[#This Row],[Client]],)","v":0},{"$f":"IF(K134>0,Tableau7[[#This Row],[Parcelles]],)","v":0}]
[{"$nulls":35},{"$f":"IF(N135>0,Tableau7[[#This Row],[Campagne]],)","v":0},{"$f":"IF(J135>0,Tableau7[[#This Row],[Client]],)","v":0},{"$f":"IF(K135>0,Tableau7[[#This Row],[Parcelles]],)","v":0}]
[{"$nulls":35},{"$f":"IF(N136>0,Tableau7[[#This Row],[Campagne]],)","v":0},{"$f":"IF(J136>0,Tableau7[[#This Row],[Client]],)","v":0},{"$f":"IF(K136>0,Tableau7[[#This Row],[Parcelles]],)","v":0}]
[{"$nulls":35},{"$f":"IF(N137>0,Tableau7[[#This Row],[Campagne]],)","v":0},{"$f":"IF(J137>0,Tableau7[[#This Row],[Client]],)","v":0},{"$f":"IF(K137>0,Tableau7[[#This Row],[Parcelles]],)","v":0}]
[{"$nulls":35},{"$f":"IF(N138>0,Tableau7[[#This Row],[Campagne]],)","v":0},{"$f":"IF(J138>0,Tableau7[[#This Row],[Client]],)","v":0},{"$f":"IF(K138>0,Tableau7[[#This Row],[Parcelles]],)","v":0}]
[{"$nulls":35},{"$f":"IF(N139>0,Tableau7[[#This Row],[Campagne]],)","v":0},{"$f":"IF(J139>0,Tableau7[[#This Row],[Client]],)","v":0},{"$f":"IF(K139>0,Tableau7[[#This Row],[Parcelles]],)","v":0}]
[{"$nulls":35},{"$f":"IF(N140>0,Tableau7[[#This Row],[Campagne]],)","v":0},{"$f":"IF(J140>0,Tableau7[[#This Row],[Client]],)","v":0},{"$f":"IF(K140>0,Tableau7[[#This Row],[Parcelles]],)","v":0}]
[{"$nulls":35},{"$f":"IF(N141>0,Tableau7[[#This Row],[Campagne]],)","v":0},{"$f":"IF(J141>0,Tableau7[[#This Row],[Client]],)","v":0},{"$f":"IF(K141>0,Tableau7[[#This Row],[Parcelles]],)","v":0}]
[{"$nulls":35},{"$f":"IF(N142>0,Tableau7[[#This Row],[Campagne]],)","v":0},{"$f":"IF(J142>0,Tableau7[[#This Row],[Client]],)","v":0},{"$f":"IF(K142>0,Tableau7[[#This Row],[Parcelles]],)","v":0}]
[{"$nulls":35},{"$f":"IF(N143>0,Tableau7[[#This Row],[Campagne]],)","v":0},{"$f":"IF(J143>0,Tableau7[[#This Row],[Client]],)","v":0},{"$f":"IF(K143>0,Tableau7[[#This Row],[Parcelles]],)","v":0}]
[{"$nulls":35},{"$f":"IF(N144>0,Tableau7[[#This Row],[Campagne]],)","v":0},{"$f":"IF(J144>0,Tableau7[[#This Row],[Client]],)","v":0},{"$f":"IF(K144>0,Tableau7[[#This Row],[Parcelles]],)","v":0}]
[{"$nulls":35},{"$f":"IF(N145>0,Tableau7[[#This Row],[Campagne]],)","v":0},{"$f":"IF(J145>0,Tableau7[[#This Row],[Client]],)","v":0},{"$f":"IF(K145>0,Tableau7[[#This Row],[Parcelles]],)","v":0}]
[{"$nulls":35},{"$f":"IF(N146>0,Tableau7[[#This Row],[Campagne]],)","v":0},{"$f":"IF(J146>0,Tableau7[[#This Row],[Client]],)","v":0},{"$f":"IF(K146>0,Tableau7[[#This Row],[Parcelles]],)","v":0}]
[{"$nulls":35},{"$f":"IF(N147>0,Tableau7[[#This Row],[Campagne]],)","v":0},{"$f":"IF(J147>0,Tableau7[[#This Row],[Client]],)","v":0},{"$f":"IF(K147>0,Tableau7[[#This Row],[Parcelles]],)","v":0}]
[{"$nulls":35},{"$f":"IF(N148>0,Tableau7[[#This Row],[Campagne]],)","v":0},{"$f":"IF(J148>0,Tableau7[[#This Row],[Client]],)","v":0},{"$f":"IF(K148>0,Tableau7[[#This Row],[Parcelles]],)","v":0}]
[{"$nulls":35},{"$f":"IF(N149>0,Tableau7[[#This Row],[Campagne]],)","v":0},{"$f":"IF(J149>0,Tableau7[[#This Row],[Client]],)","v":0},{"$f":"IF(K149>0,Tableau7[[#This Row],[Parcelles]],)","v":0}]
[{"$nulls":35},{"$f":"IF(N150>0,Tableau7[[#This Row],[Campagne]],)","v":0},{"$f":"IF(J150>0,Tableau7[[#This Row],[Client]],)","v":0},{"$f":"IF(K150>0,Tableau7[[#This Row],[Parcelles]],)","v":0}]
[{"$nulls":35},{"$f":"IF(N151>0,Tableau7[[#This Row],[Campagne]],)","v":0},{"$f":"IF(J151>0,Tableau7[[#This Row],[Client]],)","v":0},{"$f":"IF(K151>0,Tableau7[[#This Row],[Parcelles]],)","v":0}]
[{"$nulls":35},{"$f":"IF(N152>0,Tableau7[[#This Row],[Campagne]],)","v":0},{"$f":"IF(J152>0,Tableau7[[#This Row],[Client]],)","v":0},{"$f":"IF(K152>0,Tableau7[[#This Row],[Parcelles]],)","v":0}]
[{"$nulls":35},{"$f":"IF(N153>0,Tableau7[[#This Row],[Campagne]],)","v":0},{"$f":"IF(J153>0,Tableau7[[#This Row],[Client]],)","v":0},{"$f":"IF(K153>0,Tableau7[[#This Row],[Parcelles]],)","v":0}]
[{"$nulls":35},{"$f":"IF(N154>0,Tableau7[[#This Row],[Campagne]],)","v":0},{"$f":"IF(J154>0,Tableau7[[#This Row],[Client]],)","v":0},{"$f":"IF(K154>0,Tableau7[[#This Row],[Parcelles]],)","v":0}]
[{"$nulls":35},{"$f":"IF(N155>0,Tableau7[[#This Row],[Campagne]],)","v":0},{"$f":"IF(J155>0,Tableau7[[#This Row],[Client]],)","v":0},{"$f":"IF(K155>0,Tableau7[[#This Row],[Parcelles]],)","v":0}]
[{"$nulls":35},{"$f":"IF(N156>0,Tableau7[[#This Row],[Campagne]],)","v":0},{"$f":"IF(J156>0,Tableau7[[#This Row],[Client]],)","v":0},{"$f":"IF(K156>0,Tableau7[[#This Row],[Parcelles]],)","v":0}]
[{"$nulls":35},{"$f":"IF(N157>0,Tableau7[[#This Row],[Campagne]],)","v":0},{"$f":"IF(J157>0,Tableau7[[#This Row],[Client]],)","v":0},{"$f":"IF(K157>0,Tableau7[[#This Row],[Parcelles]],)","v":0}]
[{"$nulls":35},{"$f":"IF(N158>0,Tableau7[[#This Row],[Campagne]],)","v":0},{"$f":"IF(J158>0,Tableau7[[#This Row],[Client]],)","v":0},{"$f":"IF(K158>0,Tableau7[[#This Row],[Parcelles]],)","v":0}]
[{"$nulls":35},{"$f":"IF(N159>0,Tableau7[[#This Row],[Campagne]],)","v":0},{"$f":"IF(J159>0,Tableau7[[#This Row],[Client]],)","v":0},{"$f":"IF(K159>0,Tableau7[[#This Row],[Parcelles]],)","v":0}]
[{"$nulls":35},{"$f":"IF(N160>0,Tableau7[[#This Row],[Campagne]],)","v":0},{"$f":"IF(J160>0,Tableau7[[#This Row],[Client]],)","v":0},{"$f":"IF(K160>0,Tableau7[[#This Row],[Parcelles]],)","v":0}]
[{"$nulls":35},{"$f":"IF(N161>0,Tableau7[[#This Row],[Campagne]],)","v":0},{"$f":"IF(J161>0,Tableau7[[#This Row],[Client]],)","v":0},{"$f":"IF(K161>0,Tableau7[[#This Row],[Parcelles]],)","v":0}]
[{"$nulls":35},{"$f":"IF(N162>0,Tableau7[[#This Row],[Campagne]],)","v":0},{"$f":"IF(J162>0,Tableau7[[#This Row],[Client]],)","v":0},{"$f":"IF(K162>0,Tableau7[[#This Row],[Parcelles]],)","v":0}]
[{"$nulls":35},{"$f":"IF(N163>0,Tableau7[[#This Row],[Campagne]],)","v":0},{"$f":"IF(J163>0,Tableau7[[#This Row],[Client]],)","v":0},{"$f":"IF(K163>0,Tableau7[[#This Row],[Parcelles]],)","v":0}]
[{"$nulls":35},{"$f":"IF(N164>0,Tableau7[[#This Row],[Campagne]],)","v":0},{"$f":"IF(J164>0,Tableau7[[#This Row],[Client]],)","v":0},{"$f":"IF(K164>0,Tableau7[[#This Row],[Parcelles]],)","v":0}]
[{"$nulls":35},{"$f":"IF(N165>0,Tableau7[[#This Row],[Campagne]],)","v":0},{"$f":"IF(J165>0,Tableau7[[#This Row],[Client]],)","v":0},{"$f":"IF(K165>0,Tableau7[[#This Row],[Parcelles]],)","v":0}]
[{"$nulls":35},{"$f":"IF(N166>0,Tableau7[[#This Row],[Campagne]],)","v":0},{"$f":"IF(J166>0,Tableau7[[#This Row],[Client]],)","v":0},{"$f":"IF(K166>0,Tableau7[[#This Row],[Parcelles]],)","v":0}]
[{"$nulls":35},{"$f":"IF(N167>0,Tableau7[[#This Row],[Campagne]],)","v":0},{"$f":"IF(J167>0,Tableau7[[#This Row],[Client]],)","v":0},{"$f":"IF(K167>0,Tableau7[[#This Row],[Parcelles]],)","v":0}]
[{"$nulls":35},{"$f":"IF(N168>0,Tableau7[[#This Row],[Campagne]],)","v":0},{"$f":"IF(J168>0,Tableau7[[#This Row],[Client]],)","v":0},{"$f":"IF(K168>0,Tableau7[[#This Row],[Parcelles]],)","v":0}]
[{"$nulls":35},{"$f":"IF(N169>0,Tableau7[[#This Row],[Campagne]],)","v":0},{"$f":"IF(J169>0,Tableau7[[#This Row],[Client]],)","v":0},{"$f":"IF(K169>0,Tableau7[[#This Row],[Parcelles]],)","v":0}]
[{"$nulls":35},{"$f":"IF(N170>0,Tableau7[[#This Row],[Campagne]],)","v":0},{"$f":"IF(J170>0,Tableau7[[#This Row],[Client]],)","v":0},{"$f":"IF(K170>0,Tableau7[[#This Row],[Parcelles]],)","v":0}]
[{"$nulls":35},{"$f":"IF(N171>0,Tableau7[[#This Row],[Campagne]],)","v":0},{"$f":"IF(J171>0,Tableau7[[#This Row],[Client]],)","v":0},{"$f":"IF(K171>0,Tableau7[[#This Row],[Parcelles]],)","v":0}]
[{"$nulls":35},{"$f":"IF(N172>0,Tableau7[[#This Row],[Campagne]],)","v":0},{"$f":"IF(J172>0,Tableau7[[#This Row],[Client]],)","v":0},{"$f":"IF(K172>0,Tableau7[[#This Row],[Parcelles]],)","v":0}]
[{"$nulls":35},{"$f":"IF(N173>0,Tableau7[[#This Row],[Campagne]],)","v":0},{"$f":"IF(J173>0,Tableau7[[#This Row],[Client]],)","v":0},{"$f":"IF(K173>0,Tableau7[[#This Row],[Parcelles]],)","v":0}]
[{"$nulls":35},{"$f":"IF(N174>0,Tableau7[[#This Row],[Campagne]],)","v":0},{"$f":"IF(J174>0,Tableau7[[#This Row],[Client]],)","v":0},{"$f":"IF(K174>0,Tableau7[[#This Row],[Parcelles]],)","v":0}]
[{"$nulls":35},{"$f":"IF(N175>0,Tableau7[[#This Row],[Campagne]],)","v":0},{"$f":"IF(J175>0,Tableau7[[#This Row],[Client]],)","v":0},{"$f":"IF(K175>0,Tableau7[[#This Row],[Parcelles]],)","v":0}]
[{"$nulls":35},{"$f":"IF(N176>0,Tableau7[[#This Row],[Campagne]],)","v":0},{"$f":"IF(J176>0,Tableau7[[#This Row],[Client]],)","v":0},{"$f":"IF(K176>0,Tableau7[[#This Row],[Parcelles]],)","v":0}]
[{"$nulls":35},{"$f":"IF(N177>0,Tableau7[[#This Row],[Campagne]],)","v":0},{"$f":"IF(J177>0,Tableau7[[#This Row],[Client]],)","v":0},{"$f":"IF(K177>0,Tableau7[[#This Row],[Parcelles]],)","v":0}]
[{"$nulls":35},{"$f":"IF(N178>0,Tableau7[[#This Row],[Campagne]],)","v":0},{"$f":"IF(J178>0,Tableau7[[#This Row],[Client]],)","v":0},{"$f":"IF(K178>0,Tableau7[[#This Row],[Parcelles]],)","v":0}]
[{"$nulls":35},{"$f":"IF(N179>0,Tableau7[[#This Row],[Campagne]],)","v":0},{"$f":"IF(J179>0,Tableau7[[#This Row],[Client]],)","v":0},{"$f":"IF(K179>0,Tableau7[[#This Row],[Parcelles]],)","v":0}]
[{"$nulls":35},{"$f":"IF(N180>0,Tableau7[[#This Row],[Campagne]],)","v":0},{"$f":"IF(J180>0,Tableau7[[#This Row],[Client]],)","v":0},{"$f":"IF(K180>0,Tableau7[[#This Row],[Parcelles]],)","v":0}]
[{"$nulls":35},{"$f":"IF(N181>0,Tableau7[[#This Row],[Campagne]],)","v":0},{"$f":"IF(J181>0,Tableau7[[#This Row],[Client]],)","v":0},{"$f":"IF(K181>0,Tableau7[[#This Row],[Parcelles]],)","v":0}]
[{"$nulls":35},{"$f":"IF(N182>0,Tableau7[[#This Row],[Campagne]],)","v":0},{"$f":"IF(J182>0,Tableau7[[#This Row],[Client]],)","v":0},{"$f":"IF(K182>0,Tableau7[[#This Row],[Parcelles]],)","v":0}]
[{"$nulls":35},{"$f":"IF(N183>0,Tableau7[[#This Row],[Campagne]],)","v":0},{"$f":"IF(J183>0,Tableau7[[#This Row],[Client]],)","v":0},{"$f":"IF(K183>0,Tableau7[[#This Row],[Parcelles]],)","v":0}]
[{"$nulls":35},{"$f":"IF(N184>0,Tableau7[[#This Row],[Campagne]],)","v":0},{"$f":"IF(J184>0,Tableau7[[#This Row],[Client]],)","v":0},{"$f":"IF(K184>0,Tableau7[[#This Row],[Parcelles]],)","v":0}]
[{"$nulls":35},{"$f":"IF(N185>0,Tableau7[[#This Row],[Campagne]],)","v":0},{"$f":"IF(J185>0,Tableau7[[#This Row],[Client]],)","v":0},{"$f":"IF(K185>0,Tableau7[[#This Row],[Parcelles]],)","v":0}]
[{"$nulls":35},{"$f":"IF(N186>0,Tableau7[[#This Row],[Campagne]],)","v":0},{"$f":"IF(J186>0,Tableau7[[#This Row],[Client]],)","v":0},{"$f":"IF(K186>0,Tableau7[[#This Row],[Parcelles]],)","v":0}]
[{"$nulls":35},{"$f":"IF(N187>0,Tableau7[[#This Row],[Campagne]],)","v":0},{"$f":"IF(J187>0,Tableau7[[#This Row],[Client]],)","v":0},{"$f":"IF(K187>0,Tableau7[[#This Row],[Parcelles]],)","v":0}]
[{"$nulls":35},{"$f":"IF(N188>0,Tableau7[[#This Row],[Campagne]],)","v":0},{"$f":"IF(J188>0,Tableau7[[#This Row],[Client]],)","v":0},{"$f":"IF(K188>0,Tableau7[[#This Row],[Parcelles]],)","v":0}]
[{"$nulls":35},{"$f":"IF(N189>0,Tableau7[[#This Row],[Campagne]],)","v":0},{"$f":"IF(J189>0,Tableau7[[#This Row],[Client]],)","v":0},{"$f":"IF(K189>0,Tableau7[[#This Row],[Parcelles]],)","v":0}]
[{"$nulls":35},{"$f":"IF(N190>0,Tableau7[[#This Row],[Campagne]],)","v":0},{"$f":"IF(J190>0,Tableau7[[#This Row],[Client]],)","v":0},{"$f":"IF(K190>0,Tableau7[[#This Row],[Parcelles]],)","v":0}]
[{"$nulls":35},{"$f":"IF(N191>0,Tableau7[[#This Row],[Campagne]],)","v":0},{"$f":"IF(J191>0,Tableau7[[#This Row],[Client]],)","v":0},{"$f":"IF(K191>0,Tableau7[[#This Row],[Parcelles]],)","v":0}]
[{"$nulls":35},{"$f":"IF(N192>0,Tableau7[[#This Row],[Campagne]],)","v":0},{"$f":"IF(J192>0,Tableau7[[#This Row],[Client]],)","v":0},{"$f":"IF(K192>0,Tableau7[[#This Row],[Parcelles]],)","v":0}]
[{"$nulls":35},{"$f":"IF(N193>0,Tableau7[[#This Row],[Campagne]],)","v":0},{"$f":"IF(J193>0,Tableau7[[#This Row],[Client]],)","v":0},{"$f":"IF(K193>0,Tableau7[[#This Row],[Parcelles]],)","v":0}]
[{"$nulls":35},{"$f":"IF(N194>0,Tableau7[[#This Row],[Campagne]],)","v":0},{"$f":"IF(J194>0,Tableau7[[#This Row],[Client]],)","v":0},{"$f":"IF(K194>0,Tableau7[[#This Row],[Parcelles]],)","v":0}]
[{"$nulls":35},{"$f":"IF(N195>0,Tableau7[[#This Row],[Campagne]],)","v":0},{"$f":"IF(J195>0,Tableau7[[#This Row],[Client]],)","v":0},{"$f":"IF(K195>0,Tableau7[[#This Row],[Parcelles]],)","v":0}]
[{"$nulls":35},{"$f":"IF(N196>0,Tableau7[[#This Row],[Campagne]],)","v":0},{"$f":"IF(J196>0,Tableau7[[#This Row],[Client]],)","v":0},{"$f":"IF(K196>0,Tableau7[[#This Row],[Parcelles]],)","v":0}]
[{"$nulls":35},{"$f":"IF(N197>0,Tableau7[[#This Row],[Campagne]],)","v":0},{"$f":"IF(J197>0,Tableau7[[#This Row],[Client]],)","v":0},{"$f":"IF(K197>0,Tableau7[[#This Row],[Parcelles]],)","v":0}]
[{"$nulls":35},{"$f":"IF(N198>0,Tableau7[[#This Row],[Campagne]],)","v":0},{"$f":"IF(J198>0,Tableau7[[#This Row],[Client]],)","v":0},{"$f":"IF(K198>0,Tableau7[[#This Row],[Parcelles]],)","v":0}]
[{"$nulls":35},{"$f":"IF(N199>0,Tableau7[[#This Row],[Campagne]],)","v":0},{"$f":"IF(J199>0,Tableau7[[#This Row],[Client]],)","v":0},{"$f":"IF(K199>0,Tableau7[[#This Row],[Parcelles]],)","v":0}]
[{"$nulls":35},{"$f":"IF(N200>0,Tableau7[[#This Row],[Campagne]],)","v":0},{"$f":"IF(J200>0,Tableau7[[#This Row],[Client]],)","v":0},{"$f":"IF(K200>0,Tableau7[[#This Row],[Parcelles]],)","v":0}]
[{"$nulls":35},{"$f":"IF(N201>0,Tableau7[[#This Row],[Campagne]],)","v":0},{"$f":"IF(J201>0,Tableau7[[#This Row],[Client]],)","v":0},{"$f":"IF(K201>0,Tableau7[[#This Row],[Parcelles]],)","v":0}]
[{"$nulls":35},{"$f":"IF(N202>0,Tableau7[[#This Row],[Campagne]],)","v":0},{"$f":"IF(J202>0,Tableau7[[#This Row],[Client]],)","v":0},{"$f":"IF(K202>0,Tableau7[[#This Row],[Parcelles]],)","v":0}]
[{"$nulls":35},{"$f":"IF(N203>0,Tableau7[[#This Row],[Campagne]],)","v":0},{"$f":"IF(J203>0,Tableau7[[#This Row],[Client]],)","v":0},{"$f":"IF(K203>0,Tableau7[[#This Row],[Parcelles]],)","v":0}]
[{"$nulls":35},{"$f":"IF(N204>0,Tableau7[[#This Row],[Campagne]],)","v":0},{"$f":"IF(J204>0,Tableau7[[#This Row],[Client]],)","v":0},{"$f":"IF(K204>0,Tableau7[[#This Row],[Parcelles]],)","v":0}]
[{"$nulls":35},{"$f":"IF(N205>0,Tableau7[[#This Row],[Campagne]],)","v":0},{"$f":"IF(J205>0,Tableau7[[#This Row],[Client]],)","v":0},{"$f":"IF(K205>0,Tableau7[[#This Row],[Parcelles]],)","v":0}]
[{"$nulls":35},{"$f":"IF(N206>0,Tableau7[[#This Row],[Campagne]],)","v":0},{"$f":"IF(J206>0,Tableau7[[#This Row],[Client]],)","v":0},{"$f":"IF(K206>0,Tableau7[[#This Row],[Parcelles]],)","v":0}]
[{"$nulls":35},{"$f":"IF(N207>0,Tableau7[[#This Row],[Campagne]],)","v":0},{"$f":"IF(J207>0,Tableau7[[#This Row],[Client]],)","v":0},{"$f":"IF(K207>0,Tableau7[[#This Row],[Parcelles]],)","v":0}]
[{"$nulls":35},{"$f":"IF(N208>0,Tableau7[[#This Row],[Campagne]],)","v":0},{"$f":"IF(J208>0,Tableau7[[#This Row],[Client]],)","v":0},{"$f":"IF(K208>0,Tableau7[[#This Row],[Parcelles]],)","v":0}]
[{"$nulls":35},{"$f":"IF(N209>0,Tableau7[[#This Row],[Campagne]],)","v":0},{"$f":"IF(J209>0,Tableau7[[#This Row],[Client]],)","v":0},{"$f":"IF(K209>0,Tableau7[[#This Row],[Parcelles]],)","v":0}]
[{"$nulls":35},{"$f":"IF(N210>0,Tableau7[[#This Row],[Campagne]],)","v":0},{"$f":"IF(J210>0,Tableau7[[#This Row],[Client]],)","v":0},{"$f":"IF(K210>0,Tableau7[[#This Row],[Parcelles]],)","v":0}]
[{"$nulls":35},{"$f":"IF(N211>0,Tableau7[[#This Row],[Campagne]],)","v":0},{"$f":"IF(J211>0,Tableau7[[#This Row],[Client]],)","v":0},{"$f":"IF(K211>0,Tableau7[[#This Row],[Parcelles]],)","v":0}]
[{"$nulls":35},{"$f":"IF(N212>0,Tableau7[[#This Row],[Campagne]],)","v":0},{"$f":"IF(J212>0,Tableau7[[#This Row],[Client]],)","v":0},{"$f":"IF(K212>0,Tableau7[[#This Row],[Parcelles]],)","v":0}]
[{"$nulls":35},{"$f":"IF(N213>0,Tableau7[[#This Row],[Campagne]],)","v":0},{"$f":"IF(J213>0,Tableau7[[#This Row],[Client]],)","v":0},{"$f":"IF(K213>0,Tableau7[[#This Row],[Parcelles]],)","v":0}]
[{"$nulls":35},{"$f":"IF(N214>0,Tableau7[[#This Row],[Campagne]],)","v":0},{"$f":"IF(J214>0,Tableau7[[#This Row],[Client]],)","v":0},{"$f":"IF(K214>0,Tableau7[[#This Row],[Parcelles]],)","v":0}]
[{"$nulls":35},{"$f":"IF(N215>0,Tableau7[[#This Row],[Campagne]],)","v":0},{"$f":"IF(J215>0,Tableau7[[#This Row],[Client]],)","v":0},{"$f":"IF(K215>0,Tableau7[[#This Row],[Parcelles]],)","v":0}]
[{"$nulls":35},{"$f":"IF(N216>0,Tableau7[[#This Row],[Campagne]],)","v":0},{"$f":"IF(J216>0,Tableau7[[#This Row],[Client]],)","v":0},{"$f":"IF(K216>0,Tableau7[[#This Row],[Parcelles]],)","v":0}]
[{"$nulls":35},{"$f":"IF(N217>0,Tableau7[[#This Row],[Campagne]],)","v":0},{"$f":"IF(J217>0,Tableau7[[#This Row],[Client]],)","v":0},{"$f":"IF(K217>0,Tableau7[[#This Row],[Parcelles]],)","v":0}]
[{"$nulls":35},{"$f":"IF(N218>0,Tableau7[[#This Row],[Campagne]],)","v":0},{"$f":"IF(J218>0,Tableau7[[#This Row],[Client]],)","v":0},{"$f":"IF(K218>0,Tableau7[[#This Row],[Parcelles]],)","v":0}]
[{"$nulls":35},{"$f":"IF(N219>0,Tableau7[[#This Row],[Campagne]],)","v":0},{"$f":"IF(J219>0,Tableau7[[#This Row],[Client]],)","v":0},{"$f":"IF(K219>0,Tableau7[[#This Row],[Parcelles]],)","v":0}]
[{"$nulls":35},{"$f":"IF(N220>0,Tableau7[[#This Row],[Campagne]],)","v":0},{"$f":"IF(J220>0,Tableau7[[#This Row],[Client]],)","v":0},{"$f":"IF(K220>0,Tableau7[[#This Row],[Parcelles]],)","v":0}]
[{"$nulls":35},{"$f":"IF(N221>0,Tableau7[[#This Row],[Campagne]],)","v":0},{"$f":"IF(J221>0,Tableau7[[#This Row],[Client]],)","v":0},{"$f":"IF(K221>0,Tableau7[[#This Row],[Parcelles]],)","v":0}]
[{"$nulls":35},{"$f":"IF(N222>0,Tableau7[[#This Row],[Campagne]],)","v":0},{"$f":"IF(J222>0,Tableau7[[#This Row],[Client]],)","v":0},{"$f":"IF(K222>0,Tableau7[[#This Row],[Parcelles]],)","v":0}]
[{"$nulls":35},{"$f":"IF(N223>0,Tableau7[[#This Row],[Campagne]],)","v":0},{"$f":"IF(J223>0,Tableau7[[#This Row],[Client]],)","v":0},{"$f":"IF(K223>0,Tableau7[[#This Row],[Parcelles]],)","v":0}]
[{"$nulls":35},{"$f":"IF(N224>0,Tableau7[[#This Row],[Campagne]],)","v":0},{"$f":"IF(J224>0,Tableau7[[#This Row],[Client]],)","v":0},{"$f":"IF(K224>0,Tableau7[[#This Row],[Parcelles]],)","v":0}]
[{"$nulls":35},{"$f":"IF(N225>0,Tableau7[[#This Row],[Campagne]],)","v":0},{"$f":"IF(J225>0,Tableau7[[#This Row],[Client]],)","v":0},{"$f":"IF(K225>0,Tableau7[[#This Row],[Parcelles]],)","v":0}]
[{"$nulls":35},{"$f":"IF(N226>0,Tableau7[[#This Row],[Campagne]],)","v":0},{"$f":"IF(J226>0,Tableau7[[#This Row],[Client]],)","v":0},{"$f":"IF(K226>0,Tableau7[[#This Row],[Parcelles]],)","v":0}]
[{"$nulls":35},{"$f":"IF(N227>0,Tableau7[[#This Row],[Campagne]],)","v":0},{"$f":"IF(J227>0,Tableau7[[#This Row],[Client]],)","v":0},{"$f":"IF(K227>0,Tableau7[[#This Row],[Parcelles]],)","v":0}]
[{"$nulls":35},{"$f":"IF(N228>0,Tableau7[[#This Row],[Campagne]],)","v":0},{"$f":"IF(J228>0,Tableau7[[#This Row],[Client]],)","v":0},{"$f":"IF(K228>0,Tableau7[[#This Row],[Parcelles]],)","v":0}]
[{"$nulls":35},{"$f":"IF(N229>0,Tableau7[[#This Row],[Campagne]],)","v":0},{"$f":"IF(J229>0,Tableau7[[#This Row],[Client]],)","v":0},{"$f":"IF(K229>0,Tableau7[[#This Row],[Parcelles]],)","v":0}]
[{"$nulls":35},{"$f":"IF(N230>0,Tableau7[[#This Row],[Campagne]],)","v":0},{"$f":"IF(J230>0,Tableau7[[#This Row],[Client]],)","v":0},{"$f":"IF(K230>0,Tableau7[[#This Row],[Parcelles]],)","v":0}]
[{"$nulls":35},{"$f":"IF(N231>0,Tableau7[[#This Row],[Campagne]],)","v":0},{"$f":"IF(J231>0,Tableau7[[#This Row],[Client]],)","v":0},{"$f":"IF(K231>0,Tableau7[[#This Row],[Parcelles]],)","v":0}]
[{"$nulls":35},{"$f":"IF(N232>0,Tableau7[[#This Row],[Campagne]],)","v":0},{"$f":"IF(J232>0,Tableau7[[#This Row],[Client]],)","v":0},{"$f":"IF(K232>0,Tableau7[[#This Row],[Parcelles]],)","v":0}]
[{"$nulls":35},{"$f":"IF(N233>0,Tableau7[[#This Row],[Campagne]],)","v":0},{"$f":"IF(J233>0,Tableau7[[#This Row],[Client]],)","v":0},{"$f":"IF(K233>0,Tableau7[[#This Row],[Parcelles]],)","v":0}]
[{"$nulls":35},{"$f":"IF(N234>0,Tableau7[[#This Row],[Campagne]],)","v":0},{"$f":"IF(J234>0,Tableau7[[#This Row],[Client]],)","v":0},{"$f":"IF(K234>0,Tableau7[[#This Row],[Parcelles]],)","v":0}]
[{"$nulls":35},{"$f":"IF(N235>0,Tableau7[[#This Row],[Campagne]],)","v":0},{"$f":"IF(J235>0,Tableau7[[#This Row],[Client]],)","v":0},{"$f":"IF(K235>0,Tableau7[[#This Row],[Parcelles]],)","v":0}]
[{"$nulls":35},{"$f":"IF(N236>0,Tableau7[[#This Row],[Campagne]],)","v":0},{"$f":"IF(J236>0,Tableau7[[#This Row],[Client]],)","v":0},{"$f":"IF(K236>0,Tableau7[[#This Row],[Parcelles]],)","v":0}]
[{"$nulls":35},{"$f":"IF(N237>0,Tableau7[[#This Row],[Campagne]],)","v":0},{"$f":"IF(J237>0,Tableau7[[#This Row],[Client]],)","v":0},{"$f":"IF(K237>0,Tableau7[[#This Row],[Parcelles]],)","v":0}]
[{"$nulls":35},{"$f":"IF(N238>0,Tableau7[[#This Row],[Campagne]],)","v":0},{"$f":"IF(J238>0,Tableau7[[#This Row],[Client]],)","v":0},{"$f":"IF(K238>0,Tableau7[[#This Row],[Parcelles]],)","v":0}]
[{"$nulls":35},{"$f":"IF(N239>0,Tableau7[[#This Row],[Campagne]],)","v":0},{"$f":"IF(J239>0,Tableau7[[#This Row],[Client]],)","v":0},{"$f":"IF(K239>0,Tableau7[[#This Row],[Parcelles]],)","v":0}]
[{"$nulls":35},{"$f":"IF(N240>0,Tableau7[[#This Row],[Campagne]],)","v":0},{"$f":"IF(J240>0,Tableau7[[#This Row],[Client]],)","v":0},{"$f":"IF(K240>0,Tableau7[[#This Row],[Parcelles]],)","v":0}]
[{"$nulls":35},{"$f":"IF(N241>0,Tableau7[[#This Row],[Campagne]],)","v":0},{"$f":"IF(J241>0,Tableau7[[#This Row],[Client]],)","v":0},{"$f":"IF(K241>0,Tableau7[[#This Row],[Parcelles]],)","v":0}]
[{"$nulls":35},{"$f":"IF(N242>0,Tableau7[[#This Row],[Campagne]],)","v":0},{"$f":"IF(J242>0,Tableau7[[#This Row],[Client]],)","v":0},{"$f":"IF(K242>0,Tableau7[[#This Row],[Parcelles]],)","v":0}]
[{"$nulls":35},{"$f":"IF(N243>0,Tableau7[[#This Row],[Campagne]],)","v":0},{"$f":"IF(J243>0,Tableau7[[#This Row],[Client]],)","v":0},{"$f":"IF(K243>0,Tableau7[[#This Row],[Parcelles]],)","v":0}]
[{"$nulls":35},{"$f":"IF(N244>0,Tableau7[[#This Row],[Campagne]],)","v":0},{"$f":"IF(J244>0,Tableau7[[#This Row],[Client]],)","v":0},{"$f":"IF(K244>0,Tableau7[[#This Row],[Parcelles]],)","v":0}]
[{"$nulls":35},{"$f":"IF(N245>0,Tableau7[[#This Row],[Campagne]],)","v":0},{"$f":"IF(J245>0,Tableau7[[#This Row],[Client]],)","v":0},{"$f":"IF(K245>0,Tableau7[[#This Row],[Parcelles]],)","v":0}]
[{"$nulls":35},{"$f":"IF(N246>0,Tableau7[[#This Row],[Campagne]],)","v":0},{"$f":"IF(J246>0,Tableau7[[#This Row],[Client]],)","v":0},{"$f":"IF(K246>0,Tableau7[[#This Row],[Parcelles]],)","v":0}]
[{"$nulls":35},{"$f":"IF(N247>0,Tableau7[[#This Row],[Campagne]],)","v":0},{"$f":"IF(J247>0,Tableau7[[#This Row],[Client]],)","v":0},{"$f":"IF(K247>0,Tableau7[[#This Row],[Parcelles]],)","v":0}]
[{"$nulls":35},{"$f":"IF(N248>0,Tableau7[[#This Row],[Campagne]],)","v":0},{"$f":"IF(J248>0,Tableau7[[#This Row],[Client]],)","v":0},{"$f":"IF(K248>0,Tableau7[[#This Row],[Parcelles]],)","v":0}]
[{"$nulls":35},{"$f":"IF(N249>0,Tableau7[[#This Row],[Campagne]],)","v":0},{"$f":"IF(J249>0,Tableau7[[#This Row],[Client]],)","v":0},{"$f":"IF(K249>0,Tableau7[[#This Row],[Parcelles]],)","v":0}]
[{"$nulls":35},{"$f":"IF(N250>0,Tableau7[[#This Row],[Campagne]],)","v":0},{"$f":"IF(J250>0,Tableau7[[#This Row],[Client]],)","v":0},{"$f":"IF(K250>0,Tableau7[[#This Row],[Parcelles]],)","v":0}]
[{"$nulls":35},{"$f":"IF(N251>0,Tableau7[[#This Row],[Campagne]],)","v":0},{"$f":"IF(J251>0,Tableau7[[#This Row],[Client]],)","v":0},{"$f":"IF(K251>0,Tableau7[[#This Row],[Parcelles]],)","v":0}]
[{"$nulls":35},{"$f":"IF(N252>0,Tableau7[[#This Row],[Campagne]],)","v":0},{"$f":"IF(J252>0,Tableau7[[#This Row],[Client]],)","v":0},{"$f":"IF(K252>0,Tableau7[[#This Row],[Parcelles]],)","v":0}]
[{"$nulls":35},{"$f":"IF(N253>0,Tableau7[[#This Row],[Campagne]],)","v":0},{"$f":"IF(J253>0,Tableau7[[#This Row],[Client]],)","v":0},{"$f":"IF(K253>0,Tableau7[[#This Row],[Parcelles]],)","v":0}]
[{"$nulls":35},{"$f":"IF(N254>0,Tableau7[[#This Row],[Campagne]],)","v":0},{"$f":"IF(J254>0,Tableau7[[#This Row],[Client]],)","v":0},{"$f":"IF(K254>0,Tableau7[[#This Row],[Parcelles]],)","v":0}]
[{"$nulls":35},{"$f":"IF(N255>0,Tableau7[[#This Row],[Campagne]],)","v":0},{"$f":"IF(J255>0,Tableau7[[#This Row],[Client]],)","v":0},{"$f":"IF(K255>0,Tableau7[[#This Row],[Parcelles]],)","v":0}]
[{"$nulls":35},{"$f":"IF(N256>0,Tableau7[[#This Row],[Campagne]],)","v":0},{"$f":"IF(J256>0,Tableau7[[#This Row],[Client]],)","v":0},{"$f":"IF(K256>0,Tableau7[[#This Row],[Parcelles]],)","v":0}]
[{"$nulls":35},{"$f":"IF(N257>0,Tableau7[[#This Row],[Campagne]],)","v":0},{"$f":"IF(J257>0,Tableau7[[#This Row],[Client]],)","v":0},{"$f":"IF(K257>0,Tableau7[[#This Row],[Parcelles]],)","v":0}]
[{"$nulls":35},{"$f":"IF(N258>0,Tableau7[[#This Row],[Campagne]],)","v":0},{"$f":"IF(J258>0,Tableau7[[#This Row],[Client]],)","v":0},{"$f":"IF(K258>0,Tableau7[[#This Row],[Parcelles]],)","v":0}]
[{"$nulls":35},{"$f":"IF(N259>0,Tableau7[[#This Row],[Campagne]],)","v":0},{"$f":"IF(J259>0,Tableau7[[#This Row],[Client]],)","v":0},{"$f":"IF(K259>0,Tableau7[[#This Row],[Parcelles]],)","v":0}]
[{"$nulls":35},{"$f":"IF(N260>0,Tableau7[[#This Row],[Campagne]],)","v":0},{"$f":"IF(J260>0,Tableau7[[#This Row],[Client]],)","v":0},{"$f":"IF(K260>0,Tableau7[[#This Row],[Parcelles]],)","v":0}]
[{"$nulls":35},{"$f":"IF(N261>0,Tableau7[[#This Row],[Campagne]],)","v":0},{"$f":"IF(J261>0,Tableau7[[#This Row],[Client]],)","v":0},{"$f":"IF(K261>0,Tableau7[[#This Row],[Parcelles]],)","v":0}]
[{"$nulls":35},{"$f":"IF(N262>0,Tableau7[[#This Row],[Campagne]],)","v":0},{"$f":"IF(J262>0,Tableau7[[#This Row],[Client]],)","v":0},{"$f":"IF(K262>0,Tableau7[[#This Row],[Parcelles]],)","v":0}]
[{"$nulls":35},{"$f":"IF(N263>0,Tableau7[[#This Row],[Campagne]],)","v":0},{"$f":"IF(J263>0,Tableau7[[#This Row],[Client]],)","v":0},{"$f":"IF(K263>0,Tableau7[[#This Row],[Parcelles]],)","v":0}]
[{"$nulls":35},{"$f":"IF(N264>0,Tableau7[[#This Row],[Campagne]],)","v":0},{"$f":"IF(J264>0,Tableau7[[#This Row],[Client]],)","v":0},{"$f":"IF(K264>0,Tableau7[[#This Row],[Parcelles]],)","v":0}]
[{"$nulls":35},{"$f":"IF(N265>0,Tableau7[[#This Row],[Campagne]],)","v":0},{"$f":"IF(J265>0,Tableau7[[#This Row],[Client]],)","v":0},{"$f":"IF(K265>0,Tableau7[[#This Row],[Parcelles]],)","v":0}]
[{"$nulls":35},{"$f":"IF(N266>0,Tableau7[[#This Row],[Campagne]],)","v":0},{"$f":"IF(J266>0,Tableau7[[#This Row],[Client]],)","v":0},{"$f":"IF(K266>0,Tableau7[[#This Row],[Parcelles]],)","v":0}]
[{"$nulls":35},{"$f":"IF(N267>0,Tableau7[[#This Row],[Campagne]],)","v":0},{"$f":"IF(J267>0,Tableau7[[#This Row],[Client]],)","v":0},{"$f":"IF(K267>0,Tableau7[[#This Row],[Parcelles]],)","v":0}]
[{"$nulls":35},{"$f":"IF(N268>0,Tableau7[[#This Row],[Campagne]],)","v":0},{"$f":"IF(J268>0,Tableau7[[#This Row],[Client]],)","v":0},{"$f":"IF(K268>0,Tableau7[[#This Row],[Parcelles]],)","v":0}]
[{"$nulls":35},{"$f":"IF(N269>0,Tableau7[[#This Row],[Campagne]],)","v":0},{"$f":"IF(J269>0,Tableau7[[#This Row],[Client]],)","v":0},{"$f":"IF(K269>0,Tableau7[[#This Row],[Parcelles]],)","v":0}]
[{"$nulls":35},{"$f":"IF(N270>0,Tableau7[[#This Row],[Campagne]],)","v":0},{"$f":"IF(J270>0,Tableau7[[#This Row],[Client]],)","v":0},{"$f":"IF(K270>0,Tableau7[[#This Row],[Parcelles]],)","v":0}]
[{"$nulls":35},{"$f":"IF(N271>0,Tableau7[[#This Row],[Campagne]],)","v":0},{"$f":"IF(J271>0,Tableau7[[#This Row],[Client]],)","v":0},{"$f":"IF(K271>0,Tableau7[[#This Row],[Parcelles]],)","v":0}]
[{"$nulls":35},{"$f":"IF(N272>0,Tableau7[[#This Row],[Campagne]],)","v":0},{"$f":"IF(J272>0,Tableau7[[#This Row],[Client]],)","v":0},{"$f":"IF(K272>0,Tableau7[[#This Row],[Parcelles]],)","v":0}]
[{"$nulls":35},{"$f":"IF(N273>0,Tableau7[[#This Row],[Campagne]],)","v":0},{"$f":"IF(J273>0,Tableau7[[#This Row],[Client]],)","v":0},{"$f":"IF(K273>0,Tableau7[[#This Row],[Parcelles]],)","v":0}]
[{"$nulls":35},{"$f":"IF(N274>0,Tableau7[[#This Row],[Campagne]],)","v":0},{"$f":"IF(J274>0,Tableau7[[#This Row],[Client]],)","v":0},{"$f":"IF(K274>0,Tableau7[[#This Row],[Parcelles]],)","v":0}]
[{"$nulls":35},{"$f":"IF(N275>0,Tableau7[[#This Row],[Campagne]],)","v":0},{"$f":"IF(J275>0,Tableau7[[#This Row],[Client]],)","v":0},{"$f":"IF(K275>0,Tableau7[[#This Row],[Parcelles]],)","v":0}]
[{"$nulls":35},{"$f":"IF(N276>0,Tableau7[[#This Row],[Campagne]],)","v":0},{"$f":"IF(J276>0,Tableau7[[#This Row],[Client]],)","v":0},{"$f":"IF(K276>0,Tableau7[[#This Row],[Parcelles]],)","v":0}]
[{"$nulls":35},{"$f":"IF(N277>0,Tableau7[[#This Row],[Campagne]],)","v":0},{"$f":"IF(J277>0,Tableau7[[#This Row],[Client]],)","v":0},{"$f":"IF(K277>0,Tableau7[[#This Row],[Parcelles]],)","v":0}]
[{"$nulls":35},{"$f":"IF(N278>0,Tableau7[[#This Row],[Campagne]],)","v":0},{"$f":"IF(J278>0,Tableau7[[#This Row],[Client]],)","v":0},{"$f":"IF(K278>0,Tableau7[[#This Row],[Parcelles]],)","v":0}]
[{"$nulls":35},{"$f":"IF(N279>0,Tableau7[[#This Row],[Campagne]],)","v":0},{"$f":"IF(J279>0,Tableau7[[#This Row],[Client]],)","v":0},{"$f":"IF(K279>0,Tableau7[[#This Row],[Parcelles]],)","v":0}]
[{"$nulls":35},{"$f":"IF(N280>0,Tableau7[[#This Row],[Campagne]],)","v":0},{"$f":"IF(J280>0,Tableau7[[#This Row],[Client]],)","v":0},{"$f":"IF(K280>0,Tableau7[[#This Row],[Parcelles]],)","v":0}]
[{"$nulls":35},{"$f":"IF(N281>0,Tableau7[[#This Row],[Campagne]],)","v":0},{"$f":"IF(J281>0,Tableau7[[#This Row],[Client]],)","v":0},{"$f":"IF(K281>0,Tableau7[[#This Row],[Parcelles]],)","v":0}]
[{"$nulls":35},{"$f":"IF(N282>0,Tableau7[[#This Row],[Campagne]],)","v":0},{"$f":"IF(J282>0,Tableau7[[#This Row],[Client]],)","v":0},{"$f":"IF(K282>0,Tableau7[[#This Row],[Parcelles]],)","v":0}]
[{"$nulls":35},{"$f":"IF(N283>0,Tableau7[[#This Row],[Campagne]],)","v":0},{"$f":"IF(J283>0,Tableau7[[#This Row],[Client]],)","v":0},{"$f":"IF(K283>0,Tableau7[[#This Row],[Parcelles]],)","v":0}]
[{"$nulls":35},{"$f":"IF(N284>0,Tableau7[[#This Row],[Campagne]],)","v":0},{"$f":"IF(J284>0,Tableau7[[#This Row],[Client]],)","v":0},{"$f":"IF(K284>0,Tableau7[[#This Row],[Parcelles]],)","v":0}]
[{"$nulls":35},{"$f":"IF(N285>0,Tableau7[[#This Row],[Campagne]],)","v":0},{"$f":"IF(J285>0,Tableau7[[#This Row],[Client]],)","v":0},{"$f":"IF(K285>0,Tableau7[[#This Row],[Parcelles]],)","v":0}]
[{"$nulls":35},{"$f":"IF(N286>0,Tableau7[[#This Row],[Campagne]],)","v":0},{"$f":"IF(J286>0,Tableau7[[#This Row],[Client]],)","v":0},{"$f":"IF(K286>0,Tableau7[[#This Row],[Parcelles]],)","v":0}]
[{"$nulls":35},{"$f":"IF(N287>0,Tableau7[[#This Row],[Campagne]],)","v":0},{"$f":"IF(J287>0,Tableau7[[#This Row],[Client]],)","v":0},{"$f":"IF(K287>0,Tableau7[[#This Row],[Parcelles]],)","v":0}]
[{"$nulls":35},{"$f":"IF(N288>0,Tableau7[[#This Row],[Campagne]],)","v":0},{"$f":"IF(J288>0,Tableau7[[#This Row],[Client]],)","v":0},{"$f":"IF(K288>0,Tableau7[[#This Row],[Parcelles]],)","v":0}]
[{"$nulls":35},{"$f":"IF(N289>0,Tableau7[[#This Row],[Campagne]],)","v":0},{"$f":"IF(J289>0,Tableau7[[#This Row],[Client]],)","v":0},{"$f":"IF(K289>0,Tableau7[[#This Row],[Parcelles]],)","v":0}]
[{"$nulls":35},{"$f":"IF(N290>0,Tableau7[[#This Row],[Campagne]],)","v":0},{"$f":"IF(J290>0,Tableau7[[#This Row],[Client]],)","v":0},{"$f":"IF(K290>0,Tableau7[[#This Row],[Parcelles]],)","v":0}]
[{"$nulls":35},{"$f":"IF(N291>0,Tableau7[[#This Row],[Campagne]],)","v":0},{"$f":"IF(J291>0,Tableau7[[#This Row],[Client]],)","v":0},{"$f":"IF(K291>0,Tableau7[[#This Row],[Parcelles]],)","v":0}]
[{"$nulls":35},{"$f":"IF(N292>0,Tableau7[[#This Row],[Campagne]],)","v":0},{"$f":"IF(J292>0,Tableau7[[#This Row],[Client]],)","v":0},{"$f":"IF(K292>0,Tableau7[[#This Row],[Parcelles]],)","v":0}]
[{"$nulls":35},{"$f":"IF(N293>0,Tableau7[[#This Row],[Campagne]],)","v":0},{"$f":"IF(J293>0,Tableau7[[#This Row],[Client]],)","v":0},{"$f":"IF(K293>0,Tableau7[[#This Row],[Parcelles]],)","v":0}]
[{"$nulls":35},{"$f":"IF(N294>0,Tableau7[[#This Row],[Campagne]],)","v":0},{"$f":"IF(J294>0,Tableau7[[#This Row],[Client]],)","v":0},{"$f":"IF(K294>0,Tableau7[[#This Row],[Parcelles]],)","v":0}]
[{"$nulls":35},{"$f":"IF(N295>0,Tableau7[[#This Row],[Campagne]],)","v":0},{"$f":"IF(J295>0,Tableau7[[#This Row],[Client]],)","v":0},{"$f":"IF(K295>0,Tableau7[[#This Row],[Parcelles]],)","v":0}]
[{"$nulls":35},{"$f":"IF(N296>0,Tableau7[[#This Row],[Campagne]],)","v":0},{"$f":"IF(J296>0,Tableau7[[#This Row],[Client]],)","v":0},{"$f":"IF(K296>0,Tableau7[[#This Row],[Parcelles]],)","v":0}]
[{"$nulls":35},{"$f":"IF(N297>0,Tableau7[[#This Row],[Campagne]],)","v":0},{"$f":"IF(J297>0,Tableau7[[#This Row],[Client]],)","v":0},{"$f":"IF(K297>0,Tableau7[[#This Row],[Parcelles]],)","v":0}]
[{"$nulls":35},{"$f":"IF(N298>0,Tableau7[[#This Row],[Campagne]],)","v":0},{"$f":"IF(J298>0,Tableau7[[#This Row],[Client]],)","v":0},{"$f":"IF(K298>0,Tableau7[[#This Row],[Parcelles]],)","v":0}]
[{"$nulls":35},{"$f":"IF(N299>0,Tableau7[[#This Row],[Campagne]],)","v":0},{"$f":"IF(J299>0,Tableau7[[#This Row],[Client]],)","v":0},{"$f":"IF(K299>0,Tableau7[[#This Row],[Parcelles]],)","v":0}]
[{"$nulls":35},{"$f":"IF(N300>0,Tableau7[[#This Row],[Campagne]],)","v":0},{"$f":"IF(J300>0,Tableau7[[#This Row],[Client]],)","v":0},{"$f":"IF(K300>0,Tableau7[[#This Row],[Parcelles]],)","v":0}]
[{"$nulls":35},{"$f":"IF(N301>0,Tableau7[[#This Row],[Campagne]],)","v":0},{"$f":"IF(J301>0,Tableau7[[#This Row],[Client]],)","v":0},{"$f":"IF(K301>0,Tableau7[[#This Row],[Parcelles]],)","v":0}]
[{"$nulls":35},{"$f":"IF(N302>0,Tableau7[[#This Row],[Campagne]],)","v":0},{"$f":"IF(J302>0,Tableau7[[#This Row],[Client]],)","v":0},{"$f":"IF(K302>0,Tableau7[[#This Row],[Parcelles]],)","v":0}]
[{"$nulls":35},{"$f":"IF(N303>0,Tableau7[[#This Row],[Campagne]],)","v":0},{"$f":"IF(J303>0,Tableau7[[#This Row],[Client]],)","v":0},{"$f":"IF(K303>0,Tableau7[[#This Row],[Parcelles]],)","v":0}]
[{"$nulls":35},{"$f":"IF(N304>0,Tableau7[[#This Row],[Campagne]],)","v":0},{"$f":"IF(J304>0,Tableau7[[#This Row],[Client]],)","v":0},{"$f":"IF(K304>0,Tableau7[[#This Row],[Parcelles]],)","v":0}]
[{"$nulls":35},{"$f":"IF(N305>0,Tableau7[[#This Row],[Campagne]],)","v":0},{"$f":"IF(J305>0,Tableau7[[#This Row],[Client]],)","v":0},{"$f":"IF(K305>0,Tableau7[[#This Row],[Parcelles]],)","v":0}]
[{"$nulls":35},{"$f":"IF(N306>0,Tableau7[[#This Row],[Campagne]],)","v":0},{"$f":"IF(J306>0,Tableau7[[#This Row],[Client]],)","v":0},{"$f":"IF(K306>0,Tableau7[[#This Row],[Parcelles]],)","v":0}]
[{"$nulls":35},{"$f":"IF(N307>0,Tableau7[[#This Row],[Campagne]],)","v":0},{"$f":"IF(J307>0,Tableau7[[#This Row],[Client]],)","v":0},{"$f":"IF(K307>0,Tableau7[[#This Row],[Parcelles]],)","v":0}]
[{"$nulls":35},{"$f":"IF(N308>0,Tableau7[[#This Row],[Campagne]],)","v":0},{"$f":"IF(J308>0,Tableau7[[#This Row],[Client]],)","v":0},{"$f":"IF(K308>0,Tableau7[[#This Row],[Parcelles]],)","v":0}]
[{"$nulls":35},{"$f":"IF(N309>0,Tableau7[[#This Row],[Campagne]],)","v":0},{"$f":"IF(J309>0,Tableau7[[#This Row],[Client]],)","v":0},{"$f":"IF(K309>0,Tableau7[[#This Row],[Parcelles]],)","v":0}]
[{"$nulls":35},{"$f":"IF(N310>0,Tableau7[[#This Row],[Campagne]],)","v":0},{"$f":"IF(J310>0,Tableau7[[#This Row],[Client]],)","v":0},{"$f":"IF(K310>0,Tableau7[[#This Row],[Parcelles]],)","v":0}]
[{"$nulls":35},{"$f":"IF(N311>0,Tableau7[[#This Row],[Campagne]],)","v":0},{"$f":"IF(J311>0,Tableau7[[#This Row],[Client]],)","v":0},{"$f":"IF(K311>0,Tableau7[[#This Row],[Parcelles]],)","v":0}]
[{"$nulls":35},{"$f":"IF(N312>0,Tableau7[[#This Row],[Campagne]],)","v":0},{"$f":"IF(J312>0,Tableau7[[#This Row],[Client]],)","v":0},{"$f":"IF(K312>0,Tableau7[[#This Row],[Parcelles]],)","v":0}]
[{"$nulls":35},{"$f":"IF(N313>0,Tableau7[[#This Row],[Campagne]],)","v":0},{"$f":"IF(J313>0,Tableau7[[#This Row],[Client]],)","v":0},{"$f":"IF(K313>0,Tableau7[[#This Row],[Parcelles]],)","v":0}]
[{"$nulls":35},{"$f":"IF(N314>0,Tableau7[[#This Row],[Campagne]],)","v":0},{"$f":"IF(J314>0,Tableau7[[#This Row],[Client]],)","v":0},{"$f":"IF(K314>0,Tableau7[[#This Row],[Parcelles]],)","v":0}]
[{"$nulls":35},{"$f":"IF(N315>0,Tableau7[[#This Row],[Campagne]],)","v":0},{"$f":"IF(J315>0,Tableau7[[#This Row],[Client]],)","v":0},{"$f":"IF(K315>0,Tableau7[[#This Row],[Parcelles]],)","v":0}]
[{"$nulls":35},{"$f":"IF(N316>0,Tableau7[[#This Row],[Campagne]],)","v":0},{"$f":"IF(J316>0,Tableau7[[#This Row],[Client]],)","v":0},{"$f":"IF(K316>0,Tableau7[[#This Row],[Parcelles]],)","v":0}]
[{"$nulls":35},{"$f":"IF(N317>0,Tableau7[[#This Row],[Campagne]],)","v":0},{"$f":"IF(J317>0,Tableau7[[#This Row],[Client]],)","v":0},{"$f":"IF(K317>0,Tableau7[[#This Row],[Parcelles]],)","v":0}]
[{"$nulls":35},{"$f":"IF(N318>0,Tableau7[[#This Row],[Campagne]],)","v":0},{"$f":"IF(J318>0,Tableau7[[#This Row],[Client]],)","v":0},{"$f":"IF(K318>0,Tableau7[[#This Row],[Parcelles]],)","v":0}]
[{"$nulls":35},{"$f":"IF(N319>0,Tableau7[[#This Row],[Campagne]],)","v":0},{"$f":"IF(J319>0,Tableau7[[#This Row],[Client]],)","v":0},{"$f":"IF(K319>0,Tableau7[[#This Row],[Parcelles]],)","v":0}]
[{"$nulls":35},{"$f":"IF(N320>0,Tableau7[[#This Row],[Campagne]],)","v":0},{"$f":"IF(J320>0,Tableau7[[#This Row],[Client]],)","v":0},{"$f":"IF(K320>0,Tableau7[[#This Row],[Parcelles]],)","v":0}]
[{"$nulls":35},{"$f":"IF(N321>0,Tableau7[[#This Row],[Campagne]],)","v":0},{"$f":"IF(J321>0,Tableau7[[#This Row],[Client]],)","v":0},{"$f":"IF(K321>0,Tableau7[[#This Row],[Parcelles]],)","v":0}]
[{"$nulls":35},{"$f":"IF(N322>0,Tableau7[[#This Row],[Campagne]],)","v":0},{"$f":"IF(J322>0,Tableau7[[#This Row],[Client]],)","v":0},{"$f":"IF(K322>0,Tableau7[[#This Row],[Parcelles]],)","v":0}]
[{"$nulls":35},{"$f":"IF(N323>0,Tableau7[[#This Row],[Campagne]],)","v":0},{"$f":"IF(J323>0,Tableau7[[#This Row],[Client]],)","v":0},{"$f":"IF(K323>0,Tableau7[[#This Row],[Parcelles]],)","v":0}]
[{"$nulls":35},{"$f":"IF(N324>0,Tableau7[[#This Row],[Campagne]],)","v":0},{"$f":"IF(J324>0,Tableau7[[#This Row],[Client]],)","v":0},{"$f":"IF(K324>0,Tableau7[[#This Row],[Parcelles]],)","v":0}]
[{"$nulls":35},{"$f":"IF(N325>0,Tableau7[[#This Row],[Campagne]],)","v":0},{"$f":"IF(J325>0,Tableau7[[#This Row],[Client]],)","v":0},{"$f":"IF(K325>0,Tableau7[[#This Row],[Parcelles]],)","v":0}]
[{"$nulls":35},{"$f":"IF(N326>0,Tableau7[[#This Row],[Campagne]],)","v":0},{"$f":"IF(J326>0,Tableau7[[#This Row],[Client]],)","v":0},{"$f":"IF(K326>0,Tableau7[[#This Row],[Parcelles]],)","v":0}]
[{"$nulls":35},{"$f":"IF(N327>0,Tableau7[[#This Row],[Campagne]],)","v":0},{"$f":"IF(J327>0,Tableau7[[#This Row],[Client]],)","v":0},{"$f":"IF(K327>0,Tableau7[[#This Row],[Parcelles]],)","v":0}]
[{"$nulls":35},{"$f":"IF(N328>0,Tableau7[[#This Row],[Campagne]],)","v":0},{"$f":"IF(J328>0,Tableau7[[#This Row],[Client]],)","v":0},{"$f":"IF(K328>0,Tableau7[[#This Row],[Parcelles]],)","v":0}]
[{"$nulls":35},{"$f":"IF(N329>0,Tableau7[[#This Row],[Campagne]],)","v":0},{"$f":"IF(J329>0,Tableau7[[#This Row],[Client]],)","v":0},{"$f":"IF(K329>0,Tableau7[[#This Row],[Parcelles]],)","v":0}]
[{"$nulls":35},{"$f":"IF(N330>0,Tableau7[[#This Row],[Campagne]],)","v":0},{"$f":"IF(J330>0,Tableau7[[#This Row],[Client]],)","v":0},{"$f":"IF(K330>0,Tableau7[[#This Row],[Parcelles]],)","v":0}]
[{"$nulls":35},{"$f":"IF(N331>0,Tableau7[[#This Row],[Campagne]],)","v":0},{"$f":"IF(J331>0,Tableau7[[#This Row],[Client]],)","v":0},{"$f":"IF(K331>0,Tableau7[[#This Row],[Parcelles]],)","v":0}]
[{"$nulls":35},{"$f":"IF(N332>0,Tableau7[[#This Row],[Campagne]],)","v":0},{"$f":"IF(J332>0,Tableau7[[#This Row],[Client]],)","v":0},{"$f":"IF(K332>0,Tableau7[[#This Row],[Parcelles]],)","v":0}]
[{"$nulls":35},{"$f":"IF(N333>0,Tableau7[[#This Row],[Campagne]],)","v":0},{"$f":"IF(J333>0,Tableau7[[#This Row],[Client]],)","v":0},{"$f":"IF(K333>0,Tableau7[[#This Row],[Parcelles]],)","v":0}]
[{"$nulls":35},{"$f":"IF(N334>0,Tableau7[[#This Row],[Campagne]],)","v":0},{"$f":"IF(J334>0,Tableau7[[#This Row],[Client]],)","v":0},{"$f":"IF(K334>0,Tableau7[[#This Row],[Parcelles]],)","v":0}]
[{"$nulls":35},{"$f":"IF(N335>0,Tableau7[[#This Row],[Campagne]],)","v":0},{"$f":"IF(J335>0,Tableau7[[#This Row],[Client]],)","v":0},{"$f":"IF(K335>0,Tableau7[[#This Row],[Parcelles]],)","v":0}]
[{"$nulls":35},{"$f":"IF(N336>0,Tableau7[[#This Row],[Campagne]],)","v":0},{"$f":"IF(J336>0,Tableau7[[#This Row],[Client]],)","v":0},{"$f":"IF(K336>0,Tableau7[[#This Row],[Parcelles]],)","v":0}]
[{"$nulls":35},{"$f":"IF(N337>0,Tableau7[[#This Row],[Campagne]],)","v":0},{"$f":"IF(J337>0,Tableau7[[#This Row],[Client]],)","v":0},{"$f":"IF(K337>0,Tableau7[[#This Row],[Parcelles]],)","v":0}]
[{"$nulls":35},{"$f":"IF(N338>0,Tableau7[[#This Row],[Campagne]],)","v":0},{"$f":"IF(J338>0,Tableau7[[#This Row],[Client]],)","v":0},{"$f":"IF(K338>0,Tableau7[[#This Row],[Parcelles]],)","v":0}]
[{"$nulls":35},{"$f":"IF(N339>0,Tableau7[[#This Row],[Campagne]],)","v":0},{"$f":"IF(J339>0,Tableau7[[#This Row],[Client]],)","v":0},{"$f":"IF(K339>0,Tableau7[[#This Row],[Parcelles]],)","v":0}]
[{"$nulls":35},{"$f":"IF(N340>0,Tableau7[[#This Row],[Campagne]],)","v":0},{"$f":"IF(J340>0,Tableau7[[#This Row],[Client]],)","v":0},{"$f":"IF(K340>0,Tableau7[[#This Row],[Parcelles]],)","v":0}]
[{"$nulls":35},{"$f":"IF(N341>0,Tableau7[[#This Row],[Campagne]],)","v":0},{"$f":"IF(J341>0,Tableau7[[#This Row],[Client]],)","v":0},{"$f":"IF(K341>0,Tableau7[[#This Row],[Parcelles]],)","v":0}]
[{"$nulls":35},{"$f":"IF(N342>0,Tableau7[[#This Row],[Campagne]],)","v":0},{"$f":"IF(J342>0,Tableau7[[#This Row],[Client]],)","v":0},{"$f":"IF(K342>0,Tableau7[[#This Row],[Parcelles]],)","v":0}]
[{"$nulls":35},{"$f":"IF(N343>0,Tableau7[[#This Row],[Campagne]],)","v":0},{"$f":"IF(J343>0,Tableau7[[#This Row],[Client]],)","v":0},{"$f":"IF(K343>0,Tableau7[[#This Row],[Parcelles]],)","v":0}]
[{"$nulls":35},{"$f":"IF(N344>0,Tableau7[[#This Row],[Campagne]],)","v":0},{"$f":"IF(J344>0,Tableau7[[#This Row],[Client]],)","v":0},{"$f":"IF(K344>0,Tableau7[[#This Row],[Parcelles]],)","v":0}]
[{"$nulls":35},{"$f":"IF(N345>0,Tableau7[[#This Row],[Campagne]],)","v":0},{"$f":"IF(J345>0,Tableau7[[#This Row],[Client]],)","v":0},{"$f":"IF(K345>0,Tableau7[[#This Row],[Parcelles]],)","v":0}]
[{"$nulls":35},{"$f":"IF(N346>0,Tableau7[[#This Row],[Campagne]],)","v":0},{"$f":"IF(J346>0,Tableau7[[#This Row],[Client]],)","v":0},{"$f":"IF(K346>0,Tableau7[[#This Row],[Parcelles]],)","v":0}]
[{"$nulls":35},{"$f":"IF(N347>0,Tableau7[[#This Row],[Campagne]],)","v":0},{"$f":"IF(J347>0,Tableau7[[#This Row],[Client]],)","v":0},{"$f":"IF(K347>0,Tableau7[[#This Row],[Parcelles]],)","v":0}]
[{"$nulls":35},{"$f":"IF(N348>0,Tableau7[[#This Row],[Campagne]],)","v":0},{"$f":"IF(J348>0,Tableau7[[#This Row],[Client]],)","v":0},{"$f":"IF(K348>0,Tableau7[[#This Row],[Parcelles]],)","v":0}]
[{"$nulls":35},{"$f":"IF(N349>0,Tableau7[[#This Row],[Campagne]],)","v":0},{"$f":"IF(J349>0,Tableau7[[#This Row],[Client]],)","v":0},{"$f":"IF(K349>0,Tableau7[[#This Row],[Parcelles]],)","v":0}]
[{"$nulls":35},{"$f":"IF(N350>0,Tableau7[[#This Row],[Campagne]],)","v":0},{"$f":"IF(J350>0,Tableau7[[#This Row],[Client]],)","v":0},{"$f":"IF(K350>0,Tableau7[[#This Row],[Parcelles]],)","v":0}]
[{"$nulls":35},{"$f":"IF(N351>0,Tableau7[[#This Row],[Campagne]],)","v":0},{"$f":"IF(J351>0,Tableau7[[#This Row],[Client]],)","v":0},{"$f":"IF(K351>0,Tableau7[[#This Row],[Parcelles]],)","v":0}]
[{"$nulls":35},{"$f":"IF(N352>0,Tableau7[[#This Row],[Campagne]],)","v":0},{"$f":"IF(J352>0,Tableau7[[#This Row],[Client]],)","v":0},{"$f":"IF(K352>0,Tableau7[[#This Row],[Parcelles]],)","v":0}]
[{"$nulls":35},{"$f":"IF(N353>0,Tableau7[[#This Row],[Campagne]],)","v":0},{"$f":"IF(J353>0,Tableau7[[#This Row],[Client]],)","v":0},{"$f":"IF(K353>0,Tableau7[[#This Row],[Parcelles]],)","v":0}]
[{"$nulls":35},{"$f":"IF(N354>0,Tableau7[[#This Row],[Campagne]],)","v":0},{"$f":"IF(J354>0,Tableau7[[#This Row],[Client]],)","v":0},{"$f":"IF(K354>0,Tableau7[[#This Row],[Parcelles]],)","v":0}]
[{"$nulls":35},{"$f":"IF(N355>0,Tableau7[[#This Row],[Campagne]],)","v":0},{"$f":"IF(J355>0,Tableau7[[#This Row],[Client]],)","v":0},{"$f":"IF(K355>0,Tableau7[[#This Row],[Parcelles]],)","v":0}]
[{"$nulls":35},{"$f":"IF(N356>0,Tableau7[[#This Row],[Campagne]],)","v":0},{"$f":"IF(J356>0,Tableau7[[#This Row],[Client]],)","v":0},{"$f":"IF(K356>0,Tableau7[[#This Row],[Parcelles]],)","v":0}]
[{"$nulls":35},{"$f":"IF(N357>0,Tableau7[[#This Row],[Campagne]],)","v":0},{"$f":"IF(J357>0,Tableau7[[#This Row],[Client]],)","v":0},{"$f":"IF(K357>0,Tableau7[[#This Row],[Parcelles]],)","v":0}]
[{"$nulls":35},{"$f":"IF(N358>0,Tableau7[[#This Row],[Campagne]],)","v":0},{"$f":"IF(J358>0,Tableau7[[#This Row],[Client]],)","v":0},{"$f":"IF(K358>0,Tableau7[[#This Row],[Parcelles]],)","v":0}]
[{"$nulls":35},{"$f":"IF(N359>0,Tableau7[[#This Row],[Campagne]],)","v":0},{"$f":"IF(J359>0,Tableau7[[#This Row],[Client]],)","v":0},{"$f":"IF(K359>0,Tableau7[[#This Row],[Parcelles]],)","v":0}]
[{"$nulls":35},{"$f":"IF(N360>0,Tableau7[[#This Row],[Campagne]],)","v":0},{"$f":"IF(J360>0,Tableau7[[#This Row],[Client]],)","v":0},{"$f":"IF(K360>0,Tableau7[[#This Row],[Parcelles]],)","v":0}]
[{"$nulls":35},{"$f":"IF(N361>0,Tableau7[[#This Row],[Campagne]],)","v":0},{"$f":"IF(J361>0,Tableau7[[#This Row],[Client]],)","v":0},{"$f":"IF(K361>0,Tableau7[[#This Row],[Parcelles]],)","v":0}]
[{"$nulls":35},{"$f":"IF(N362>0,Tableau7[[#This Row],[Campagne]],)","v":0},{"$f":"IF(J362>0,Tableau7[[#This Row],[Client]],)","v":0},{"$f":"IF(K362>0,Tableau7[[#This Row],[Parcelles]],)","v":0}]
[{"$nulls":35},{"$f":"IF(N363>0,Tableau7[[#This Row],[Campagne]],)","v":0},{"$f":"IF(J363>0,Tableau7[[#This Row],[Client]],)","v":0},{"$f":"IF(K363>0,Tableau7[[#This Row],[Parcelles]],)","v":0}]
[{"$nulls":35},{"$f":"IF(N364>0,Tableau7[[#This Row],[Campagne]],)","v":0},{"$f":"IF(J364>0,Tableau7[[#This Row],[Client]],)","v":0},{"$f":"IF(K364>0,Tableau7[[#This Row],[Parcelles]],)","v":0}]
[{"$nulls":35},{"$f":"IF(N365>0,Tableau7[[#This Row],[Campagne]],)","v":0},{"$f":"IF(J365>0,Tableau7[[#This Row],[Client]],)","v":0},{"$f":"IF(K365>0,Tableau7[[#This Row],[Parcelles]],)","v":0}]
[{"$nulls":35},{"$f":"IF(N366>0,Tableau7[[#This Row],[Campagne]],)","v":0},{"$f":"IF(J366>0,Tableau7[[#This Row],[Client]],)","v":0},{"$f":"IF(K366>0,Tableau7[[#This Row],[Parcelles]],)","v":0}]
[{"$nulls":35},{"$f":"IF(N367>0,Tableau7[[#This Row],[Campagne]],)","v":0},{"$f":"IF(J367>0,Tableau7[[#This Row],[Client]],)","v":0},{"$f":"IF(K367>0,Tableau7[[#This Row],[Parcelles]],)","v":0}]
[{"$nulls":35},{"$f":"IF(N368>0,Tableau7[[#This Row],[Campagne]],)","v":0},{"$f":"IF(J368>0,Tableau7[[#This Row],[Client]],)","v":0},{"$f":"IF(K368>0,Tableau7[[#This Row],[Parcelles]],)","v":0}]
[{"$nulls":35},{"$f":"IF(N369>0,Tableau7[[#This Row],[Campagne]],)","v":0},{"$f":"IF(J369>0,Tableau7[[#This Row],[Client]],)","v":0},{"$f":"IF(K369>0,Tableau7[[#This Row],[Parcelles]],)","v":0}]
[{"$nulls":35},{"$f":"IF(N370>0,Tableau7[[#This Row],[Campagne]],)","v":0},{"$f":"IF(J370>0,Tableau7[[#This Row],[Client]],)","v":0},{"$f":"IF(K370>0,Tableau7[[#This Row],[Parcelles]],)","v":0}]
[{"$nulls":35},{"$f":"IF(N371>0,Tableau7[[#This Row],[Campagne]],)","v":0},{"$f":"IF(J371>0,Tableau7[[#This Row],[Client]],)","v":0},{"$f":"IF(K371>0,Tableau7[[#This Row],[Parcelles]],)","v":0}]
[{"$nulls":35},{"$f":"IF(N372>0,Tableau7[[#This Row],[Campagne]],)","v":0},{"$f":"IF(J372>0,Tableau7[[#This Row],[Client]],)","v":0},{"$f":"IF(K372>0,Tableau7[[#This Row],[Parcelles]],)","v":0}]
[{"$nulls":35},{"$f":"IF(N373>0,Tableau7[[#This Row],[Campagne]],)","v":0},{"$f":"IF(J373>0,Tableau7[[#This Row],[Client]],)","v":0},{"$f":"IF(K373>0,Tableau7[[#This Row],[Parcelles]],)","v":0}]
[{"$nulls":35},{"$f":"IF(N374>0,Tableau7[[#This Row],[Campagne]],)","v":0},{"$f":"IF(J374>0,Tableau7[[#This Row],[Client]],)","v":0},{"$f":"IF(K374>0,Tableau7[[#This Row],[Parcelles]],)","v":0}]
[{"$nulls":35},{"$f":"IF(N375>0,Tableau7[[#This Row],[Campagne]],)","v":0},{"$f":"IF(J375>0,Tableau7[[#This Row],[Client]],)","v":0},{"$f":"IF(K375>0,Tableau7[[#This Row],[Parcelles]],)","v":0}]
[{"$nulls":35},{"$f":"IF(N376>0,Tableau7[[#This Row],[Campagne]],)","v":0},{"$f":"IF(J376>0,Tableau7[[#This Row],[Client]],)","v":0},{"$f":"IF(K376>0,Tableau7[[#This Row],[Parcelles]],)","v":0}]
[{"$nulls":35},{"$f":"IF(N377>0,Tableau7[[#This Row],[Campagne]],)","v":0},{"$f":"IF(J377>0,Tableau7[[#This Row],[Client]],)","v":0},{"$f":"IF(K377>0,Tableau7[[#This Row],[Parcelles]],)","v":0}]
[{"$nulls":35},{"$f":"IF(N378>0,Tableau7[[#This Row],[Campagne]],)","v":0},{"$f":"IF(J378>0,Tableau7[[#This Row],[Client]],)","v":0},{"$f":"IF(K378>0,Tableau7[[#This Row],[Parcelles]],)","v":0}]
[{"$nulls":35},{"$f":"IF(N379>0,Tableau7[[#This Row],[Campagne]],)","v":0},{"$f":"IF(J379>0,Tableau7[[#This Row],[Client]],)","v":0},{"$f":"IF(K379>0,Tableau7[[#This Row],[Parcelles]],)","v":0}]
[{"$nulls":35},{"$f":"IF(N380>0,Tableau7[[#This Row],[Campagne]],)","v":0},{"$f":"IF(J380>0,Tableau7[[#This Row],[Client]],)","v":0},{"$f":"IF(K380>0,Tableau7[[#This Row],[Parcelles]],)","v":0}]
[{"$nulls":35},{"$f":"IF(N381>0,Tableau7[[#This Row],[Campagne]],)","v":0},{"$f":"IF(J381>0,Tableau7[[#This Row],[Client]],)","v":0},{"$f":"IF(K381>0,Tableau7[[#This Row],[Parcelles]],)","v":0}]
[{"$nulls":35},{"$f":"IF(N382>0,Tableau7[[#This Row],[Campagne]],)","v":0},{"$f":"IF(J382>0,Tableau7[[#This Row],[Client]],)","v":0},{"$f":"IF(K382>0,Tableau7[[#This Row],[Parcelles]],)","v":0}]
[{"$nulls":35},{"$f":"IF(N383>0,Tableau7[[#This Row],[Campagne]],)","v":0},{"$f":"IF(J383>0,Tableau7[[#This Row],[Client]],)","v":0},{"$f":"IF(K383>0,Tableau7[[#This Row],[Parcelles]],)","v":0}]
[{"$nulls":35},{"$f":"IF(N384>0,Tableau7[[#This Row],[Campagne]],)","v":0},{"$f":"IF(J384>0,Tableau7[[#This Row],[Client]],)","v":0},{"$f":"IF(K384>0,Tableau7[[#This Row],[Parcelles]],)","v":0}]
[{"$nulls":35},{"$f":"IF(N385>0,Tableau7[[#This Row],[Campagne]],)","v":0},{"$f":"IF(J385>0,Tableau7[[#This Row],[Client]],)","v":0},{"$f":"IF(K385>0,Tableau7[[#This Row],[Parcelles]],)","v":0}]
[{"$nulls":35},{"$f":"IF(N386>0,Tableau7[[#This Row],[Campagne]],)","v":0},{"$f":"IF(J386>0,Tableau7[[#This Row],[Client]],)","v":0},{"$f":"IF(K386>0,Tableau7[[#This Row],[Parcelles]],)","v":0}]
[{"$nulls":35},{"$f":"IF(N387>0,Tableau7[[#This Row],[Campagne]],)","v":0},{"$f":"IF(J387>0,Tableau7[[#This Row],[Client]],)","v":0},{"$f":"IF(K387>0,Tableau7[[#This Row],[Parcelles]],)","v":0}]
[{"$nulls":35},{"$f":"IF(N388>0,Tableau7[[#This Row],[Campagne]],)","v":0},{"$f":"IF(J388>0,Tableau7[[#This Row],[Client]],)","v":0},{"$f":"IF(K388>0,Tableau7[[#This Row],[Parcelles]],)","v":0}]
[{"$nulls":35},{"$f":"IF(N389>0,Tableau7[[#This Row],[Campagne]],)","v":0},{"$f":"IF(J389>0,Tableau7[[#This Row],[Client]],)","v":0},{"$f":"IF(K389>0,Tableau7[[#This Row],[Parcelles]],)","v":0}]
[{"$nulls":35},{"$f":"IF(N390>0,Tableau7[[#This Row],[Campagne]],)","v":0},{"$f":"IF(J390>0,Tableau7[[#This Row],[Client]],)","v":0},{"$f":"IF(K390>0,Tableau7[[#This Row],[Parcelles]],)","v":0}]
[{"$nulls":35},{"$f":"IF(N391>0,Tableau7[[#This Row],[Campagne]],)","v":0},{"$f":"IF(J391>0,Tableau7[[#This Row],[Client]],)","v":0},{"$f":"IF(K391>0,Tableau7[[#This Row],[Parcelles]],)","v":0}]
[{"$nulls":35},{"$f":"IF(N392>0,Tableau7[[#This Row],[Campagne]],)","v":0},{"$f":"IF(J392>0,Tableau7[[#This Row],[Client]],)","v":0},{"$f":"IF(K392>0,Tableau7[[#This Row],[Parcelles]],)","v":0}]
[{"$nulls":35},{"$f":"IF(N393>0,Tableau7[[#This Row],[Campagne]],)","v":0},{"$f":"IF(J393>0,Tableau7[[#This Row],[Client]],)","v":0},{"$f":"IF(K393>0,Tableau7[[#This Row],[Parcelles]],)","v":0}]
[{"$nulls":35},{"$f":"IF(N394>0,Tableau7[[#This Row],[Campagne]],)","v":0},{"$f":"IF(J394>0,Tableau7[[#This Row],[Client]],)","v":0},{"$f":"IF(K394>0,Tableau7[[#This Row],[Parcelles]],)","v":0}]
[{"$nulls":35},{"$f":"IF(N395>0,Tableau7[[#This Row],[Campagne]],)","v":0},{"$f":"IF(J395>0,Tableau7[[#This Row],[Client]],)","v":0},{"$f":"IF(K395>0,Tableau7[[#This Row],[Parcelles]],)","v":0}]
[{"$nulls":35},{"$f":"IF(N396>0,Tableau7[[#This Row],[Campagne]],)","v":0},{"$f":"IF(J396>0,Tableau7[[#This Row],[Client]],)","v":0},{"$f":"IF(K396>0,Tableau7[[#This Row],[Parcelles]],)","v":0}]
[{"$nulls":35},{"$f":"IF(N397>0,Tableau7[[#This Row],[Campagne]],)","v":0},{"$f":"IF(J397>0,Tableau7[[#This Row],[Client]],)","v":0},{"$f":"IF(K397>0,Tableau7[[#This Row],[Parcelles]],)","v":0}]
[{"$nulls":35},{"$f":"IF(N398>0,Tableau7[[#This Row],[Campagne]],)","v":0},{"$f":"IF(J398>0,Tableau7[[#This Row],[Client]],)","v":0},{"$f":"IF(K398>0,Tableau7[[#This Row],[Parcelles]],)","v":0}]
[{"$nulls":35},{"$f":"IF(N399>0,Tableau7[[#This Row],[Campagne]],)","v":0},{"$f":"IF(J399>0,Tableau7[[#This Row],[Client]],)","v":0},{"$f":"IF(K399>0,Tableau7[[#This Row],[Parcelles]],)","v":0}]
[{"$nulls":35},{"$f":"IF(N400>0,Tableau7[[#This Row],[Campagne]],)","v":0},{"$f":"IF(J400>0,Tableau7[[#This Row],[Client]],)","v":0},{"$f":"IF(K400>0,Tableau7[[#This Row],[Parcelles]],)","v":0}]
[{"$nulls":35},{"$f":"IF(N401>0,Tableau7[[#This Row],[Campagne]],)","v":0},{"$f":"IF(J401>0,Tableau7[[#This Row],[Client]],)","v":0},{"$f":"IF(K401>0,Tableau7[[#This Row],[Parcelles]],)","v":0}]
[{"$nulls":35},{"$f":"IF(N402>0,Tableau7[[#This Row],[Campagne]],)","v":0},{"$f":"IF(J402>0,Tableau7[[#This Row],[Client]],)","v":0},{"$f":"IF(K402>0,Tableau7[[#This Row],[Parcelles]],)","v":0}]
[{"$nulls":35},{"$f":"IF(N403>0,Tableau7[[#This Row],[Campagne]],)","v":0},{"$f":"IF(J403>0,Tableau7[[#This Row],[Client]],)","v":0},{"$f":"IF(K403>0,Tableau7[[#This Row],[Parcelles]],)","v":0}]
[{"$nulls":35},{"$f":"IF(N404>0,Tableau7[[#This Row],[Campagne]],)","v":0},{"$f":"IF(J404>0,Tableau7[[#This Row],[Client]],)","v":0},{"$f":"IF(K404>0,Tableau7[[#This Row],[Parcelles]],)","v":0}]
[{"$nulls":35},{"$f":"IF(N405>0,Tableau7[[#This Row],[Campagne]],)","v":0},{"$f":"IF(J405>0,Tableau7[[#This Row],[Client]],)","v":0},{"$f":"IF(K405>0,Tableau7[[#This Row],[Parcelles]],)","v":0}]
[{"$nulls":35},{"$f":"IF(N406>0,Tableau7[[#This Row],[Campagne]],)","v":0},{"$f":"IF(J406>0,Tableau7[[#This Row],[Client]],)","v":0},{"$f":"IF(K406>0,Tableau7[[#This Row],[Parcelles]],)","v":0}]
[{"$nulls":35},{"$f":"IF(N407>0,Tableau7[[#This Row],[Campagne]],)","v":0},{"$f":"IF(J407>0,Tableau7[[#This Row],[Client]],)","v":0},{"$f":"IF(K407>0,Tableau7[[#This Row],[Parcelles]],)","v":0}]
[{"$nulls":35},{"$f":"IF(N408>0,Tableau7[[#This Row],[Campagne]],)","v":0},{"$f":"IF(J408>0,Tableau7[[#This Row],[Client]],)","v":0},{"$f":"IF(K408>0,Tableau7[[#This Row],[Parcelles]],)","v":0}]
[{"$nulls":35},{"$f":"IF(N409>0,Tableau7[[#This Row],[Campagne]],)","v":0},{"$f":"IF(J409>0,Tableau7[[#This Row],[Client]],)","v":0},{"$f":"IF(K409>0,Tableau7[[#This Row],[Parcelles]],)","v":0}]
[{"$nulls":35},{"$f":"IF(N410>0,Tableau7[[#This Row],[Campagne]],)","v":0},{"$f":"IF(J410>0,Tableau7[[#This Row],[Client]],)","v":0},{"$f":"IF(K410>0,Tableau7[[#This Row],[Parcelles]],)","v":0}]
[{"$nulls":35},{"$f":"IF(N411>0,Tableau7[[#This Row],[Campagne]],)","v":0},{"$f":"IF(J411>0,Tableau7[[#This Row],[Client]],)","v":0},{"$f":"IF(K411>0,Tableau7[[#This Row],[Parcelles]],)","v":0}]
[{"$nulls":35},{"$f":"IF(N412>0,Tableau7[[#This Row],[Campagne]],)","v":0},{"$f":"IF(J412>0,Tableau7[[#This Row],[Client]],)","v":0},{"$f":"IF(K412>0,Tableau7[[#This Row],[Parcelles]],)","v":0}]
[{"$nulls":35},{"$f":"IF(N413>0,Tableau7[[#This Row],[Campagne]],)","v":0},{"$f":"IF(J413>0,Tableau7[[#This Row],[Client]],)","v":0},{"$f":"IF(K413>0,Tableau7[[#This Row],[Parcelles]],)","v":0}]
[{"$nulls":35},{"$f":"IF(N414>0,Tableau7[[#This Row],[Campagne]],)","v":0},{"$f":"IF(J414>0,Tableau7[[#This Row],[Client]],)","v":0},{"$f":"IF(K414>0,Tableau7[[#This Row],[Parcelles]],)","v":0}]
[{"$nulls":35},{"$f":"IF(N415>0,Tableau7[[#This Row],[Campagne]],)","v":0},{"$f":"IF(J415>0,Tableau7[[#This Row],[Client]],)","v":0},{"$f":"IF(K415>0,Tableau7[[#This Row],[Parcelles]],)","v":0}]
[{"$nulls":35},{"$f":"IF(N416>0,Tableau7[[#This Row],[Campagne]],)","v":0},{"$f":"IF(J416>0,Tableau7[[#This Row],[Client]],)","v":0},{"$f":"IF(K416>0,Tableau7[[#This Row],[Parcelles]],)","v":0}]
[{"$nulls":35},{"$f":"IF(N417>0,Tableau7[[#This Row],[Campagne]],)","v":0},{"$f":"IF(J417>0,Tableau7[[#This Row],[Client]],)","v":0},{"$f":"IF(K417>0,Tableau7[[#This Row],[Parcelles]],)","v":0}]
[{"$nulls":35},{"$f":"IF(N418>0,Tableau7[[#This Row],[Campagne]],)","v":0},{"$f":"IF(J418>0,Tableau7[[#This Row],[Client]],)","v":0},{"$f":"IF(K418>0,Tableau7[[#This Row],[Parcelles]],)","v":0}]
[{"$nulls":35},{"$f":"IF(N419>0,Tableau7[[#This Row],[Campagne]],)","v":0},{"$f":"IF(J419>0,Tableau7[[#This Row],[Client]],)","v":0},{"$f":"IF(K419>0,Tableau7[[#This Row],[Parcelles]],)","v":0}]
[{"$nulls":35},{"$f":"IF(N420>0,Tableau7[[#This Row],[Campagne]],)","v":0},{"$f":"IF(J420>0,Tableau7[[#This Row],[Client]],)","v":0},{"$f":"IF(K420>0,Tableau7[[#This Row],[Parcelles]],)","v":0}]
[{"$nulls":35},{"$f":"IF(N421>0,Tableau7[[#This Row],[Campagne]],)","v":0},{"$f":"IF(J421>0,Tableau7[[#This Row],[Client]],)","v":0},{"$f":"IF(K421>0,Tableau7[[#This Row],[Parcelles]],)","v":0}]
[{"$nulls":35},{"$f":"IF(N422>0,Tableau7[[#This Row],[Campagne]],)","v":0},{"$f":"IF(J422>0,Tableau7[[#This Row],[Client]],)","v":0},{"$f":"IF(K422>0,Tableau7[[#This Row],[Parcelles]],)","v":0}]
[{"$nulls":35},{"$f":"IF(N423>0,Tableau7[[#This Row],[Campagne]],)","v":0},{"$f":"IF(J423>0,Tableau7[[#This Row],[Client]],)","v":0},{"$f":"IF(K423>0,Tableau7[[#This Row],[Parcelles]],)","v":0}]
[{"$nulls":35},{"$f":"IF(N424>0,Tableau7[[#This Row],[Campagne]],)","v":0},{"$f":"IF(J424>0,Tableau7[[#This Row],[Client]],)","v":0},{"$f":"IF(K424>0,Tableau7[[#This Row],[Parcelles]],)","v":0}]
[{"$nulls":35},{"$f":"IF(N425>0,Tableau7[[#This Row],[Campagne]],)","v":0},{"$f":"IF(J425>0,Tableau7[[#This Row],[Client]],)","v":0},{"$f":"IF(K425>0,Tableau7[[#This Row],[Parcelles]],)","v":0}]
[{"$nulls":35},{"$f":"IF(N426>0,Tableau7[[#This Row],[Campagne]],)","v":0},{"$f":"IF(J426>0,Tableau7[[#This Row],[Client]],)","v":0},{"$f":"IF(K426>0,Tableau7[[#This Row],[Parcelles]],)","v":0}]
[{"$nulls":35},{"$f":"IF(N427>0,Tableau7[[#This Row],[Campagne]],)","v":0},{"$f":"IF(J427>0,Tableau7[[#This Row],[Client]],)","v":0},{"$f":"IF(K427>0,Tableau7[[#This Row],[Parcelles]],)","v":0}]
[{"$nulls":35},{"$f":"IF(N428>0,Tableau7[[#This Row],[Campagne]],)","v":0},{"$f":"IF(J428>0,Tableau7[[#This Row],[Client]],)","v":0},{"$f":"IF(K428>0,Tableau7[[#This Row],[Parcelles]],)","v":0}]
[{"$nulls":35},{"$f":"IF(N429>0,Tableau7[[#This Row],[Campagne]],)","v":0},{"$f":"IF(J429>0,Tableau7[[#This Row],[Client]],)","v":0},{"$f":"IF(K429>0,Tableau7[[#This Row],[Parcelles]],)","v":0}]
[{"$nulls":35},{"$f":"IF(N430>0,Tableau7[[#This Row],[Campagne]],)","v":0},{"$f":"IF(J430>0,Tableau7[[#This Row],[Client]],)","v":0},{"$f":"IF(K430>0,Tableau7[[#This Row],[Parcelles]],)","v":0}]
[{"$nulls":35},{"$f":"IF(N431>0,Tableau7[[#This Row],[Campagne]],)","v":0},{"$f":"IF(J431>0,Tableau7[[#This Row],[Client]],)","v":0},{"$f":"IF(K431>0,Tableau7[[#This Row],[Parcelles]],)","v":0}]
[{"$nulls":35},{"$f":"IF(N432>0,Tableau7[[#This Row],[Campagne]],)","v":0},{"$f":"IF(J432>0,Tableau7[[#This Row],[Client]],)","v":0},{"$f":"IF(K432>0,Tableau7[[#This Row],[Parcelles]],)","v":0}]
[{"$nulls":35},{"$f":"IF(N433>0,Tableau7[[#This Row],[Campagne]],)","v":0},{"$f":"IF(J433>0,Tableau7[[#This Row],[Client]],)","v":0},{"$f":"IF(K433>0,Tableau7[[#This Row],[Parcelles]],)","v":0}]
[{"$nulls":35},{"$f":"IF(N434>0,Tableau7[[#This Row],[Campagne]],)","v":0},{"$f":"IF(J434>0,Tableau7[[#This Row],[Client]],)","v":0},{"$f":"IF(K434>0,Tableau7[[#This Row],[Parcelles]],)","v":0}]
[{"$nulls":35},{"$f":"IF(N435>0,Tableau7[[#This Row],[Campagne]],)","v":0},{"$f":"IF(J435>0,Tableau7[[#This Row],[Client]],)","v":0},{"$f":"IF(K435>0,Tableau7[[#This Row],[Parcelles]],)","v":0}]
[{"$nulls":35},{"$f":"IF(N436>0,Tableau7[[#This Row],[Campagne]],)","v":0},{"$f":"IF(J436>0,Tableau7[[#This Row],[Client]],)","v":0},{"$f":"IF(K436>0,Tableau7[[#This Row],[Parcelles]],)","v":0}]
[{"$nulls":35},{"$f":"IF(N437>0,Tableau7[[#This Row],[Campagne]],)","v":0},{"$f":"IF(J437>0,Tableau7[[#This Row],[Client]],)","v":0},{"$f":"IF(K437>0,Tableau7[[#This Row],[Parcelles]],)","v":0}]
[{"$nulls":35},{"$f":"IF(N438>0,Tableau7[[#This Row],[Campagne]],)","v":0},{"$f":"IF(J438>0,Tableau7[[#This Row],[Client]],)","v":0},{"$f":"IF(K438>0,Tableau7[[#This Row],[Parcelles]],)","v":0}]
[{"$nulls":35},{"$f":"IF(N439>0,Tableau7[[#This Row],[Campagne]],)","v":0},{"$f":"IF(J439>0,Tableau7[[#This Row],[Client]],)","v":0},{"$f":"IF(K439>0,Tableau7[[#This Row],[Parcelles]],)","v":0}]
[{"$nulls":35},{"$f":"IF(N440>0,Tableau7[[#This Row],[Campagne]],)","v":0},{"$f":"IF(J440>0,Tableau7[[#This Row],[Client]],)","v":0},{"$f":"IF(K440>0,Tableau7[[#This Row],[Parcelles]],)","v":0}]
[{"$nulls":35},{"$f":"IF(N441>0,Tableau7[[#This Row],[Campagne]],)","v":0},{"$f":"IF(J441>0,Tableau7[[#This Row],[Client]],)","v":0},{"$f":"IF(K441>0,Tableau7[[#This Row],[Parcelles]],)","v":0}]
[{"$nulls":35},{"$f":"IF(N442>0,Tableau7[[#This Row],[Campagne]],)","v":0},{"$f":"IF(J442>0,Tableau7[[#This Row],[Client]],)","v":0},{"$f":"IF(K442>0,Tableau7[[#This Row],[Parcelles]],)","v":0}]
[{"$nulls":35},{"$f":"IF(N443>0,Tableau7[[#This Row],[Campagne]],)","v":0},{"$f":"IF(J443>0,Tableau7[[#This Row],[Client]],)","v":0},{"$f":"IF(K443>0,Tableau7[[#This Row],[Parcelles]],)","v":0}]
[{"$nulls":35},{"$f":"IF(N444>0,Tableau7[[#This Row],[Campagne]],)","v":0},{"$f":"IF(J444>0,Tableau7[[#This Row],[Client]],)","v":0},{"$f":"IF(K444>0,Tableau7[[#This Row],[Parcelles]],)","v":0}]
[{"$nulls":35},{"$f":"IF(N445>0,Tableau7[[#This Row],[Campagne]],)","v":0},{"$f":"IF(J445>0,Tableau7[[#This Row],[Client]],)","v":0},{"$f":"IF(K445>0,Tableau7[[#This Row],[Parcelles]],)","v":0}]
[{"$nulls":35},{"$f":"IF(N446>0,Tableau7[[#This Row],[Campagne]],)","v":0},{"$f":"IF(J446>0,Tableau7[[#This Row],[Client]],)","v":0},{"$f":"IF(K446>0,Tableau7[[#This Row],[Parcelles]],)","v":0}]
[{"$nulls":35},{"$f":"IF(N447>0,Tableau7[[#This Row],[Campagne]],)","v":0},{"$f":"IF(J447>0,Tableau7[[#This Row],[Client]],)","v":0},{"$f":"IF(K447>0,Tableau7[[#This Row],[Parcelles]],)","v":0}]
[{"$nulls":35},{"$f":"IF(N448>0,Tableau7[[#This Row],[Campagne]],)","v":0},{"$f":"IF(J448>0,Tableau7[[#This Row],[Client]],)","v":0},{"$f":"IF(K448>0,Tableau7[[#This Row],[Parcelles]],)","v":0}]
[{"$nulls":35},{"$f":"IF(N449>0,Tableau7[[#This Row],[Campagne]],)","v":0},{"$f":"IF(J449>0,Tableau7[[#This Row],[Client]],)","v":0},{"$f":"IF(K449>0,Tableau7[[#This Row],[Parcelles]],)","v":0}]
[{"$nulls":35},{"$f":"IF(N450>0,Tableau7[[#This Row],[Campagne]],)","v":0},{"$f":"IF(J450>0,Tableau7[[#This Row],[Client]],)","v":0},{"$f":"IF(K450>0,Tableau7[[#This Row],[Parcelles]],)","v":0}]
[{"$nulls":35},{"$f":"IF(N451>0,Tableau7[[#This Row],[Campagne]],)","v":0},{"$f":"IF(J451>0,Tableau7[[#This Row],[Client]],)","v":0},{"$f":"IF(K451>0,Tableau7[[#This Row],[Parcelles]],)","v":0}]
[{"$nulls":35},{"$f":"IF(N452>0,Tableau7[[#This Row],[Campagne]],)","v":0},{"$f":"IF(J452>0,Tableau7[[#This Row],[Client]],)","v":0},{"$f":"IF(K452>0,Tableau7[[#This Row],[Parcelles]],)","v":0}]
[{"$nulls":35},{"$f":"IF(N453>0,Tableau7[[#This Row],[Campagne]],)","v":0},{"$f":"IF(J453>0,Tableau7[[#This Row],[Client]],)","v":0},{"$f":"IF(K453>0,Tableau7[[#This Row],[Parcelles]],)","v":0}]
[{"$nulls":35},{"$f":"IF(N454>0,Tableau7[[#This Row],[Campagne]],)","v":0},{"$f":"IF(J454>0,Tableau7[[#This Row],[Client]],)","v":0},{"$f":"IF(K454>0,Tableau7[[#This Row],[Parcelles]],)","v":0}]
[{"$nulls":35},{"$f":"IF(N455>0,Tableau7[[#This Row],[Campagne]],)","v":0},{"$f":"IF(J455>0,Tableau7[[#This Row],[Client]],)","v":0},{"$f":"IF(K455>0,Tableau7[[#This Row],[Parcelles]],)","v":0}]
[{"$nulls":35},{"$f":"IF(N456>0,Tableau7[[#This Row],[Campagne]],)","v":0},{"$f":"IF(J456>0,Tableau7[[#This Row],[Client]],)","v":0},{"$f":"IF(K456>0,Tableau7[[#This Row],[Parcelles]],)","v":0}]
[{"$nulls":35},{"$f":"IF(N457>0,Tableau7[[#This Row],[Campagne]],)","v":0},{"$f":"IF(J457>0,Tableau7[[#This Row],[Client]],)","v":0},{"$f":"IF(K457>0,Tableau7[[#This Row],[Parcelles]],)","v":0}]
[{"$nulls":35},{"$f":"IF(N458>0,Tableau7[[#This Row],[Campagne]],)","v":0},{"$f":"IF(J458>0,Tableau7[[#This Row],[Client]],)","v":0},{"$f":"IF(K458>0,Tableau7[[#This Row],[Parcelles]],)","v":0}]
[{"$nulls":35},{"$f":"IF(N459>0,Tableau7[[#This Row],[Campagne]],)","v":0},{"$f":"IF(J459>0,Tableau7[[#This Row],[Client]],)","v":0},{"$f":"IF(K459>0,Tableau7[[#This Row],[Parcelles]],)","v":0}]
[{"$nulls":35},{"$f":"IF(N460>0,Tableau7[[#This Row],[Campagne]],)","v":0},{"$f":"IF(J460>0,Tableau7[[#This Row],[Client]],)","v":0},{"$f":"IF(K460>0,Tableau7[[#This Row],[Parcelles]],)","v":0}]
[{"$nulls":35},{"$f":"IF(N461>0,Tableau7[[#This Row],[Campagne]],)","v":0},{"$f":"IF(J461>0,Tableau7[[#This Row],[Client]],)","v":0},{"$f":"IF(K461>0,Tableau7[[#This Row],[Parcelles]],)","v":0}]
[{"$nulls":35},{"$f":"IF(N462>0,Tableau7[[#This Row],[Campagne]],)","v":0},{"$f":"IF(J462>0,Tableau7[[#This Row],[Client]],)","v":0},{"$f":"IF(K462>0,Tableau7[[#This Row],[Parcelles]],)","v":0}]
[{"$nulls":35},{"$f":"IF(N463>0,Tableau7[[#This Row],[Campagne]],)","v":0},{"$f":"IF(J463>0,Tableau7[[#This Row],[Client]],)","v":0},{"$f":"IF(K463>0,Tableau7[[#This Row],[Parcelles]],)","v":0}]
[{"$nulls":35},{"$f":"IF(N464>0,Tableau7[[#This Row],[Campagne]],)","v":0},{"$f":"IF(J464>0,Tableau7[[#This Row],[Client]],)","v":0},{"$f":"IF(K464>0,Tableau7[[#This Row],[Parcelles]],)","v":0}]
[{"$nulls":35},{"$f":"IF(N465>0,Tableau7[[#This Row],[Campagne]],)","v":0},{"$f":"IF(J465>0,Tableau7[[#This Row],[Client]],)","v":0},{"$f":"IF(K465>0,Tableau7[[#This Row],[Parcelles]],)","v":0}]
[{"$nulls":35},{"$f":"IF(N466>0,Tableau7[[#This Row],[Campagne]],)","v":0},{"$f":"IF(J466>0,Tableau7[[#This Row],[Client]],)","v":0},{"$f":"IF(K466>0,Tableau7[[#This Row],[Parcelles]],)","v":0}]
[{"$nulls":35},{"$f":"IF(N467>0,Tableau7[[#This Row],[Campagne]],)","v":0},{"$f":"IF(J467>0,Tableau7[[#This Row],[Client]],)","v":0},{"$f":"IF(K467>0,Tableau7[[#This Row],[Parcelles]],)","v":0}]
[{"$nulls":35},{"$f":"IF(N468>0,Tableau7[[#This Row],[Campagne]],)","v":0},{"$f":"IF(J468>0,Tableau7[[#This Row],[Client]],)","v":0},{"$f":"IF(K468>0,Tableau7[[#This Row],[Parcelles]],)","v":0}]
[{"$nulls":35},{"$f":"IF(N469>0,Tableau7[[#This Row],[Campagne]],)","v":0},{"$f":"IF(J469>0,Tableau7[[#This Row],[Client]],)","v":0},{"$f":"IF(K469>0,Tableau7[[#This Row],[Parcelles]],)","v":0}]
[{"$nulls":35},{"$f":"IF(N470>0,Tableau7[[#This Row],[Campagne]],)","v":0},{"$f":"IF(J470>0,Tableau7[[#This Row],[Client]],)","v":0},{"$f":"IF(K470>0,Tableau7[[#This Row],[Parcelles]],)","v":0}]
[{"$nulls":35},{"$f":"IF(N471>0,Tableau7[[#This Row],[Campagne]],)","v":0},{"$f":"IF(J471>0,Tableau7[[#This Row],[Client]],)","v":0},{"$f":"IF(K471>0,Tableau7[[#This Row],[Parcelles]],)","v":0}]
[{"$nulls":35},{"$f":"IF(N472>0,Tableau7[[#This Row],[Campagne]],)","v":0},{"$f":"IF(J472>0,Tableau7[[#This Row],[Client]],)","v":0},{"$f":"IF(K472>0,Tableau7[[#This Row],[Parcelles]],)","v":0}]
[{"$nulls":35},{"$f":"IF(N473>0,Tableau7[[#This Row],[Campagne]],)","v":0},{"$f":"IF(J473>0,Tableau7[[#This Row],[Client]],)","v":0},{"$f":"IF(K473>0,Tableau7[[#This Row],[Parcelles]],)","v":0}]
[{"$nulls":35},{"$f":"IF(N474>0,Tableau7[[#This Row],[Campagne]],)","v":0},{"$f":"IF(J474>0,Tableau7[[#This Row],[Client]],)","v":0},{"$f":"IF(K474>0,Tableau7[[#This Row],[Parcelles]],)","v":0}]
[{"$nulls":35},{"$f":"IF(N475>0,Tableau7[[#This Row],[Campagne]],)","v":0},{"$f":"IF(J475>0,Tableau7[[#This Row],[Client]],)","v":0},{"$f":"IF(K475>0,Tableau7[[#This Row],[Parcelles]],)","v":0}]
[{"$nulls":35},{"$f":"IF(N476>0,Tableau7[[#This Row],[Campagne]],)","v":0},{"$f":"IF(J476>0,Tableau7[[#This Row],[Client]],)","v":0},{"$f":"IF(K476>0,Tableau7[[#This Row],[Parcelles]],)","v":0}]
[{"$nulls":35},{"$f":"IF(N477>0,Tableau7[[#This Row],[Campagne]],)","v":0},{"$f":"IF(J477>0,Tableau7[[#This Row],[Client]],)","v":0},{"$f":"IF(K477>0,Tableau7[[#This Row],[Parcelles]],)","v":0}]
[{"$nulls":35},{"$f":"IF(N478>0,Tableau7[[#This Row],[Campagne]],)","v":0},{"$f":"IF(J478>0,Tableau7[[#This Row],[Client]],)","v":0},{"$f":"IF(K478>0,Tableau7[[#This Row],[Parcelles]],)","v":0}]
[{"$nulls":35},{"$f":"IF(N479>0,Tableau7[[#This Row],[Campagne]],)","v":0},{"$f":"IF(J479>0,Tableau7[[#This Row],[Client]],)","v":0},{"$f":"IF(K479>0,Tableau7[[#This Row],[Parcelles]],)","v":0}]
[{"$nulls":35},{"$f":"IF(N480>0,Tableau7[[#This Row],[Campagne]],)","v":0},{"$f":"IF(J480>0,Tableau7[[#This Row],[Client]],)","v":0},{"$f":"IF(K480>0,Tableau7[[#This Row],[Parcelles]],)","v":0}]
[{"$nulls":35},{"$f":"IF(N481>0,Tableau7[[#This Row],[Campagne]],)","v":0},{"$f":"IF(J481>0,Tableau7[[#This Row],[Client]],)","v":0},{"$f":"IF(K481>0,Tableau7[[#This Row],[Parcelles]],)","v":0}]
[{"$nulls":35},{"$f":"IF(N482>0,Tableau7[[#This Row],[Campagne]],)","v":0},{"$f":"IF(J482>0,Tableau7[[#This Row],[Client]],)","v":0},{"$f":"IF(K482>0,Tableau7[[#This Row],[Parcelles]],)","v":0}]
[{"$nulls":35},{"$f":"IF(N483>0,Tableau7[[#This Row],[Campagne]],)","v":0},{"$f":"IF(J483>0,Tableau7[[#This Row],[Client]],)","v":0},{"$f":"IF(K483>0,Tableau7[[#This Row],[Parcelles]],)","v":0}]
[{"$nulls":35},{"$f":"IF(N484>0,Tableau7[[#This Row],[Campagne]],)","v":0},{"$f":"IF(J484>0,Tableau7[[#This Row],[Client]],)","v":0},{"$f":"IF(K484>0,Tableau7[[#This Row],[Parcelles]],)","v":0}]
[{"$nulls":35},{"$f":"IF(N485>0,Tableau7[[#This Row],[Campagne]],)","v":0},{"$f":"IF(J485>0,Tableau7[[#This Row],[Client]],)","v":0},{"$f":"IF(K485>0,Tableau7[[#This Row],[Parcelles]],)","v":0}]
[{"$nulls":35},{"$f":"IF(N486>0,Tableau7[[#This Row],[Campagne]],)","v":0},{"$f":"IF(J486>0,Tableau7[[#This Row],[Client]],)","v":0},{"$f":"IF(K486>0,Tableau7[[#This Row],[Parcelles]],)","v":0}]
[{"$nulls":35},{"$f":"IF(N487>0,Tableau7[[#This Row],[Campagne]],)","v":0},{"$f":"IF(J487>0,Tableau7[[#This Row],[Client]],)","v":0},{"$f":"IF(K487>0,Tableau7[[#This Row],[Parcelles]],)","v":0}]
[{"$nulls":35},{"$f":"IF(N488>0,Tableau7[[#This Row],[Campagne]],)","v":0},{"$f":"IF(J488>0,Tableau7[[#This Row],[Client]],)","v":0},{"$f":"IF(K488>0,Tableau7[[#This Row],[Parcelles]],)","v":0}]
[{"$nulls":35},{"$f":"IF(N489>0,Tableau7[[#This Row],[Campagne]],)","v":0},{"$f":"IF(J489>0,Tableau7[[#This Row],[Client]],)","v":0},{"$f":"IF(K489>0,Tableau7[[#This Row],[Parcelles]],)","v":0}]
[{"$nulls":35},{"$f":"IF(N490>0,Tableau7[[#This Row],[Campagne]],)","v":0},{"$f":"IF(J490>0,Tableau7[[#This Row],[Client]],)","v":0},{"$f":"IF(K490>0,Tableau7[[#This Row],[Parcelles]],)","v":0}]
[{"$nulls":35},{"$f":"IF(N491>0,Tableau7[[#This Row],[Campagne]],)","v":0},{"$f":"IF(J491>0,Tableau7[[#This Row],[Client]],)","v":0},{"$f":"IF(K491>0,Tableau7[[#This Row],[Parcelles]],)","v":0}]
[{"$nulls":35},{"$f":"IF(N492>0,Tableau7[[#This Row],[Campagne]],)","v":0},{"$f":"IF(J492>0,Tableau7[[#This Row],[Client]],)","v":0},{"$f":"IF(K492>0,Tableau7[[#This Row],[Parcelles]],)","v":0}]
[{"$nulls":35},{"$f":"IF(N493>0,Tableau7[[#This Row],[Campagne]],)","v":0},{"$f":"IF(J493>0,Tableau7[[#This Row],[Client]],)","v":0},{"$f":"IF(K493>0,Tableau7[[#This Row],[Parcelles]],)","v":0}]
[{"$nulls":35},{"$f":"IF(N494>0,Tableau7[[#This Row],[Campagne]],)","v":0},{"$f":"IF(J494>0,Tableau7[[#This Row],[Client]],)","v":0},{"$f":"IF(K494>0,Tableau7[[#This Row],[Parcelles]],)","v":0}]
[{"$nulls":35},{"$f":"IF(N495>0,Tableau7[[#This Row],[Campagne]],)","v":0},{"$f":"IF(J495>0,Tableau7[[#This Row],[Client]],)","v":0},{"$f":"IF(K495>0,Tableau7[[#This Row],[Parcelles]],)","v":0}]
[{"$nulls":35},{"$f":"IF(N496>0,Tableau7[[#This Row],[Campagne]],)","v":0},{"$f":"IF(J496>0,Tableau7[[#This Row],[Client]],)","v":0},{"$f":"IF(K496>0,Tableau7[[#This Row],[Parcelles]],)","v":0}]
[{"$nulls":35},{"$f":"IF(N497>0,Tableau7[[#This Row],[Campagne]],)","v":0},{"$f":"IF(J497>0,Tableau7[[#This Row],[Client]],)","v":0},{"$f":"IF(K497>0,Tableau7[[#This Row],[Parcelles]],)","v":0}]
[{"$nulls":35},{"$f":"IF(N498>0,Tableau7[[#This Row],[Campagne]],)","v":0},{"$f":"IF(J498>0,Tableau7[[#This Row],[Client]],)","v":0},{"$f":"IF(K498>0,Tableau7[[#This Row],[Parcelles]],)","v":0}]
[{"$nulls":35},{"$f":"IF(N499>0,Tableau7[[#This Row],[Campagne]],)","v":0},{"$f":"IF(J499>0,Tableau7[[#This Row],[Client]],)","v":0},{"$f":"IF(K499>0,Tableau7[[#This Row],[Parcelles]],)","v":0}]
[{"$nulls":35},{"$f":"IF(N500>0,Tableau7[[#This Row],[Campagne]],)","v":0},{"$f":"IF(J500>0,Tableau7[[#This Row],[Client]],)","v":0},{"$f":"IF(K500>0,Tableau7[[#This Row],[Parcelles]],)","v":0}]

{"sheet":"Résultat","index":2,"n_rows":21,"n_cols":15,"rows_kept":21}
[]
[null,{"$f":"Base!A2","v":"Labour"},{"$f":"Base!A2","v":"Labour"},{"$f":"Base!A3","v":"Pulvérisation"},{"$f":"Base!A3","v":"Pulvérisation"},{"$f":"Base!A4","v":"Moisson"},{"$f":"Base!A4","v":"Moisson"},{"$f":"Base!A5","v":"Engrais"},{"$f":"Base!A5","v":"Engrais"},{"$f":"Base!A6","v":"Déchaumage"},{"$f":"Base!A6","v":"Déchaumage"},{"v":0,"d":"000.00"},{"$f":"Base!A7","v":0},{"$f":"Base!A8","v":0},{"$f":"Base!A8","v":0}]
[{"$f":"Base!AD2","v":"Durand"},{"$f":"SUMPRODUCT((Tableau1[Client]=Tableau2[[#This Row],[Clients]])*(Tableau1[Oppération]=Résultat!$B$2)*(Tableau1[Surface]))","v":{"v":0,"d":"0.00 ha"}},{"$f":"IF(C$2>0,((SUMPRODUCT((Tableau1[Client]=$A3)*(Tableau1[Oppération]=Résultat!C$2)*(Tableau1[Surface])))*VLOOKUP(C$2,Tableau6[],2,0)),\" \")","v":0},{"$f":"SUMPRODUCT((Tableau1[Client]=Tableau2[[#This Row],[Clients]])*(Tableau1[Oppération]=Résultat!$D$2)*(Tableau1[Surface]))","v":{"v":20,"d":"20.00 ha"}},{"$f":"IF(E$2>0,((SUMPRODUCT((Tableau1[Client]=$A3)*(Tableau1[Oppération]=Résultat!E$2)*(Tableau1[Surface])))*VLOOKUP(E$2,Tableau6[],2,0)),\" \")","v":{"v":300,"d":"300.00 €"}},{"$f":"SUMPRODUCT((Tableau1[Client]=Tableau2[[#This Row],[Clients]])*(Tableau1[Oppération]=Résultat!$F$2)*(Tableau1[Surface]))","v":{"v":10,"d":"10.00 ha"}},{"$f":"IF(G$2>0,((SUMPRODUCT((Tableau1[Client]=$A3)*(Tableau1[Oppération]=Résultat!G$2)*(Tableau1[Surface])))*VLOOKUP(G$2,Tableau6[],2,0)),\" \")","v":{"v":900,"d":"900.00 €"}},{"$f":"SUMPRODUCT((Tableau1[Client]=Tableau2[[#This Row],[Clients]])*(Tableau1[Oppération]=Résultat!$H$2)*(Tableau1[Surface]))","v":{"v":55,"d":"55.00 ha"}},{"$f":"IF(I$2>0,((SUMPRODUCT((Tableau1[Client]=$A3)*(Tableau1[Oppération]=Résultat!I$2)*(Tableau1[Surface])))*VLOOKUP(I$2,Tableau6[],2,0)),\" \")","v":{"v":825,"d":"825.00 €"}},{"$f":"SUMPRODUCT((Tableau1[Client]=Tableau2[[#This Row],[Clients]])*(Tableau1[Oppération]=Résultat!J2)*(Tableau1[Surface]))","v":{"v":0,"d":"0.00 ha"}},{"$f":"IF(K$2>0,((SUMPRODUCT((Tableau1[Client]=$A3)*(Tableau1[Oppération]=Résultat!K$2)*(Tableau1[Surface])))*VLOOKUP(K$2,Tableau6[],2,0)),\" \")","v":0},{"v":0,"d":"000.00"},{"$f":"IF(M$2>0,((SUMPRODUCT((Tableau1[Client]=$A3)*(Tableau1[Oppération]=Résultat!M$2)*(Tableau1[Surface])))*VLOOKUP(M$2,Tableau6[],2,0)),\" \")","v":" "},{"$f":"SUMPRODUCT((Tableau1[Client]=Tableau2[[#This Row],[Clients]])*(Tableau1[Oppération]=Résultat!N2)*(Tableau1[Surface]))","v":{"v":0,"d":"0.00 ha"}},{"$f":"IF(O$2>0,((SUMPRODUCT((Tableau1[Client]=$A3)*(Tableau1[Oppération]=Résultat!O$2)*(Tableau1[Surface])))*VLOOKUP(O$2,Tableau6[],2,0)),\" \")","v":" "}]
[{"$f":"Base!AD3","v":"Florian"},{"$f":"SUMPRODUCT((Tableau1[Client]=Tableau2[[#This Row],[Clients]])*(Tableau1[Oppération]=Résultat!$B$2)*(Tableau1[Surface]))","v":{"v":16.7,"d":"16.70 ha"}},{"$f":"IF(C$2>0,((SUMPRODUCT((Tableau1[Client]=$A4)*(Tableau1[Oppération]=Résultat!C$2)*(Tableau1[Surface])))*VLOOKUP(C$2,Tableau6[],2,0)),\" \")","v":{"v":1503,"d":"1,503.00 €"}},{"$f":"SUMPRODUCT((Tableau1[Client]=Tableau2[[#This Row],[Clients]])*(Tableau1[Oppération]=Résultat!$D$2)*(Tableau1[Surface]))","v":{"v":20,"d":"20.00 ha"}},{"$f":"IF(E$2>0,((SUMPRODUCT((Tableau1[Client]=$A4)*(Tableau1[Oppération]=Résultat!E$2)*(Tableau1[Surface])))*VLOOKUP(E$2,Tableau6[],2,0)),\" \")","v":{"v":300,"d":"300.00 €"}},{"$f":"SUMPRODUCT((Tableau1[Client]=Tableau2[[#This Row],[Clients]])*(Tableau1[Oppération]=Résultat!$F$2)*(Tableau1[Surface]))","v":{"v":67.35,"d":"67.35 ha"}},{"$f":"IF(G$2>0,((SUMPRODUCT((Tableau1[Client]=$A4)*(Tableau1[Oppération]=Résultat!G$2)*(Tableau1[Surface])))*VLOOKUP(G$2,Tableau6[],2,0)),\" \")","v":{"v":6061.499999999999,"d":"6,061.50 €"}},{"$f":"SUMPRODUCT((Tableau1[Client]=Tableau2[[#This Row],[Clients]])*(Tableau1[Oppération]=Résultat!$H$2)*(Tableau1[Surface]))","v":{"v":0,"d":"0.00 ha"}},{"$f":"IF(I$2>0,((SUMPRODUCT((Tableau1[Client]=$A4)*(Tableau1[Oppération]=Résultat!I$2)*(Tableau1[Surface])))*VLOOKUP(I$2,Tableau6[],2,0)),\" \")","v":0},{"$f":"SUMPRODUCT((Tableau1[Client]=Tableau2[[#This Row],[Clients]])*(Tableau1[Oppération]=Résultat!J3)*(Tableau1[Surface]))","v":{"v":0,"d":"0.00 ha"}},{"$f":"IF(K$2>0,((SUMPRODUCT((Tableau1[Client]=$A4)*(Tableau1[Oppération]=Résultat!K$2)*(Tableau1[Surface])))*VLOOKUP(K$2,Tableau6[],2,0)),\" \")","v":0},{"v":0,"d":"000.00"},{"$f":"IF(M$2>0,((SUMPRODUCT((Tableau1[Client]=$A4)*(Tableau1[Oppération]=Résultat!M$2)*(Tableau1[Surface])))*VLOOKUP(M$2,Tableau6[],2,0)),\" \")","v":" "},{"$f":"SUMPRODUCT((Tableau1[Client]=Tableau2[[#This Row],[Clients]])*(Tableau1[Oppération]=Résultat!N3)*(Tableau1[Surface]))","v":{"v":0,"d":"0.00 ha"}},{"$f":"IF(O$2>0,((SUMPRODUCT((Tableau1[Client]=$A4)*(Tableau1[Oppération]=Résultat!O$2)*(Tableau1[Surface])))*VLOOKUP(O$2,Tableau6[],2,0)),\" \")","v":" "}]
[{"$f":"Base!AD4","v":"Moi"},{"$f":"SUMPRODUCT((Tableau1[Client]=Tableau2[[#This Row],[Clients]])*(Tableau1[Oppération]=Résultat!$B$2)*(Tableau1[Surface]))","v":{"v":0,"d":"0.00 ha"}},{"$f":"IF(C$2>0,((SUMPRODUCT((Tableau1[Client]=$A5)*(Tableau1[Oppération]=Résultat!C$2)*(Tableau1[Surface])))*VLOOKUP(C$2,Tableau6[],2,0)),\" \")","v":0},{"$f":"SUMPRODUCT((Tableau1[Client]=Tableau2[[#This Row],[Clients]])*(Tableau1[Oppération]=Résultat!$D$2)*(Tableau1[Surface]))","v":{"v":0,"d":"0.00 ha"}},{"$f":"IF(E$2>0,((SUMPRODUCT((Tableau1[Client]=$A5)*(Tableau1[Oppération]=Résultat!E$2)*(Tableau1[Surface])))*VLOOKUP(E$2,Tableau6[],2,0)),\" \")","v":0},{"$f":"SUMPRODUCT((Tableau1[Client]=Tableau2[[#This Row],[Clients]])*(Tableau1[Oppération]=Résultat!$F$2)*(Tableau1[Surface]))","v":{"v":0,"d":"0.00 ha"}},{"$f":"IF(G$2>0,((SUMPRODUCT((Tableau1[Client]=$A5)*(Tableau1[Oppération]=Résultat!G$2)*(Tableau1[Surface])))*VLOOKUP(G$2,Tableau6[],2,0)),\" \")","v":0},{"$f":"SUMPRODUCT((Tableau1[Client]=Tableau2[[#This Row],[Clients]])*(Tableau1[Oppération]=Résultat!$H$2)*(Tableau1[Surface]))","v":{"v":0,"d":"0.00 ha"}},{"$f":"IF(I$2>0,((SUMPRODUCT((Tableau1[Client]=$A5)*(Tableau1[Oppération]=Résultat!I$2)*(Tableau1[Surface])))*VLOOKUP(I$2,Tableau6[],2,0)),\" \")","v":0},{"$f":"SUMPRODUCT((Tableau1[Client]=Tableau2[[#This Row],[Clients]])*(Tableau1[Oppération]=Résultat!J4)*(Tableau1[Surface]))","v":{"v":0,"d":"0.00 ha"}},{"$f":"IF(K$2>0,((SUMPRODUCT((Tableau1[Client]=$A5)*(Tableau1[Oppération]=Résultat!K$2)*(Tableau1[Surface])))*VLOOKUP(K$2,Tableau6[],2,0)),\" \")","v":0},{"v":0,"d":"000.00"},{"$f":"IF(M$2>0,((SUMPRODUCT((Tableau1[Client]=$A5)*(Tableau1[Oppération]=Résultat!M$2)*(Tableau1[Surface])))*VLOOKUP(M$2,Tableau6[],2,0)),\" \")","v":" "},{"$f":"SUMPRODUCT((Tableau1[Client]=Tableau2[[#This Row],[Clients]])*(Tableau1[Oppération]=Résultat!N4)*(Tableau1[Surface]))","v":{"v":0,"d":"0.00 ha"}},{"$f":"IF(O$2>0,((SUMPRODUCT((Tableau1[Client]=$A5)*(Tableau1[Oppération]=Résultat!O$2)*(Tableau1[Surface])))*VLOOKUP(O$2,Tableau6[],2,0)),\" \")","v":" "}]
[{"$f":"Base!AD5","v":"Tisse"},{"$f":"SUMPRODUCT((Tableau1[Client]=Tableau2[[#This Row],[Clients]])*(Tableau1[Oppération]=Résultat!$B$2)*(Tableau1[Surface]))","v":{"v":0,"d":"0.00 ha"}},{"$f":"IF(C$2>0,((SUMPRODUCT((Tableau1[Client]=$A6)*(Tableau1[Oppération]=Résultat!C$2)*(Tableau1[Surface])))*VLOOKUP(C$2,Tableau6[],2,0)),\" \")","v":0},{"$f":"SUMPRODUCT((Tableau1[Client]=Tableau2[[#This Row],[Clients]])*(Tableau1[Oppération]=Résultat!$D$2)*(Tableau1[Surface]))","v":{"v":0,"d":"0.00 ha"}},{"$f":"IF(E$2>0,((SUMPRODUCT((Tableau1[Client]=$A6)*(Tableau1[Oppération]=Résultat!E$2)*(Tableau1[Surface])))*VLOOKUP(E$2,Tableau6[],2,0)),\" \")","v":0},{"$f":"SUMPRODUCT((Tableau1[Client]=Tableau2[[#This Row],[Clients]])*(Tableau1[Oppération]=Résultat!$F$2)*(Tableau1[Surface]))","v":{"v":0,"d":"0.00 ha"}},{"$f":"IF(G$2>0,((SUMPRODUCT((Tableau1[Client]=$A6)*(Tableau1[Oppération]=Résultat!G$2)*(Tableau1[Surface])))*VLOOKUP(G$2,Tableau6[],2,0)),\" \")","v":0},{"$f":"SUMPRODUCT((Tableau1[Client]=Tableau2[[#This Row],[Clients]])*(Tableau1[Oppération]=Résultat!$H$2)*(Tableau1[Surface]))","v":{"v":0,"d":"0.00 ha"}},{"$f":"IF(I$2>0,((SUMPRODUCT((Tableau1[Client]=$A6)*(Tableau1[Oppération]=Résultat!I$2)*(Tableau1[Surface])))*VLOOKUP(I$2,Tableau6[],2,0)),\" \")","v":0},{"$f":"SUMPRODUCT((Tableau1[Client]=Tableau2[[#This Row],[Clients]])*(Tableau1[Oppération]=Résultat!J5)*(Tableau1[Surface]))","v":{"v":0,"d":"0.00 ha"}},{"$f":"IF(K$2>0,((SUMPRODUCT((Tableau1[Client]=$A6)*(Tableau1[Oppération]=Résultat!K$2)*(Tableau1[Surface])))*VLOOKUP(K$2,Tableau6[],2,0)),\" \")","v":0},{"v":0,"d":"000.00"},{"$f":"IF(M$2>0,((SUMPRODUCT((Tableau1[Client]=$A6)*(Tableau1[Oppération]=Résultat!M$2)*(Tableau1[Surface])))*VLOOKUP(M$2,Tableau6[],2,0)),\" \")","v":" "},{"$f":"SUMPRODUCT((Tableau1[Client]=Tableau2[[#This Row],[Clients]])*(Tableau1[Oppération]=Résultat!N5)*(Tableau1[Surface]))","v":{"v":0,"d":"0.00 ha"}},{"$f":"IF(O$2>0,((SUMPRODUCT((Tableau1[Client]=$A6)*(Tableau1[Oppération]=Résultat!O$2)*(Tableau1[Surface])))*VLOOKUP(O$2,Tableau6[],2,0)),\" \")","v":" "}]
[{"$f":"Base!AD6","v":""},{"$f":"SUMPRODUCT((Tableau1[Client]=Tableau2[[#This Row],[Clients]])*(Tableau1[Oppération]=Résultat!$B$2)*(Tableau1[Surface]))","v":{"v":0,"d":"0.00 ha"}},{"$f":"IF(C$2>0,((SUMPRODUCT((Tableau1[Client]=$A7)*(Tableau1[Oppération]=Résultat!C$2)*(Tableau1[Surface])))*VLOOKUP(C$2,Tableau6[],2,0)),\" \")","v":0},{"$f":"SUMPRODUCT((Tableau1[Client]=Tableau2[[#This Row],[Clients]])*(Tableau1[Oppération]=Résultat!$D$2)*(Tableau1[Surface]))","v":{"v":0,"d":"0.00 ha"}},{"$f":"IF(E$2>0,((SUMPRODUCT((Tableau1[Client]=$A7)*(Tableau1[Oppération]=Résultat!E$2)*(Tableau1[Surface])))*VLOOKUP(E$2,Tableau6[],2,0)),\" \")","v":0},{"$f":"SUMPRODUCT((Tableau1[Client]=Tableau2[[#This Row],[Clients]])*(Tableau1[Oppération]=Résultat!$F$2)*(Tableau1[Surface]))","v":{"v":0,"d":"0.00 ha"}},{"$f":"IF(G$2>0,((SUMPRODUCT((Tableau1[Client]=$A7)*(Tableau1[Oppération]=Résultat!G$2)*(Tableau1[Surface])))*VLOOKUP(G$2,Tableau6[],2,0)),\" \")","v":0},{"$f":"SUMPRODUCT((Tableau1[Client]=Tableau2[[#This Row],[Clients]])*(Tableau1[Oppération]=Résultat!$H$2)*(Tableau1[Surface]))","v":{"v":0,"d":"0.00 ha"}},{"$f":"IF(I$2>0,((SUMPRODUCT((Tableau1[Client]=$A7)*(Tableau1[Oppération]=Résultat!I$2)*(Tableau1[Surface])))*VLOOKUP(I$2,Tableau6[],2,0)),\" \")","v":0},{"$f":"SUMPRODUCT((Tableau1[Client]=Tableau2[[#This Row],[Clients]])*(Tableau1[Oppération]=Résultat!J6)*(Tableau1[Surface]))","v":{"v":0,"d":"0.00 ha"}},{"$f":"IF(K$2>0,((SUMPRODUCT((Tableau1[Client]=$A7)*(Tableau1[Oppération]=Résultat!K$2)*(Tableau1[Surface])))*VLOOKUP(K$2,Tableau6[],2,0)),\" \")","v":0},{"v":0,"d":"000.00"},{"$f":"IF(M$2>0,((SUMPRODUCT((Tableau1[Client]=$A7)*(Tableau1[Oppération]=Résultat!M$2)*(Tableau1[Surface])))*VLOOKUP(M$2,Tableau6[],2,0)),\" \")","v":" "},{"$f":"SUMPRODUCT((Tableau1[Client]=Tableau2[[#This Row],[Clients]])*(Tableau1[Oppération]=Résultat!N6)*(Tableau1[Surface]))","v":{"v":0,"d":"0.00 ha"}},{"$f":"IF(O$2>0,((SUMPRODUCT((Tableau1[Client]=$A7)*(Tableau1[Oppération]=Résultat!O$2)*(Tableau1[Surface])))*VLOOKUP(O$2,Tableau6[],2,0)),\" \")","v":" "}]
[{"$f":"Base!AD7","v":0},{"$f":"SUMPRODUCT((Tableau1[Client]=Tableau2[[#This Row],[Clients]])*(Tableau1[Oppération]=Résultat!$B$2)*(Tableau1[Surface]))","v":{"v":0,"d":"0.00 ha"}},{"$f":"IF(C$2>0,((SUMPRODUCT((Tableau1[Client]=$A8)*(Tableau1[Oppération]=Résultat!C$2)*(Tableau1[Surface])))*VLOOKUP(C$2,Tableau6[],2,0)),\" \")","v":0},{"$f":"SUMPRODUCT((Tableau1[Client]=Tableau2[[#This Row],[Clients]])*(Tableau1[Oppération]=Résultat!$D$2)*(Tableau1[Surface]))","v":{"v":0,"d":"0.00 ha"}},{"$f":"IF(E$2>0,((SUMPRODUCT((Tableau1[Client]=$A8)*(Tableau1[Oppération]=Résultat!E$2)*(Tableau1[Surface])))*VLOOKUP(E$2,Tableau6[],2,0)),\" \")","v":0},{"$f":"SUMPRODUCT((Tableau1[Client]=Tableau2[[#This Row],[Clients]])*(Tableau1[Oppération]=Résultat!$F$2)*(Tableau1[Surface]))","v":{"v":0,"d":"0.00 ha"}},{"$f":"IF(G$2>0,((SUMPRODUCT((Tableau1[Client]=$A8)*(Tableau1[Oppération]=Résultat!G$2)*(Tableau1[Surface])))*VLOOKUP(G$2,Tableau6[],2,0)),\" \")","v":0},{"$f":"SUMPRODUCT((Tableau1[Client]=Tableau2[[#This Row],[Clients]])*(Tableau1[Oppération]=Résultat!$H$2)*(Tableau1[Surface]))","v":{"v":0,"d":"0.00 ha"}},{"$f":"IF(I$2>0,((SUMPRODUCT((Tableau1[Client]=$A8)*(Tableau1[Oppération]=Résultat!I$2)*(Tableau1[Surface])))*VLOOKUP(I$2,Tableau6[],2,0)),\" \")","v":0},{"$f":"SUMPRODUCT((Tableau1[Client]=Tableau2[[#This Row],[Clients]])*(Tableau1[Oppération]=Résultat!J7)*(Tableau1[Surface]))","v":{"v":0,"d":"0.00 ha"}},{"$f":"IF(K$2>0,((SUMPRODUCT((Tableau1[Client]=$A8)*(Tableau1[Oppération]=Résultat!K$2)*(Tableau1[Surface])))*VLOOKUP(K$2,Tableau6[],2,0)),\" \")","v":0},{"v":0,"d":"000.00"},{"$f":"IF(M$2>0,((SUMPRODUCT((Tableau1[Client]=$A8)*(Tableau1[Oppération]=Résultat!M$2)*(Tableau1[Surface])))*VLOOKUP(M$2,Tableau6[],2,0)),\" \")","v":" "},{"$f":"SUMPRODUCT((Tableau1[Client]=Tableau2[[#This Row],[Clients]])*(Tableau1[Oppération]=Résultat!N7)*(Tableau1[Surface]))","v":{"v":0,"d":"0.00 ha"}},{"$f":"IF(O$2>0,((SUMPRODUCT((Tableau1[Client]=$A8)*(Tableau1[Oppération]=Résultat!O$2)*(Tableau1[Surface])))*VLOOKUP(O$2,Tableau6[],2,0)),\" \")","v":" "}]
[{"$f":"Base!AD8","v":0},{"$f":"SUMPRODUCT((Tableau1[Client]=Tableau2[[#This Row],[Clients]])*(Tableau1[Oppération]=Résultat!$B$2)*(Tableau1[Surface]))","v":{"v":0,"d":"0.00 ha"}},{"$f":"IF(C$2>0,((SUMPRODUCT((Tableau1[Client]=$A9)*(Tableau1[Oppération]=Résultat!C$2)*(Tableau1[Surface])))*VLOOKUP(C$2,Tableau6[],2,0)),\" \")","v":0},{"$f":"SUMPRODUCT((Tableau1[Client]=Tableau2[[#This Row],[Clients]])*(Tableau1[Oppération]=Résultat!$D$2)*(Tableau1[Surface]))","v":{"v":0,"d":"0.00 ha"}},{"$f":"IF(E$2>0,((SUMPRODUCT((Tableau1[Client]=$A9)*(Tableau1[Oppération]=Résultat!E$2)*(Tableau1[Surface])))*VLOOKUP(E$2,Tableau6[],2,0)),\" \")","v":0},{"$f":"SUMPRODUCT((Tableau1[Client]=Tableau2[[#This Row],[Clients]])*(Tableau1[Oppération]=Résultat!$F$2)*(Tableau1[Surface]))","v":{"v":0,"d":"0.00 ha"}},{"$f":"IF(G$2>0,((SUMPRODUCT((Tableau1[Client]=$A9)*(Tableau1[Oppération]=Résultat!G$2)*(Tableau1[Surface])))*VLOOKUP(G$2,Tableau6[],2,0)),\" \")","v":0},{"$f":"SUMPRODUCT((Tableau1[Client]=Tableau2[[#This Row],[Clients]])*(Tableau1[Oppération]=Résultat!$H$2)*(Tableau1[Surface]))","v":{"v":0,"d":"0.00 ha"}},{"$f":"IF(I$2>0,((SUMPRODUCT((Tableau1[Client]=$A9)*(Tableau1[Oppération]=Résultat!I$2)*(Tableau1[Surface])))*VLOOKUP(I$2,Tableau6[],2,0)),\" \")","v":0},{"$f":"SUMPRODUCT((Tableau1[Client]=Tableau2[[#This Row],[Clients]])*(Tableau1[Oppération]=Résultat!J8)*(Tableau1[Surface]))","v":{"v":0,"d":"0.00 ha"}},{"$f":"IF(K$2>0,((SUMPRODUCT((Tableau1[Client]=$A9)*(Tableau1[Oppération]=Résultat!K$2)*(Tableau1[Surface])))*VLOOKUP(K$2,Tableau6[],2,0)),\" \")","v":0},{"v":0,"d":"000.00"},{"$f":"IF(M$2>0,((SUMPRODUCT((Tableau1[Client]=$A9)*(Tableau1[Oppération]=Résultat!M$2)*(Tableau1[Surface])))*VLOOKUP(M$2,Tableau6[],2,0)),\" \")","v":" "},{"$f":"SUMPRODUCT((Tableau1[Client]=Tableau2[[#This Row],[Clients]])*(Tableau1[Oppération]=Résultat!N8)*(Tableau1[Surface]))","v":{"v":0,"d":"0.00 ha"}},{"$f":"IF(O$2>0,((SUMPRODUCT((Tableau1[Client]=$A9)*(Tableau1[Oppération]=Résultat!O$2)*(Tableau1[Surface])))*VLOOKUP(O$2,Tableau6[],2,0)),\" \")","v":" "}]
[{"$f":"Base!AD9","v":0},{"$f":"SUMPRODUCT((Tableau1[Client]=Tableau2[[#This Row],[Clients]])*(Tableau1[Oppération]=Résultat!$B$2)*(Tableau1[Surface]))","v":{"v":0,"d":"0.00 ha"}},{"$f":"IF(C$2>0,((SUMPRODUCT((Tableau1[Client]=$A10)*(Tableau1[Oppération]=Résultat!C$2)*(Tableau1[Surface])))*VLOOKUP(C$2,Tableau6[],2,0)),\" \")","v":0},{"$f":"SUMPRODUCT((Tableau1[Client]=Tableau2[[#This Row],[Clients]])*(Tableau1[Oppération]=Résultat!$D$2)*(Tableau1[Surface]))","v":{"v":0,"d":"0.00 ha"}},{"$f":"IF(E$2>0,((SUMPRODUCT((Tableau1[Client]=$A10)*(Tableau1[Oppération]=Résultat!E$2)*(Tableau1[Surface])))*VLOOKUP(E$2,Tableau6[],2,0)),\" \")","v":0},{"$f":"SUMPRODUCT((Tableau1[Client]=Tableau2[[#This Row],[Clients]])*(Tableau1[Oppération]=Résultat!$F$2)*(Tableau1[Surface]))","v":{"v":0,"d":"0.00 ha"}},{"$f":"IF(G$2>0,((SUMPRODUCT((Tableau1[Client]=$A10)*(Tableau1[Oppération]=Résultat!G$2)*(Tableau1[Surface])))*VLOOKUP(G$2,Tableau6[],2,0)),\" \")","v":0},{"$f":"SUMPRODUCT((Tableau1[Client]=Tableau2[[#This Row],[Clients]])*(Tableau1[Oppération]=Résultat!$H$2)*(Tableau1[Surface]))","v":{"v":0,"d":"0.00 ha"}},{"$f":"IF(I$2>0,((SUMPRODUCT((Tableau1[Client]=$A10)*(Tableau1[Oppération]=Résultat!I$2)*(Tableau1[Surface])))*VLOOKUP(I$2,Tableau6[],2,0)),\" \")","v":0},{"$f":"SUMPRODUCT((Tableau1[Client]=Tableau2[[#This Row],[Clients]])*(Tableau1[Oppération]=Résultat!J9)*(Tableau1[Surface]))","v":{"v":0,"d":"0.00 ha"}},{"$f":"IF(K$2>0,((SUMPRODUCT((Tableau1[Client]=$A10)*(Tableau1[Oppération]=Résultat!K$2)*(Tableau1[Surface])))*VLOOKUP(K$2,Tableau6[],2,0)),\" \")","v":0},{"v":0,"d":"000.00"},{"$f":"IF(M$2>0,((SUMPRODUCT((Tableau1[Client]=$A10)*(Tableau1[Oppération]=Résultat!M$2)*(Tableau1[Surface])))*VLOOKUP(M$2,Tableau6[],2,0)),\" \")","v":" "},{"$f":"SUMPRODUCT((Tableau1[Client]=Tableau2[[#This Row],[Clients]])*(Tableau1[Oppération]=Résultat!N9)*(Tableau1[Surface]))","v":{"v":0,"d":"0.00 ha"}},{"$f":"IF(O$2>0,((SUMPRODUCT((Tableau1[Client]=$A10)*(Tableau1[Oppération]=Résultat!O$2)*(Tableau1[Surface])))*VLOOKUP(O$2,Tableau6[],2,0)),\" \")","v":" "}]
[{"$f":"Base!AD10","v":0},{"$f":"SUMPRODUCT((Tableau1[Client]=Tableau2[[#This Row],[Clients]])*(Tableau1[Oppération]=Résultat!$B$2)*(Tableau1[Surface]))","v":{"v":0,"d":"0.00 ha"}},{"$f":"IF(C$2>0,((SUMPRODUCT((Tableau1[Client]=$A11)*(Tableau1[Oppération]=Résultat!C$2)*(Tableau1[Surface])))*VLOOKUP(C$2,Tableau6[],2,0)),\" \")","v":0},{"$f":"SUMPRODUCT((Tableau1[Client]=Tableau2[[#This Row],[Clients]])*(Tableau1[Oppération]=Résultat!$D$2)*(Tableau1[Surface]))","v":{"v":0,"d":"0.00 ha"}},{"$f":"IF(E$2>0,((SUMPRODUCT((Tableau1[Client]=$A11)*(Tableau1[Oppération]=Résultat!E$2)*(Tableau1[Surface])))*VLOOKUP(E$2,Tableau6[],2,0)),\" \")","v":0},{"$f":"SUMPRODUCT((Tableau1[Client]=Tableau2[[#This Row],[Clients]])*(Tableau1[Oppération]=Résultat!$F$2)*(Tableau1[Surface]))","v":{"v":0,"d":"0.00 ha"}},{"$f":"IF(G$2>0,((SUMPRODUCT((Tableau1[Client]=$A11)*(Tableau1[Oppération]=Résultat!G$2)*(Tableau1[Surface])))*VLOOKUP(G$2,Tableau6[],2,0)),\" \")","v":0},{"$f":"SUMPRODUCT((Tableau1[Client]=Tableau2[[#This Row],[Clients]])*(Tableau1[Oppération]=Résultat!$H$2)*(Tableau1[Surface]))","v":{"v":0,"d":"0.00 ha"}},{"$f":"IF(I$2>0,((SUMPRODUCT((Tableau1[Client]=$A11)*(Tableau1[Oppération]=Résultat!I$2)*(Tableau1[Surface])))*VLOOKUP(I$2,Tableau6[],2,0)),\" \")","v":0},{"$f":"SUMPRODUCT((Tableau1[Client]=Tableau2[[#This Row],[Clients]])*(Tableau1[Oppération]=Résultat!J10)*(Tableau1[Surface]))","v":{"v":0,"d":"0.00 ha"}},{"$f":"IF(K$2>0,((SUMPRODUCT((Tableau1[Client]=$A11)*(Tableau1[Oppération]=Résultat!K$2)*(Tableau1[Surface])))*VLOOKUP(K$2,Tableau6[],2,0)),\" \")","v":0},{"v":1,"d":"001.00"},{"$f":"IF(M$2>0,((SUMPRODUCT((Tableau1[Client]=$A11)*(Tableau1[Oppération]=Résultat!M$2)*(Tableau1[Surface])))*VLOOKUP(M$2,Tableau6[],2,0)),\" \")","v":" "},{"$f":"SUMPRODUCT((Tableau1[Client]=Tableau2[[#This Row],[Clients]])*(Tableau1[Oppération]=Résultat!N10)*(Tableau1[Surface]))","v":{"v":0,"d":"0.00 ha"}}]
[{"$f":"Base!AD11","v":0},{"$f":"SUMPRODUCT((Tableau1[Client]=Tableau2[[#This Row],[Clients]])*(Tableau1[Oppération]=Résultat!$B$2)*(Tableau1[Surface]))","v":{"v":0,"d":"0.00 ha"}},{"$f":"IF(C$2>0,((SUMPRODUCT((Tableau1[Client]=$A12)*(Tableau1[Oppération]=Résultat!C$2)*(Tableau1[Surface])))*VLOOKUP(C$2,Tableau6[],2,0)),\" \")","v":0},{"$f":"SUMPRODUCT((Tableau1[Client]=Tableau2[[#This Row],[Clients]])*(Tableau1[Oppération]=Résultat!$D$2)*(Tableau1[Surface]))","v":{"v":0,"d":"0.00 ha"}},{"$f":"IF(E$2>0,((SUMPRODUCT((Tableau1[Client]=$A12)*(Tableau1[Oppération]=Résultat!E$2)*(Tableau1[Surface])))*VLOOKUP(E$2,Tableau6[],2,0)),\" \")","v":0},{"$f":"SUMPRODUCT((Tableau1[Client]=Tableau2[[#This Row],[Clients]])*(Tableau1[Oppération]=Résultat!$F$2)*(Tableau1[Surface]))","v":{"v":0,"d":"0.00 ha"}},{"$f":"IF(G$2>0,((SUMPRODUCT((Tableau1[Client]=$A12)*(Tableau1[Oppération]=Résultat!G$2)*(Tableau1[Surface])))*VLOOKUP(G$2,Tableau6[],2,0)),\" \")","v":0},{"$f":"SUMPRODUCT((Tableau1[Client]=Tableau2[[#This Row],[Clients]])*(Tableau1[Oppération]=Résultat!$H$2)*(Tableau1[Surface]))","v":{"v":0,"d":"0.00 ha"}},{"$f":"IF(I$2>0,((SUMPRODUCT((Tableau1[Client]=$A12)*(Tableau1[Oppération]=Résultat!I$2)*(Tableau1[Surface])))*VLOOKUP(I$2,Tableau6[],2,0)),\" \")","v":0},{"$f":"SUMPRODUCT((Tableau1[Client]=Tableau2[[#This Row],[Clients]])*(Tableau1[Oppération]=Résultat!J11)*(Tableau1[Surface]))","v":{"v":0,"d":"0.00 ha"}},{"$f":"IF(K$2>0,((SUMPRODUCT((Tableau1[Client]=$A12)*(Tableau1[Oppération]=Résultat!K$2)*(Tableau1[Surface])))*VLOOKUP(K$2,Tableau6[],2,0)),\" \")","v":0},{"v":2,"d":"002.00"},{"$f":"IF(M$2>0,((SUMPRODUCT((Tableau1[Client]=$A12)*(Tableau1[Oppération]=Résultat!M$2)*(Tableau1[Surface])))*VLOOKUP(M$2,Tableau6[],2,0)),\" \")","v":" "},{"$f":"SUMPRODUCT((Tableau1[Client]=Tableau2[[#This Row],[Clients]])*(Tableau1[Oppération]=Résultat!N11)*(Tableau1[Surface]))","v":{"v":0,"d":"0.00 ha"}}]
[{"$f":"Base!AD12","v":0},{"$f":"SUMPRODUCT((Tableau1[Client]=Tableau2[[#This Row],[Clients]])*(Tableau1[Oppération]=Résultat!$B$2)*(Tableau1[Surface]))","v":{"v":0,"d":"0.00 ha"}},{"$f":"IF(C$2>0,((SUMPRODUCT((Tableau1[Client]=$A13)*(Tableau1[Oppération]=Résultat!C$2)*(Tableau1[Surface])))*VLOOKUP(C$2,Tableau6[],2,0)),\" \")","v":0},{"$f":"SUMPRODUCT((Tableau1[Client]=Tableau2[[#This Row],[Clients]])*(Tableau1[Oppération]=Résultat!$D$2)*(Tableau1[Surface]))","v":{"v":0,"d":"0.00 ha"}},{"$f":"IF(E$2>0,((SUMPRODUCT((Tableau1[Client]=$A13)*(Tableau1[Oppération]=Résultat!E$2)*(Tableau1[Surface])))*VLOOKUP(E$2,Tableau6[],2,0)),\" \")","v":0},{"$f":"SUMPRODUCT((Tableau1[Client]=Tableau2[[#This Row],[Clients]])*(Tableau1[Oppération]=Résultat!$F$2)*(Tableau1[Surface]))","v":{"v":0,"d":"0.00 ha"}},{"$f":"IF(G$2>0,((SUMPRODUCT((Tableau1[Client]=$A13)*(Tableau1[Oppération]=Résultat!G$2)*(Tableau1[Surface])))*VLOOKUP(G$2,Tableau6[],2,0)),\" \")","v":0},{"$f":"SUMPRODUCT((Tableau1[Client]=Tableau2[[#This Row],[Clients]])*(Tableau1[Oppération]=Résultat!$H$2)*(Tableau1[Surface]))","v":{"v":0,"d":"0.00 ha"}},{"$f":"IF(I$2>0,((SUMPRODUCT((Tableau1[Client]=$A13)*(Tableau1[Oppération]=Résultat!I$2)*(Tableau1[Surface])))*VLOOKUP(I$2,Tableau6[],2,0)),\" \")","v":0},{"$f":"SUMPRODUCT((Tableau1[Client]=Tableau2[[#This Row],[Clients]])*(Tableau1[Oppération]=Résultat!J12)*(Tableau1[Surface]))","v":{"v":0,"d":"0.00 ha"}},{"$f":"IF(K$2>0,((SUMPRODUCT((Tableau1[Client]=$A13)*(Tableau1[Oppération]=Résultat!K$2)*(Tableau1[Surface])))*VLOOKUP(K$2,Tableau6[],2,0)),\" \")","v":0},{"v":3,"d":"003.00"},{"$f":"IF(M$2>0,((SUMPRODUCT((Tableau1[Client]=$A13)*(Tableau1[Oppération]=Résultat!M$2)*(Tableau1[Surface])))*VLOOKUP(M$2,Tableau6[],2,0)),\" \")","v":" "},{"$f":"SUMPRODUCT((Tableau1[Client]=Tableau2[[#This Row],[Clients]])*(Tableau1[Oppération]=Résultat!N12)*(Tableau1[Surface]))","v":{"v":0,"d":"0.00 ha"}}]
[{"$f":"Base!AD13","v":0},{"$f":"SUMPRODUCT((Tableau1[Client]=Tableau2[[#This Row],[Clients]])*(Tableau1[Oppération]=Résultat!$B$2)*(Tableau1[Surface]))","v":{"v":0,"d":"0.00 ha"}},{"$f":"IF(C$2>0,((SUMPRODUCT((Tableau1[Client]=$A14)*(Tableau1[Oppération]=Résultat!C$2)*(Tableau1[Surface])))*VLOOKUP(C$2,Tableau6[],2,0)),\" \")","v":0},{"$f":"SUMPRODUCT((Tableau1[Client]=Tableau2[[#This Row],[Clients]])*(Tableau1[Oppération]=Résultat!$D$2)*(Tableau1[Surface]))","v":{"v":0,"d":"0.00 ha"}},{"$f":"IF(E$2>0,((SUMPRODUCT((Tableau1[Client]=$A14)*(Tableau1[Oppération]=Résultat!E$2)*(Tableau1[Surface])))*VLOOKUP(E$2,Tableau6[],2,0)),\" \")","v":0},{"$f":"SUMPRODUCT((Tableau1[Client]=Tableau2[[#This Row],[Clients]])*(Tableau1[Oppération]=Résultat!$F$2)*(Tableau1[Surface]))","v":{"v":0,"d":"0.00 ha"}},{"$f":"IF(G$2>0,((SUMPRODUCT((Tableau1[Client]=$A14)*(Tableau1[Oppération]=Résultat!G$2)*(Tableau1[Surface])))*VLOOKUP(G$2,Tableau6[],2,0)),\" \")","v":0},{"$f":"SUMPRODUCT((Tableau1[Client]=Tableau2[[#This Row],[Clients]])*(Tableau1[Oppération]=Résultat!$H$2)*(Tableau1[Surface]))","v":{"v":0,"d":"0.00 ha"}},{"$f":"IF(I$2>0,((SUMPRODUCT((Tableau1[Client]=$A14)*(Tableau1[Oppération]=Résultat!I$2)*(Tableau1[Surface])))*VLOOKUP(I$2,Tableau6[],2,0)),\" \")","v":0},{"$f":"SUMPRODUCT((Tableau1[Client]=Tableau2[[#This Row],[Clients]])*(Tableau1[Oppération]=Résultat!J13)*(Tableau1[Surface]))","v":{"v":0,"d":"0.00 ha"}},{"$f":"IF(K$2>0,((SUMPRODUCT((Tableau1[Client]=$A14)*(Tableau1[Oppération]=Résultat!K$2)*(Tableau1[Surface])))*VLOOKUP(K$2,Tableau6[],2,0)),\" \")","v":0},{"v":4,"d":"004.00"},{"$f":"IF(M$2>0,((SUMPRODUCT((Tableau1[Client]=$A14)*(Tableau1[Oppération]=Résultat!M$2)*(Tableau1[Surface])))*VLOOKUP(M$2,Tableau6[],2,0)),\" \")","v":" "},{"$f":"SUMPRODUCT((Tableau1[Client]=Tableau2[[#This Row],[Clients]])*(Tableau1[Oppération]=Résultat!N13)*(Tableau1[Surface]))","v":{"v":0,"d":"0.00 ha"}}]
[{"$f":"Base!AD14","v":0},{"$f":"SUMPRODUCT((Tableau1[Client]=Tableau2[[#This Row],[Clients]])*(Tableau1[Oppération]=Résultat!$B$2)*(Tableau1[Surface]))","v":{"v":0,"d":"0.00 ha"}},{"$f":"IF(C$2>0,((SUMPRODUCT((Tableau1[Client]=$A15)*(Tableau1[Oppération]=Résultat!C$2)*(Tableau1[Surface])))*VLOOKUP(C$2,Tableau6[],2,0)),\" \")","v":0},{"$f":"SUMPRODUCT((Tableau1[Client]=Tableau2[[#This Row],[Clients]])*(Tableau1[Oppération]=Résultat!$D$2)*(Tableau1[Surface]))","v":{"v":0,"d":"0.00 ha"}},{"$f":"IF(E$2>0,((SUMPRODUCT((Tableau1[Client]=$A15)*(Tableau1[Oppération]=Résultat!E$2)*(Tableau1[Surface])))*VLOOKUP(E$2,Tableau6[],2,0)),\" \")","v":0},{"$f":"SUMPRODUCT((Tableau1[Client]=Tableau2[[#This Row],[Clients]])*(Tableau1[Oppération]=Résultat!$F$2)*(Tableau1[Surface]))","v":{"v":0,"d":"0.00 ha"}},{"$f":"IF(G$2>0,((SUMPRODUCT((Tableau1[Client]=$A15)*(Tableau1[Oppération]=Résultat!G$2)*(Tableau1[Surface])))*VLOOKUP(G$2,Tableau6[],2,0)),\" \")","v":0},{"$f":"SUMPRODUCT((Tableau1[Client]=Tableau2[[#This Row],[Clients]])*(Tableau1[Oppération]=Résultat!$H$2)*(Tableau1[Surface]))","v":{"v":0,"d":"0.00 ha"}},{"$f":"IF(I$2>0,((SUMPRODUCT((Tableau1[Client]=$A15)*(Tableau1[Oppération]=Résultat!I$2)*(Tableau1[Surface])))*VLOOKUP(I$2,Tableau6[],2,0)),\" \")","v":0},{"$f":"SUMPRODUCT((Tableau1[Client]=Tableau2[[#This Row],[Clients]])*(Tableau1[Oppération]=Résultat!J14)*(Tableau1[Surface]))","v":{"v":0,"d":"0.00 ha"}},{"$f":"IF(K$2>0,((SUMPRODUCT((Tableau1[Client]=$A15)*(Tableau1[Oppération]=Résultat!K$2)*(Tableau1[Surface])))*VLOOKUP(K$2,Tableau6[],2,0)),\" \")","v":0},{"v":5,"d":"005.00"},{"$f":"IF(M$2>0,((SUMPRODUCT((Tableau1[Client]=$A15)*(Tableau1[Oppération]=Résultat!M$2)*(Tableau1[Surface])))*VLOOKUP(M$2,Tableau6[],2,0)),\" \")","v":" "},{"$f":"SUMPRODUCT((Tableau1[Client]=Tableau2[[#This Row],[Clients]])*(Tableau1[Oppération]=Résultat!N14)*(Tableau1[Surface]))","v":{"v":0,"d":"0.00 ha"}}]
[{"$f":"Base!AD15","v":0},{"$f":"SUMPRODUCT((Tableau1[Client]=Tableau2[[#This Row],[Clients]])*(Tableau1[Oppération]=Résultat!$B$2)*(Tableau1[Surface]))","v":{"v":0,"d":"0.00 ha"}},{"$f":"IF(C$2>0,((SUMPRODUCT((Tableau1[Client]=$A16)*(Tableau1[Oppération]=Résultat!C$2)*(Tableau1[Surface])))*VLOOKUP(C$2,Tableau6[],2,0)),\" \")","v":0},{"$f":"SUMPRODUCT((Tableau1[Client]=Tableau2[[#This Row],[Clients]])*(Tableau1[Oppération]=Résultat!$D$2)*(Tableau1[Surface]))","v":{"v":0,"d":"0.00 ha"}},{"$f":"IF(E$2>0,((SUMPRODUCT((Tableau1[Client]=$A16)*(Tableau1[Oppération]=Résultat!E$2)*(Tableau1[Surface])))*VLOOKUP(E$2,Tableau6[],2,0)),\" \")","v":0},{"$f":"SUMPRODUCT((Tableau1[Client]=Tableau2[[#This Row],[Clients]])*(Tableau1[Oppération]=Résultat!$F$2)*(Tableau1[Surface]))","v":{"v":0,"d":"0.00 ha"}},{"$f":"IF(G$2>0,((SUMPRODUCT((Tableau1[Client]=$A16)*(Tableau1[Oppération]=Résultat!G$2)*(Tableau1[Surface])))*VLOOKUP(G$2,Tableau6[],2,0)),\" \")","v":0},{"$f":"SUMPRODUCT((Tableau1[Client]=Tableau2[[#This Row],[Clients]])*(Tableau1[Oppération]=Résultat!$H$2)*(Tableau1[Surface]))","v":{"v":0,"d":"0.00 ha"}},{"$f":"IF(I$2>0,((SUMPRODUCT((Tableau1[Client]=$A16)*(Tableau1[Oppération]=Résultat!I$2)*(Tableau1[Surface])))*VLOOKUP(I$2,Tableau6[],2,0)),\" \")","v":0},{"$f":"SUMPRODUCT((Tableau1[Client]=Tableau2[[#This Row],[Clients]])*(Tableau1[Oppération]=Résultat!J15)*(Tableau1[Surface]))","v":{"v":0,"d":"0.00 ha"}},{"$f":"IF(K$2>0,((SUMPRODUCT((Tableau1[Client]=$A16)*(Tableau1[Oppération]=Résultat!K$2)*(Tableau1[Surface])))*VLOOKUP(K$2,Tableau6[],2,0)),\" \")","v":0},{"v":6,"d":"006.00"},{"$f":"IF(M$2>0,((SUMPRODUCT((Tableau1[Client]=$A16)*(Tableau1[Oppération]=Résultat!M$2)*(Tableau1[Surface])))*VLOOKUP(M$2,Tableau6[],2,0)),\" \")","v":" "},{"$f":"SUMPRODUCT((Tableau1[Client]=Tableau2[[#This Row],[Clients]])*(Tableau1[Oppération]=Résultat!N15)*(Tableau1[Surface]))","v":{"v":0,"d":"0.00 ha"}}]
[{"$f":"Base!AD16","v":0},{"$f":"SUMPRODUCT((Tableau1[Client]=Tableau2[[#This Row],[Clients]])*(Tableau1[Oppération]=Résultat!$B$2)*(Tableau1[Surface]))","v":{"v":0,"d":"0.00 ha"}},{"$f":"IF(C$2>0,((SUMPRODUCT((Tableau1[Client]=$A17)*(Tableau1[Oppération]=Résultat!C$2)*(Tableau1[Surface])))*VLOOKUP(C$2,Tableau6[],2,0)),\" \")","v":0},{"$f":"SUMPRODUCT((Tableau1[Client]=Tableau2[[#This Row],[Clients]])*(Tableau1[Oppération]=Résultat!$D$2)*(Tableau1[Surface]))","v":{"v":0,"d":"0.00 ha"}},{"$f":"IF(E$2>0,((SUMPRODUCT((Tableau1[Client]=$A17)*(Tableau1[Oppération]=Résultat!E$2)*(Tableau1[Surface])))*VLOOKUP(E$2,Tableau6[],2,0)),\" \")","v":0},{"$f":"SUMPRODUCT((Tableau1[Client]=Tableau2[[#This Row],[Clients]])*(Tableau1[Oppération]=Résultat!$F$2)*(Tableau1[Surface]))","v":{"v":0,"d":"0.00 ha"}},{"$f":"IF(G$2>0,((SUMPRODUCT((Tableau1[Client]=$A17)*(Tableau1[Oppération]=Résultat!G$2)*(Tableau1[Surface])))*VLOOKUP(G$2,Tableau6[],2,0)),\" \")","v":0},{"$f":"SUMPRODUCT((Tableau1[Client]=Tableau2[[#This Row],[Clients]])*(Tableau1[Oppération]=Résultat!$H$2)*(Tableau1[Surface]))","v":{"v":0,"d":"0.00 ha"}},{"$f":"IF(I$2>0,((SUMPRODUCT((Tableau1[Client]=$A17)*(Tableau1[Oppération]=Résultat!I$2)*(Tableau1[Surface])))*VLOOKUP(I$2,Tableau6[],2,0)),\" \")","v":0},{"$f":"SUMPRODUCT((Tableau1[Client]=Tableau2[[#This Row],[Clients]])*(Tableau1[Oppération]=Résultat!J16)*(Tableau1[Surface]))","v":{"v":0,"d":"0.00 ha"}},{"$f":"IF(K$2>0,((SUMPRODUCT((Tableau1[Client]=$A17)*(Tableau1[Oppération]=Résultat!K$2)*(Tableau1[Surface])))*VLOOKUP(K$2,Tableau6[],2,0)),\" \")","v":0},{"v":7,"d":"007.00"},{"$f":"IF(M$2>0,((SUMPRODUCT((Tableau1[Client]=$A17)*(Tableau1[Oppération]=Résultat!M$2)*(Tableau1[Surface])))*VLOOKUP(M$2,Tableau6[],2,0)),\" \")","v":" "},{"$f":"SUMPRODUCT((Tableau1[Client]=Tableau2[[#This Row],[Clients]])*(Tableau1[Oppération]=Résultat!N16)*(Tableau1[Surface]))","v":{"v":0,"d":"0.00 ha"}}]
[{"$f":"Base!AD17","v":0},{"$f":"SUMPRODUCT((Tableau1[Client]=Tableau2[[#This Row],[Clients]])*(Tableau1[Oppération]=Résultat!$B$2)*(Tableau1[Surface]))","v":{"v":0,"d":"0.00 ha"}},{"$f":"IF(C$2>0,((SUMPRODUCT((Tableau1[Client]=$A18)*(Tableau1[Oppération]=Résultat!C$2)*(Tableau1[Surface])))*VLOOKUP(C$2,Tableau6[],2,0)),\" \")","v":0},{"$f":"SUMPRODUCT((Tableau1[Client]=Tableau2[[#This Row],[Clients]])*(Tableau1[Oppération]=Résultat!$D$2)*(Tableau1[Surface]))","v":{"v":0,"d":"0.00 ha"}},{"$f":"IF(E$2>0,((SUMPRODUCT((Tableau1[Client]=$A18)*(Tableau1[Oppération]=Résultat!E$2)*(Tableau1[Surface])))*VLOOKUP(E$2,Tableau6[],2,0)),\" \")","v":0},{"$f":"SUMPRODUCT((Tableau1[Client]=Tableau2[[#This Row],[Clients]])*(Tableau1[Oppération]=Résultat!$F$2)*(Tableau1[Surface]))","v":{"v":0,"d":"0.00 ha"}},{"$f":"IF(G$2>0,((SUMPRODUCT((Tableau1[Client]=$A18)*(Tableau1[Oppération]=Résultat!G$2)*(Tableau1[Surface])))*VLOOKUP(G$2,Tableau6[],2,0)),\" \")","v":0},{"$f":"SUMPRODUCT((Tableau1[Client]=Tableau2[[#This Row],[Clients]])*(Tableau1[Oppération]=Résultat!$H$2)*(Tableau1[Surface]))","v":{"v":0,"d":"0.00 ha"}},{"$f":"IF(I$2>0,((SUMPRODUCT((Tableau1[Client]=$A18)*(Tableau1[Oppération]=Résultat!I$2)*(Tableau1[Surface])))*VLOOKUP(I$2,Tableau6[],2,0)),\" \")","v":0},{"$f":"SUMPRODUCT((Tableau1[Client]=Tableau2[[#This Row],[Clients]])*(Tableau1[Oppération]=Résultat!J17)*(Tableau1[Surface]))","v":{"v":0,"d":"0.00 ha"}},{"$f":"IF(K$2>0,((SUMPRODUCT((Tableau1[Client]=$A18)*(Tableau1[Oppération]=Résultat!K$2)*(Tableau1[Surface])))*VLOOKUP(K$2,Tableau6[],2,0)),\" \")","v":0},{"v":8,"d":"008.00"},{"$f":"IF(M$2>0,((SUMPRODUCT((Tableau1[Client]=$A18)*(Tableau1[Oppération]=Résultat!M$2)*(Tableau1[Surface])))*VLOOKUP(M$2,Tableau6[],2,0)),\" \")","v":" "},{"$f":"SUMPRODUCT((Tableau1[Client]=Tableau2[[#This Row],[Clients]])*(Tableau1[Oppération]=Résultat!N17)*(Tableau1[Surface]))","v":{"v":0,"d":"0.00 ha"}}]
[{"$f":"Base!AD18","v":0},{"$f":"SUMPRODUCT((Tableau1[Client]=Tableau2[[#This Row],[Clients]])*(Tableau1[Oppération]=Résultat!$B$2)*(Tableau1[Surface]))","v":{"v":0,"d":"0.00 ha"}},{"$f":"IF(C$2>0,((SUMPRODUCT((Tableau1[Client]=$A19)*(Tableau1[Oppération]=Résultat!C$2)*(Tableau1[Surface])))*VLOOKUP(C$2,Tableau6[],2,0)),\" \")","v":0},{"$f":"SUMPRODUCT((Tableau1[Client]=Tableau2[[#This Row],[Clients]])*(Tableau1[Oppération]=Résultat!$D$2)*(Tableau1[Surface]))","v":{"v":0,"d":"0.00 ha"}},{"$f":"IF(E$2>0,((SUMPRODUCT((Tableau1[Client]=$A19)*(Tableau1[Oppération]=Résultat!E$2)*(Tableau1[Surface])))*VLOOKUP(E$2,Tableau6[],2,0)),\" \")","v":0},{"$f":"SUMPRODUCT((Tableau1[Client]=Tableau2[[#This Row],[Clients]])*(Tableau1[Oppération]=Résultat!$F$2)*(Tableau1[Surface]))","v":{"v":0,"d":"0.00 ha"}},{"$f":"IF(G$2>0,((SUMPRODUCT((Tableau1[Client]=$A19)*(Tableau1[Oppération]=Résultat!G$2)*(Tableau1[Surface])))*VLOOKUP(G$2,Tableau6[],2,0)),\" \")","v":0},{"$f":"SUMPRODUCT((Tableau1[Client]=Tableau2[[#This Row],[Clients]])*(Tableau1[Oppération]=Résultat!$H$2)*(Tableau1[Surface]))","v":{"v":0,"d":"0.00 ha"}},{"$f":"IF(I$2>0,((SUMPRODUCT((Tableau1[Client]=$A19)*(Tableau1[Oppération]=Résultat!I$2)*(Tableau1[Surface])))*VLOOKUP(I$2,Tableau6[],2,0)),\" \")","v":0},{"$f":"SUMPRODUCT((Tableau1[Client]=Tableau2[[#This Row],[Clients]])*(Tableau1[Oppération]=Résultat!J18)*(Tableau1[Surface]))","v":{"v":0,"d":"0.00 ha"}},{"$f":"IF(K$2>0,((SUMPRODUCT((Tableau1[Client]=$A19)*(Tableau1[Oppération]=Résultat!K$2)*(Tableau1[Surface])))*VLOOKUP(K$2,Tableau6[],2,0)),\" \")","v":0},{"v":9,"d":"009.00"},{"$f":"IF(M$2>0,((SUMPRODUCT((Tableau1[Client]=$A19)*(Tableau1[Oppération]=Résultat!M$2)*(Tableau1[Surface])))*VLOOKUP(M$2,Tableau6[],2,0)),\" \")","v":" "},{"$f":"SUMPRODUCT((Tableau1[Client]=Tableau2[[#This Row],[Clients]])*(Tableau1[Oppération]=Résultat!N18)*(Tableau1[Surface]))","v":{"v":0,"d":"0.00 ha"}}]
[{"$f":"Base!AD19","v":0},{"$f":"SUMPRODUCT((Tableau1[Client]=Tableau2[[#This Row],[Clients]])*(Tableau1[Oppération]=Résultat!$B$2)*(Tableau1[Surface]))","v":{"v":0,"d":"0.00 ha"}},{"$f":"IF(C$2>0,((SUMPRODUCT((Tableau1[Client]=$A20)*(Tableau1[Oppération]=Résultat!C$2)*(Tableau1[Surface])))*VLOOKUP(C$2,Tableau6[],2,0)),\" \")","v":0},{"$f":"SUMPRODUCT((Tableau1[Client]=Tableau2[[#This Row],[Clients]])*(Tableau1[Oppération]=Résultat!$D$2)*(Tableau1[Surface]))","v":{"v":0,"d":"0.00 ha"}},{"$f":"IF(E$2>0,((SUMPRODUCT((Tableau1[Client]=$A20)*(Tableau1[Oppération]=Résultat!E$2)*(Tableau1[Surface])))*VLOOKUP(E$2,Tableau6[],2,0)),\" \")","v":0},{"$f":"SUMPRODUCT((Tableau1[Client]=Tableau2[[#This Row],[Clients]])*(Tableau1[Oppération]=Résultat!$F$2)*(Tableau1[Surface]))","v":{"v":0,"d":"0.00 ha"}},{"$f":"IF(G$2>0,((SUMPRODUCT((Tableau1[Client]=$A20)*(Tableau1[Oppération]=Résultat!G$2)*(Tableau1[Surface])))*VLOOKUP(G$2,Tableau6[],2,0)),\" \")","v":0},{"$f":"SUMPRODUCT((Tableau1[Client]=Tableau2[[#This Row],[Clients]])*(Tableau1[Oppération]=Résultat!$H$2)*(Tableau1[Surface]))","v":{"v":0,"d":"0.00 ha"}},{"$f":"IF(I$2>0,((SUMPRODUCT((Tableau1[Client]=$A20)*(Tableau1[Oppération]=Résultat!I$2)*(Tableau1[Surface])))*VLOOKUP(I$2,Tableau6[],2,0)),\" \")","v":0},{"$f":"SUMPRODUCT((Tableau1[Client]=Tableau2[[#This Row],[Clients]])*(Tableau1[Oppération]=Résultat!J19)*(Tableau1[Surface]))","v":{"v":0,"d":"0.00 ha"}},{"$f":"IF(K$2>0,((SUMPRODUCT((Tableau1[Client]=$A20)*(Tableau1[Oppération]=Résultat!K$2)*(Tableau1[Surface])))*VLOOKUP(K$2,Tableau6[],2,0)),\" \")","v":0},{"v":10,"d":"010.00"},{"$f":"IF(M$2>0,((SUMPRODUCT((Tableau1[Client]=$A20)*(Tableau1[Oppération]=Résultat!M$2)*(Tableau1[Surface])))*VLOOKUP(M$2,Tableau6[],2,0)),\" \")","v":" "},{"$f":"SUMPRODUCT((Tableau1[Client]=Tableau2[[#This Row],[Clients]])*(Tableau1[Oppération]=Résultat!N19)*(Tableau1[Surface]))","v":{"v":0,"d":"0.00 ha"}}]
[null,{"$f":"SUBTOTAL(109,Tableau2[Colonne1])","v":{"v":16.7,"d":"16.70 ha"}},{"$f":"SUBTOTAL(109,Tableau2[Colonne8])","v":{"v":1503,"d":"1,503.00 €"}},{"$f":"SUBTOTAL(109,Tableau2[Colonne3])","v":{"v":40,"d":"40.00 ha"}},{"$f":"SUBTOTAL(109,Tableau2[Colonne9])","v":{"v":600,"d":"600.00 €"}},{"$f":"SUBTOTAL(109,Tableau2[Colonne2])","v":{"v":77.35,"d":"77.35 ha"}},{"$f":"SUBTOTAL(109,Tableau2[Colonne10])","v":{"v":6961.499999999999,"d":"6,961.50 €"}},{"$f":"SUBTOTAL(109,Tableau2[Colonne4])","v":{"v":55,"d":"55.00 ha"}},{"$f":"SUBTOTAL(109,Tableau2[Colonne11])","v":{"v":825,"d":"825.00 €"}},{"$f":"SUBTOTAL(109,Tableau2[Colonne5])","v":{"v":0,"d":"0.00 ha"}},{"$f":"SUBTOTAL(109,Tableau2[Colonne12])","v":0},"000,00",{"$f":"SUBTOTAL(109,Tableau2[Colonne13])","v":0},{"$f":"SUBTOTAL(109,Tableau2[Colonne7])","v":{"v":0,"d":"0.00 ha"}},{"$f":"SUBTOTAL(109,Tableau2[Colonne14])","v":0}]

{"sheet":"Impression","index":3,"n_rows":2026,"n_cols":28,"rows_kept":2026,"merged":[[0,0,1,6],[0,15,1,22],[3,4,3,6],[3,20,3,22],[4,4,4,6],[4,20,4,22],[5,4,5,6],[5,20,5,22],[6,5,6,6],[6,15,6,16],[6,21,6,22]]}
["Durand Jérome",{"$nulls":14},"Durand Jérome",{"$nulls":10},"Culture","Surface"]
[{"$nulls":9},"Client","Campagne",{"$nulls":15},"Blé",{"$f":"IF(AA2>0,SUMIF($R$15:$R$30,AA2,$Q$15:$Q$30),\" \")","v":10}]
[{"$nulls":9},"Florian","2013/2014",{"$nulls":15},"Tournesol",30.7]
[{"$nulls":4},"Client",{"$nulls":15},"Client",{"$nulls":5},"Maïs",55]
["Campagne",{"$f":"$K$3","v":"2013/2014"},null,null,{"$f":"VLOOKUP($J$3,Tableau3[],1,0)","v":"Florian"},{"$nulls":10},"Campagne",{"$f":"$K$3","v":"2013/2014"},{"$nulls":3},{"$f":"VLOOKUP($J$3,Tableau3[],1,0)","v":"Florian"},{"$nulls":6}," "]
[{"$nulls":4},{"$f":"VLOOKUP($J$3,Tableau3[],2,0)","v":"Le Bouscas"},{"$nulls":15},{"$f":"VLOOKUP($J$3,Tableau3[],2,0)","v":"Le Bouscas"},{"$nulls":6}," "]
[{"$nulls":4},{"$f":"VLOOKUP($J$3,Tableau3[],3,0)","v":81600},{"$f":"VLOOKUP($J$3,Tableau3[],4,0)","v":"Cadalen"},{"$nulls":9},"Assolement",{"$nulls":4},{"$f":"VLOOKUP($J$3,Tableau3[],3,0)","v":81600},{"$f":"VLOOKUP($J$3,Tableau3[],4,0)","v":"Cadalen"},{"$nulls":5}," "]
[{"$nulls":27}," "]
[{"$nulls":7},"",{"$nulls":14},"",{"$nulls":4},{"$f":"IF(AA9>0,SUMIF($R$15:$R$30,AA9,$Q$15:$Q$30),\" \")","v":" "}]
["Date","Oppération","Parcelle","Culture","Surface","Produit","Observation",{"$nulls":20},{"$f":"IF(AA10>0,SUMIF($R$15:$R$30,AA10,$Q$15:$Q$30),\" \")","v":" "}]
["15/12/2014","Moisson","Sous la route","Blé",{"v":10,"d":"10.00 ha"},"Urée 46%",{"$nulls":21},{"$f":"IF(AA11>0,SUMIF($R$15:$R$30,AA11,$Q$15:$Q$30),\" \")","v":" "}]
["16/12/2014","Pulvérisation","La plaine","Tournesol",{"v":20,"d":"20.00 ha"}]
["17/12/2014","Labour","Coteau","Tournesol",{"v":8.35,"d":"8.35 ha"}]
["15/12/2014","Moisson","Devant la maison","Tournesol",{"v":2.35,"d":"2.35 ha"},"Axial",{"$nulls":9},"Parcelles","Surface","Culture"]
["15/12/2014","Labour","Coteau","Tournesol",{"v":8.35,"d":"8.35 ha"},{"$nulls":10},"Coteau",{"$f":"IF(P15>0,VLOOKUP(P15,Tableau7[[#All],[Parcelles]:[Campagne]],2,0),\" \")","v":{"v":8.35,"d":"8.35 ha"}},{"$f":"IF(P15>0,VLOOKUP(P15,Tableau7[[#All],[Parcelles]:[Campagne]],3,0),\" \")","v":"Tournesol"}]
["17/12/2014","Moisson","sgdsfd","Maïs",{"v":55,"d":"55.00 ha"},"Urée 46%",{"$nulls":9},"Devant la maison",{"$f":"IF(P16>0,VLOOKUP(P16,Tableau7[[#All],[Parcelles]:[Campagne]],2,0),\" \")","v":{"v":2.35,"d":"2.35 ha"}},{"$f":"IF(P16>0,VLOOKUP(P16,Tableau7[[#All],[Parcelles]:[Campagne]],3,0),\" \")","v":"Tournesol"}]
[{"$nulls":15},"La plaine",{"$f":"IF(P17>0,VLOOKUP(P17,Tableau7[[#All],[Parcelles]:[Campagne]],2,0),\" \")","v":{"v":20,"d":"20.00 ha"}},{"$f":"IF(P17>0,VLOOKUP(P17,Tableau7[[#All],[Parcelles]:[Campagne]],3,0),\" \")","v":"Tournesol"}]
[{"$nulls":15},"sgdsfd",{"$f":"IF(P18>0,VLOOKUP(P18,Tableau7[[#All],[Parcelles]:[Campagne]],2,0),\" \")","v":{"v":55,"d":"55.00 ha"}},{"$f":"IF(P18>0,VLOOKUP(P18,Tableau7[[#All],[Parcelles]:[Campagne]],3,0),\" \")","v":"Maïs"}]
[{"$nulls":7},{"$f":"IF(B19>0,(VLOOKUP(B19,Tableau6[],2,0)),\" \")","v":" "},{"$nulls":7},"Sous la route",{"$f":"IF(P19>0,VLOOKUP(P19,Tableau7[[#All],[Parcelles]:[Campagne]],2,0),\" \")","v":{"v":10,"d":"10.00 ha"}},{"$f":"IF(P19>0,VLOOKUP(P19,Tableau7[[#All],[Parcelles]:[Campagne]],3,0),\" \")","v":"Blé"}]
[{"$nulls":7},{"$f":"IF(B20>0,(VLOOKUP(B20,Tableau6[],2,0)),\" \")","v":" "},{"$nulls":8},{"$f":"IF(P20>0,VLOOKUP(P20,Tableau7[[#All],[Parcelles]:[Campagne]],2,0),\" \")","v":" "},{"$f":"IF(P20>0,VLOOKUP(P20,Tableau7[[#All],[Parcelles]:[Campagne]],3,0),\" \")","v":" "}]
[{"$nulls":7},{"$f":"IF(B21>0,(VLOOKUP(B21,Tableau6[],2,0)),\" \")","v":" "}]
[{"$nulls":7},{"$f":"IF(B22>0,(VLOOKUP(B22,Tableau6[],2,0)),\" \")","v":" "}]
[{"$nulls":7},{"$f":"IF(B23>0,(VLOOKUP(B23,Tableau6[],2,0)),\" \")","v":" "}]
[{"$nulls":7},{"$f":"IF(B24>0,(VLOOKUP(B24,Tableau6[],2,0)),\" \")","v":" "}]
[{"$nulls":7},{"$f":"IF(B25>0,(VLOOKUP(B25,Tableau6[],2,0)),\" \")","v":" "}]
[{"$nulls":7},{"$f":"IF(B26>0,(VLOOKUP(B26,Tableau6[],2,0)),\" \")","v":" "}]
[{"$nulls":7},{"$f":"IF(B27>0,(VLOOKUP(B27,Tableau6[],2,0)),\" \")","v":" "}]
[{"$nulls":7},{"$f":"IF(B28>0,(VLOOKUP(B28,Tableau6[],2,0)),\" \")","v":" "}]
[{"$nulls":7},{"$f":"IF(B29>0,(VLOOKUP(B29,Tableau6[],2,0)),\" \")","v":" "}]
[{"$nulls":7},{"$f":"IF(B30>0,(VLOOKUP(B30,Tableau6[],2,0)),\" \")","v":" "}]
[{"$nulls":7},{"$f":"IF(B31>0,(VLOOKUP(B31,Tableau6[],2,0)),\" \")","v":" "}]
[{"$nulls":7},{"$f":"IF(B32>0,(VLOOKUP(B32,Tableau6[],2,0)),\" \")","v":" "}]
[{"$nulls":7},{"$f":"IF(B33>0,(VLOOKUP(B33,Tableau6[],2,0)),\" \")","v":" "}]
[{"$nulls":7},{"$f":"IF(B34>0,(VLOOKUP(B34,Tableau6[],2,0)),\" \")","v":" "}]
["Oppération","Surface","Cout / ha","Cout"]
["Labour",{"$f":"IF(A36>0,SUMIF($B$11:$B$33,A36,$E$11:$E$33),\" \")","v":{"v":16.7,"d":"16.70 ha"}},{"$f":"IF(A36>0,VLOOKUP(A36,Tableau6[],2,0),\" \")","v":{"v":90,"d":"90.00 €"}},{"$f":"IF(A36>0,(B36*C36),\" \")","v":{"v":1503,"d":"1,503.00 €"}}]
["Moisson",{"$f":"IF(A37>0,SUMIF($B$11:$B$33,A37,$E$11:$E$33),\" \")","v":{"v":67.35,"d":"67.35 ha"}},{"$f":"IF(A37>0,VLOOKUP(A37,Tableau6[],2,0),\" \")","v":{"v":90,"d":"90.00 €"}},{"$f":"IF(A37>0,(B37*C37),\" \")","v":{"v":6061.499999999999,"d":"6,061.50 €"}}]
["Pulvérisation",{"v":20,"d":"20.00 ha"},{"$f":"IF(A38>0,VLOOKUP(A38,Tableau6[],2,0),\" \")","v":{"v":15,"d":"15.00 €"}},{"v":300,"d":"300.00 €"}]
[null," ",{"$f":"IF(A39>0,VLOOKUP(A39,Tableau6[],2,0),\" \")","v":" "}," "]
[null," ",{"$f":"IF(A40>0,VLOOKUP(A40,Tableau6[],2,0),\" \")","v":" "}," "]
[null," ",{"$f":"IF(A41>0,VLOOKUP(A41,Tableau6[],2,0),\" \")","v":" "}," "]
[null," ",{"$f":"IF(A42>0,VLOOKUP(A42,Tableau6[],2,0),\" \")","v":" "}," "]
[null," ",{"$f":"IF(A43>0,VLOOKUP(A43,Tableau6[],2,0),\" \")","v":" "}," "]
[null," ",{"$f":"IF(A44>0,VLOOKUP(A44,Tableau6[],2,0),\" \")","v":" "}," "]
[null," ",{"$f":"IF(A45>0,VLOOKUP(A45,Tableau6[],2,0),\" \")","v":" "}," "]
[null," ",{"$f":"IF(A46>0,VLOOKUP(A46,Tableau6[],2,0),\" \")","v":" "}," "]
[null," ",{"$f":"IF(A47>0,VLOOKUP(A47,Tableau6[],2,0),\" \")","v":" "}," "]
[null," ",{"$f":"IF(A48>0,VLOOKUP(A48,Tableau6[],2,0),\" \")","v":" "}," "]
[null," ",{"$f":"IF(A49>0,VLOOKUP(A49,Tableau6[],2,0),\" \")","v":" "}," "]
{"$rows_empty":1975}
["Moi","15/12/2014","Moisson","Sous la route",{"$f":"VLOOKUP(Tableau1[Parcelle],Tableau7[[Parcelles]:[Campagne]],3,0)","v":{"$error":"#VALUE!"}},{"$f":"VLOOKUP(Tableau1[Parcelle],Tableau7[[Parcelles]:[Campagne]],2,0)","v":{"$error":"#VALUE!"}},"Urée 46%",""]
["Moi","16/12/2014","Pulvérisation","La plaine",{"$f":"VLOOKUP(Tableau1[Parcelle],Tableau7[[Parcelles]:[Campagne]],3,0)","v":{"$error":"#VALUE!"}},{"$f":"VLOOKUP(Tableau1[Parcelle],Tableau7[[Parcelles]:[Campagne]],2,0)","v":{"$error":"#VALUE!"}},"",""]