{"text_format":"3","workbook":"xlsx","n_sheets":3,"sheets":["export","base","Feuil3"],"not_rendered":{"macros":1,"defined_names":1},"read":"whole","date_system":"1900"}

{"sheet":"export","index":0,"n_rows":2,"n_cols":10,"rows_kept":2}
[null,"2014-01-01","2014-02-01","2014-03-01","2014-04-01","2014-05-01","2014-06-01","2014-07-01","2014-08-01","2014-09-01"]
["site1",{"$f":"VLOOKUP($A$2,base!$A:$J,2,0)","v":1},{"$f":"VLOOKUP($A$2,base!$A:$J,3,0)","v":2},{"$f":"VLOOKUP($A$2,base!$A:$J,4,0)","v":3},{"$f":"VLOOKUP($A$2,base!$A:$J,5,0)","v":4},{"$f":"VLOOKUP($A$2,base!$A:$J,6,0)","v":5},{"$f":"VLOOKUP($A$2,base!$A:$J,7,0)","v":6},{"$f":"VLOOKUP($A$2,base!$A:$J,8,0)","v":7},{"$f":"VLOOKUP($A$2,base!$A:$J,9,0)","v":8},{"$f":"VLOOKUP($A$2,base!$A:$J,10,0)","v":9}]

{"sheet":"base","index":1,"n_rows":27,"n_cols":10,"rows_kept":27}
[null,"2014-01-01","2014-02-01","2014-03-01","2014-04-01","2014-05-01","2014-06-01","2014-07-01","2014-08-01","2014-09-01"]
["site1",1,2,3,4,5,6,7,8,9]
["site2",4,2,3,4,5,10,7,8,9]
["site3",7,2,11,4,5,14,7,8,9]
["site4",10,2,19,4,5,18,7,8,9]
["site5",13,2,27,4,5,22,7,13,9]
["site6",16,2,35,4,5,26,7,18,9]
["site7",19,2,43,4,5,30,7,23,9]
["site8",22,2,51,4,5,34,7,28,9]
["site9",25,2,59,4,5,38,7,33,9]
["site10",28,2,67,4,5,42,7,38,9]
["site11",31,2,75,4,5,46,7,43,9]
["site12",34,2,83,4,5,50,7,48,9]
["site13",37,2,91,4,5,54,7,53,9]
["site14",40,2,99,4,5,58,7,58,9]
["site15",43,2,107,4,5,62,7,63,9]
["site16",46,2,115,4,5,66,7,68,9]
["site17",49,2,123,4,5,70,7,73,9]
["site18",52,2,131,4,5,74,7,78,9]
["site19",55,2,139,4,5,78,7,83,9]
["site20",58,2,147,4,5,82,7,88,9]
["site21",61,2,155,4,5,86,7,93,9]
["site22",64,2,163,4,5,90,7,98,9]
["site23",67,2,171,4,5,94,7,103,9]
["site24",70,2,179,4,5,98,7,108,9]
["site25",73,2,187,4,5,102,7,113,9]
["site26",76,2,195,4,5,102,7,118,9]

{"sheet":"Feuil3","index":2,"n_rows":0,"n_cols":0,"rows_kept":0}