Publicité
+ Répondre à la discussion
Affichage des résultats 1 à 15 sur 15
  1. #1
    Membre habitué Avatar de PadawanInPerl
    Profil pro
    Inscrit en
    juillet 2009
    Messages
    410
    Détails du profil
    Informations personnelles :
    Localisation : Suisse

    Informations forums :
    Inscription : juillet 2009
    Messages : 410
    Points : 120
    Points
    120

    Par défaut [PAR::Packer] Compilation de script

    Hello à tous,

    Voilà la bourde :

    je suis passé à Windows 7, je réinstalle tous mon lot de petit programme...
    je vais sur activestate et télécharge bêtement la dernière version 64 bit...

    et paf ! plus de par::packer dans le lot

    Quelqu'un à une idée pour que je puisse faire des exe avec autre chose ou me dire si il y a un autre moyen d'avoir par::packer ?

    Merci

  2. #2
    Responsable Perl et Outils

    Avatar de djibril
    Homme Profil pro
    Inscrit en
    avril 2004
    Messages
    16 570
    Détails du profil
    Informations personnelles :
    Sexe : Homme
    Localisation : France

    Informations forums :
    Inscription : avril 2004
    Messages : 16 570
    Points : 465 317
    Points
    465 317

    Par défaut

    Qu'elle est ta version de Perl ?

    Pas de questions technique par messagerie privée (lisez les règles du forum Perl) et pour les nouveaux !

  3. #3
    Responsable Perl et Outils

    Avatar de djibril
    Homme Profil pro
    Inscrit en
    avril 2004
    Messages
    16 570
    Détails du profil
    Informations personnelles :
    Sexe : Homme
    Localisation : France

    Informations forums :
    Inscription : avril 2004
    Messages : 16 570
    Points : 465 317
    Points
    465 317

    Par défaut

    Je t'avais déjà demandé de lire certaines discussions sur ce forum dans le passé (exemple).

    Pas de questions technique par messagerie privée (lisez les règles du forum Perl) et pour les nouveaux !

  4. #4
    Membre habitué Avatar de PadawanInPerl
    Profil pro
    Inscrit en
    juillet 2009
    Messages
    410
    Détails du profil
    Informations personnelles :
    Localisation : Suisse

    Informations forums :
    Inscription : juillet 2009
    Messages : 410
    Points : 120
    Points
    120

    Par défaut

    perl 5.12

    d'après le lien que tu mets...tu me conseilles de travailler avec Strawberry ?

  5. #5
    Responsable Perl et Outils

    Avatar de djibril
    Homme Profil pro
    Inscrit en
    avril 2004
    Messages
    16 570
    Détails du profil
    Informations personnelles :
    Sexe : Homme
    Localisation : France

    Informations forums :
    Inscription : avril 2004
    Messages : 16 570
    Points : 465 317
    Points
    465 317

    Par défaut

    non !

    Il te faut installer le module comme expliqué dans l'article.

    Pas de questions technique par messagerie privée (lisez les règles du forum Perl) et pour les nouveaux !

  6. #6
    Membre habitué Avatar de PadawanInPerl
    Profil pro
    Inscrit en
    juillet 2009
    Messages
    410
    Détails du profil
    Informations personnelles :
    Localisation : Suisse

    Informations forums :
    Inscription : juillet 2009
    Messages : 410
    Points : 120
    Points
    120

    Par défaut

    Le lien pour le nmake ne semble pas fonctionner...

    En faisant une recherche nmake sur le site, y a trop de résultat, je ne sais pas lequel prendre... as tu un conseil ? ou un autre lien ?

  7. #7
    Membre habitué Avatar de PadawanInPerl
    Profil pro
    Inscrit en
    juillet 2009
    Messages
    410
    Détails du profil
    Informations personnelles :
    Localisation : Suisse

    Informations forums :
    Inscription : juillet 2009
    Messages : 410
    Points : 120
    Points
    120

    Par défaut

    Installation du module PAR:acker
    Afin de tester l'installation, nous allons suivre pas à pas les instructions et tester l'installation du module sur une machine Windows Vista sous ActivePerl 5.12.4 . Sachez que vous pouvez faire les mêmes manipulations pour une version 5.8 ou plus de Perl. Je dirais même qu'elle pourrait être utilisée pour StrawberryPerl.

    Le bon réflexe avant de se lancer est de consulter le README du module. Voici les commandes adéquates assez classiques :
    perl Makefile.PL
    make # ou 'nmake' ou 'dmake' pour Win32
    make test
    make install
    Pour les utilisateurs Windows, nous avons besoin d'un nmake téléchargeable sur le site de Microsoft .
    le lien qui est derrière microsoft ne fonctionne pas...
    Cette page Web est introuvable.
    Aucune page Web trouvée à l'adresse :http://download.microsoft.com/downlo...US/nmake15.exe
    Erreur 6 (net::ERR_FILE_NOT_FOUND) : Fichier ou répertoire introuvable
    je ne peux donc aller plus loin.

    Le seul répertoire que je peux installer dans PPM est Bribes et il n'y a pas par-packer...

    pour rappel, je suis sous :
    - Windows 7 (64bit)
    - activestate
    - perl 5.12

  8. #8
    Membre habitué Avatar de PadawanInPerl
    Profil pro
    Inscrit en
    juillet 2009
    Messages
    410
    Détails du profil
    Informations personnelles :
    Localisation : Suisse

    Informations forums :
    Inscription : juillet 2009
    Messages : 410
    Points : 120
    Points
    120

    Par défaut

    J'ai fini par choper nmake15.exe

  9. #9
    Membre habitué Avatar de PadawanInPerl
    Profil pro
    Inscrit en
    juillet 2009
    Messages
    410
    Détails du profil
    Informations personnelles :
    Localisation : Suisse

    Informations forums :
    Inscription : juillet 2009
    Messages : 410
    Points : 120
    Points
    120

    Par défaut

    fausse joie...impossible d'avoir le fichier nmake15.exe

  10. #10
    Responsable Perl et Outils

    Avatar de djibril
    Homme Profil pro
    Inscrit en
    avril 2004
    Messages
    16 570
    Détails du profil
    Informations personnelles :
    Sexe : Homme
    Localisation : France

    Informations forums :
    Inscription : avril 2004
    Messages : 16 570
    Points : 465 317
    Points
    465 317

    Par défaut

    Il faudrait que je remette à jour cet article car effectivement, le lien n'est plus d'actualité. La meilleure façon est d'essayer d'utiliser l'utilitaire cpan comme expliqué dans cet article : http://djibril.developpez.com/tutori...ation-modules/

    Pas de questions technique par messagerie privée (lisez les règles du forum Perl) et pour les nouveaux !

  11. #11
    Membre habitué Avatar de PadawanInPerl
    Profil pro
    Inscrit en
    juillet 2009
    Messages
    410
    Détails du profil
    Informations personnelles :
    Localisation : Suisse

    Informations forums :
    Inscription : juillet 2009
    Messages : 410
    Points : 120
    Points
    120

    Par défaut

    Hello,

    j'ai eu une aide précieuse de Mochokan qui m'a envoyé nmake15 mais qui n'a pas fonctionné...

    Je me suis résolu à installer Microsoft Visual C++ 2010 Express.

    J'ai relancé le script et voilà le résult :
    Code :
    1
    2
    3
    4
    5
    6
    7
    8
    9
    10
    11
    12
    13
    14
    15
    16
    17
    18
    19
    20
    21
    22
    23
    24
    25
    26
    27
    28
    29
    30
    31
    32
    33
    34
    35
    36
    37
    38
    39
    40
    41
    42
    43
    44
    45
    46
    47
    48
    49
    50
    51
    52
    53
    54
    55
    56
    57
    58
    59
    60
    61
    62
    63
    64
    65
    66
    67
    68
    69
    70
    71
    72
    73
    74
    75
    76
    77
    78
    79
    80
    81
    82
    83
    84
    85
    86
    87
    88
    89
    90
    91
    92
    93
    94
    95
    96
    97
    98
    99
    100
    101
    102
    103
    104
    105
    106
    107
    108
    109
    110
    111
    112
    113
    114
    115
    116
    117
    118
    119
    120
    121
    122
    123
    124
    125
    126
    127
    128
    129
    130
    131
    132
    133
    134
    135
    136
    137
    138
    139
    140
    141
    142
    143
    144
    145
    146
    147
    148
    149
    150
    151
    152
    153
    154
    155
    156
    157
    158
    159
    160
    161
    162
    163
    164
    165
    166
    167
    168
    169
    170
    171
    172
    173
    174
    175
    176
    177
    178
    179
    180
    181
    182
    183
    184
    185
    186
    187
    188
    189
    190
    191
    192
    193
    194
    195
    196
    197
    198
    199
    200
    201
    202
    203
    204
    205
    206
    207
    208
    209
    210
    211
    212
    213
    214
    215
    216
    217
    218
    219
    220
    221
    222
    223
    224
    225
    226
    227
    228
    229
    230
    231
    232
    233
    234
    235
    236
    237
    238
    239
    240
    241
    242
    243
    244
    245
    246
    247
    248
    249
    250
    251
    252
    253
    254
    255
    256
    257
    258
    259
    260
    261
    262
    263
    264
    265
    266
    267
    268
    269
    270
    271
    272
    273
    274
    275
    276
    277
    278
    279
    280
    281
    282
    283
    284
    285
    286
    287
    288
    289
    290
    291
    292
    293
    294
    295
    296
    297
    298
    299
    300
     
    Test Summary Report
    -------------------
    t/MM_Win32.t            (Wstat: 256 Tests: 61 Failed: 1)
      Failed test:  49
      Non-zero exit status: 1
    Files=59, Tests=976, 107 wallclock secs ( 0.50 usr +  0.30 sys =  0.79 CPU)
    Result: FAIL
    Failed 1/59 test programs. 1/976 subtests failed.
    NMAKE : fatal error U1077: 'C:\Perl64\bin\perl.exe'*: code retour '0xff'
    Stop.
      MSCHWERN/ExtUtils-MakeMaker-6.62.tar.gz
      C:\PROGRA~2\MICROS~1.0\VC\bin\nmake.exe test -- NOT OK
    //hint// to see the cpan-testers results for installing this module, try:
      reports MSCHWERN/ExtUtils-MakeMaker-6.62.tar.gz
    Running make install
      make test had returned bad status, won't install without force
    Running make for R/RS/RSCHUPP/PAR-Packer-1.013.tar.gz
    Warning: Prerequisite 'ExtUtils::MakeMaker => 6.57' for 'RSCHUPP/PAR-Packer-1.01
    3.tar.gz' failed when processing 'MSCHWERN/ExtUtils-MakeMaker-6.62.tar.gz' with
    'make_test => NO'. Continuing, but chances to succeed are limited.
     
      CPAN.pm: Going to build R/RS/RSCHUPP/PAR-Packer-1.013.tar.gz
     
    Checking if your kit is complete...
    Looks good
    Warning: prerequisite Module::ScanDeps 1.05 not found. We have 0.97.
    Prototype mismatch: sub main::prompt: none vs ($;$) at C:/Perl64/lib/ExtUtils/Ma
    keMaker.pm line 202
    Note (probably harmless): No library found for oldnames.lib
    Note (probably harmless): No library found for kernel32.lib
    Note (probably harmless): No library found for user32.lib
    Note (probably harmless): No library found for gdi32.lib
    Note (probably harmless): No library found for winspool.lib
    Note (probably harmless): No library found for comdlg32.lib
    Note (probably harmless): No library found for advapi32.lib
    Note (probably harmless): No library found for shell32.lib
    Note (probably harmless): No library found for ole32.lib
    Note (probably harmless): No library found for oleaut32.lib
    Note (probably harmless): No library found for netapi32.lib
    Note (probably harmless): No library found for uuid.lib
    Note (probably harmless): No library found for ws2_32.lib
    Note (probably harmless): No library found for mpr.lib
    Note (probably harmless): No library found for winmm.lib
    Note (probably harmless): No library found for version.lib
    Note (probably harmless): No library found for odbc32.lib
    Note (probably harmless): No library found for odbccp32.lib
    Note (probably harmless): No library found for comctl32.lib
    Note (probably harmless): No library found for bufferoverflowU.lib
    Note (probably harmless): No library found for msvcrt.lib
    Writing Makefile for par.exe
    Writing Makefile for PAR::Packer
    ---- Unsatisfied dependencies detected during ----
    ----      RSCHUPP/PAR-Packer-1.013.tar.gz     ----
        Module::ScanDeps [requires]
    Running make test
      Delayed until after prerequisites
    Running make install
      Delayed until after prerequisites
    Running install for module 'Module::ScanDeps'
    Running make for R/RS/RSCHUPP/Module-ScanDeps-1.08.tar.gz
    Fetching with LWP:
    http://ppm.activestate.com/CPAN/authors/id/R/RS/RSCHUPP/Module-ScanDeps-1.08.tar
    .gz
    Checksum for C:\Perl64\cpan\sources\authors\id\R\RS\RSCHUPP\Module-ScanDeps-1.08
    .tar.gz ok
    Module-ScanDeps-1.08/
    Module-ScanDeps-1.08/inc/
    Module-ScanDeps-1.08/inc/Module/
    Module-ScanDeps-1.08/inc/Module/Install.pm
    Module-ScanDeps-1.08/inc/Module/Install/
    Module-ScanDeps-1.08/inc/Module/Install/Scripts.pm
    Module-ScanDeps-1.08/inc/Module/Install/Win32.pm
    Module-ScanDeps-1.08/inc/Module/Install/Makefile.pm
    Module-ScanDeps-1.08/inc/Module/Install/WriteAll.pm
    Module-ScanDeps-1.08/inc/Module/Install/Fetch.pm
    Module-ScanDeps-1.08/inc/Module/Install/Metadata.pm
    Module-ScanDeps-1.08/inc/Module/Install/Can.pm
    Module-ScanDeps-1.08/inc/Module/Install/Base.pm
    Module-ScanDeps-1.08/script/
    Module-ScanDeps-1.08/script/scandeps.pl
    Module-ScanDeps-1.08/t/
    Module-ScanDeps-1.08/t/6-file-glob.t
    Module-ScanDeps-1.08/t/4-static_functional_interface_options_fake.t
    Module-ScanDeps-1.08/t/5-pluggable_fake.t
    Module-ScanDeps-1.08/t/1-static_functional_interface_real.t
    Module-ScanDeps-1.08/t/17-private_methods.t
    Module-ScanDeps-1.08/t/0-pod.t
    Module-ScanDeps-1.08/t/16-scan_line.t
    Module-ScanDeps-1.08/t/10-case-insensitive-keys.t
    Module-ScanDeps-1.08/t/12-ScanFileRE.t
    Module-ScanDeps-1.08/t/7-check-dynaloader.t
    Module-ScanDeps-1.08/t/2-static_functional_interface_fake.t
    Module-ScanDeps-1.08/t/data/
    Module-ScanDeps-1.08/t/data/file-glob-no.pl
    Module-ScanDeps-1.08/t/data/file-glob-yes.pl
    Module-ScanDeps-1.08/t/data/duplicated_entries/
    Module-ScanDeps-1.08/t/data/duplicated_entries/Scoped/
    Module-ScanDeps-1.08/t/data/duplicated_entries/Scoped/Package.pm
    Module-ScanDeps-1.08/t/data/duplicated_entries/use_scoped_package.pl
    Module-ScanDeps-1.08/t/data/static/
    Module-ScanDeps-1.08/t/data/static/Duplicated.pm
    Module-ScanDeps-1.08/t/data/static/useVERSION.pm
    Module-ScanDeps-1.08/t/data/static/TestD.pm
    Module-ScanDeps-1.08/t/data/static/inner_diamond_W.pm
    Module-ScanDeps-1.08/t/data/static/null.pl
    Module-ScanDeps-1.08/t/data/static/chicken.pm
    Module-ScanDeps-1.08/t/data/static/Duplicator.pl
    Module-ScanDeps-1.08/t/data/static/inner_diamond_S.pm
    Module-ScanDeps-1.08/t/data/static/InputA.pl
    Module-ScanDeps-1.08/t/data/static/outer_diamond_E.pm
    Module-ScanDeps-1.08/t/data/static/outer_diamond_W.pm
    Module-ScanDeps-1.08/t/data/static/TestA.pm
    Module-ScanDeps-1.08/t/data/static/inner_diamond_E.pm
    Module-ScanDeps-1.08/t/data/static/TestC.pm
    Module-ScanDeps-1.08/t/data/static/TestB.pm
    Module-ScanDeps-1.08/t/data/static/outer_diamond_N.pm
    Module-ScanDeps-1.08/t/data/static/egg.pm
    Module-ScanDeps-1.08/t/data/static/InputC.pl
    Module-ScanDeps-1.08/t/data/static/inner_diamond_N.pm
    Module-ScanDeps-1.08/t/data/static/outer_diamond_S.pm
    Module-ScanDeps-1.08/t/data/static/InputB.pl
    Module-ScanDeps-1.08/t/data/ScanFileRE/
    Module-ScanDeps-1.08/t/data/ScanFileRE/example_too.pm
    Module-ScanDeps-1.08/t/data/ScanFileRE/example.pm
    Module-ScanDeps-1.08/t/data/ScanFileRE/auto/
    Module-ScanDeps-1.08/t/data/ScanFileRE/auto/example/
    Module-ScanDeps-1.08/t/data/ScanFileRE/auto/example/example.h
    Module-ScanDeps-1.08/t/data/use_lib.pl
    Module-ScanDeps-1.08/t/data/pluggable/
    Module-ScanDeps-1.08/t/data/pluggable/Foo.pm
    Module-ScanDeps-1.08/t/data/pluggable/Foo/
    Module-ScanDeps-1.08/t/data/pluggable/Foo/Plugin/
    Module-ScanDeps-1.08/t/data/pluggable/Foo/Plugin/Bar.pm
    Module-ScanDeps-1.08/t/data/pluggable/Foo/Plugin/Baz.pm
    Module-ScanDeps-1.08/t/data/case-insensitive-keys/
    Module-ScanDeps-1.08/t/data/case-insensitive-keys/this_case.pl
    Module-ScanDeps-1.08/t/data/case-insensitive-keys/Test.pm
    Module-ScanDeps-1.08/t/data/case-insensitive-keys/that_case.pl
    Module-ScanDeps-1.08/t/data/case-insensitive-keys/Test2.pm
    Module-ScanDeps-1.08/t/data/check_path_to_inc_name/
    Module-ScanDeps-1.08/t/data/check_path_to_inc_name/Scoped/
    Module-ScanDeps-1.08/t/data/check_path_to_inc_name/Scoped/Package.pm
    Module-ScanDeps-1.08/t/data/check_path_to_inc_name/Some.pm
    Module-ScanDeps-1.08/t/data/check_path_to_inc_name/use_scoped_package.pl
    Module-ScanDeps-1.08/t/Utils.pm
    Module-ScanDeps-1.08/t/14-scan_chunk.t
    Module-ScanDeps-1.08/t/9-check_path_to_inc_name.t
    Module-ScanDeps-1.08/t/8-check_duplicated_entries.t
    Module-ScanDeps-1.08/t/14-static_functional_cached.t
    Module-ScanDeps-1.08/t/13-static_prefork_test.t
    Module-ScanDeps-1.08/t/3-static_oo_interface_real.t
    Module-ScanDeps-1.08/Makefile.PL
    Module-ScanDeps-1.08/lib/
    Module-ScanDeps-1.08/lib/Module/
    Module-ScanDeps-1.08/lib/Module/ScanDeps/
    Module-ScanDeps-1.08/lib/Module/ScanDeps/Cache.pm
    Module-ScanDeps-1.08/lib/Module/ScanDeps/DataFeed.pm
    Module-ScanDeps-1.08/lib/Module/ScanDeps.pm
    Module-ScanDeps-1.08/Changes
    Module-ScanDeps-1.08/MANIFEST
    Module-ScanDeps-1.08/README
    Module-ScanDeps-1.08/AUTHORS
    Module-ScanDeps-1.08/META.yml
    ---- Unsatisfied dependencies detected during ----
    ----    RSCHUPP/Module-ScanDeps-1.08.tar.gz   ----
        ExtUtils::MakeMaker [build_requires]
    Running make test
      Make had some problems, won't test
      Delayed until after prerequisites
    Running make install
      Make had some problems, won't install
      Delayed until after prerequisites
    Running install for module 'ExtUtils::MakeMaker'
    Running make install
      make test had returned bad status, won't install without force
    Running make for R/RS/RSCHUPP/Module-ScanDeps-1.08.tar.gz
    Warning: Prerequisite 'ExtUtils::MakeMaker => 6.57' for 'RSCHUPP/Module-ScanDeps
    -1.08.tar.gz' failed when processing 'MSCHWERN/ExtUtils-MakeMaker-6.62.tar.gz' w
    ith 'make_test => NO'. Continuing, but chances to succeed are limited.
     
      CPAN.pm: Going to build R/RS/RSCHUPP/Module-ScanDeps-1.08.tar.gz
     
    Checking if your kit is complete...
    Looks good
    Writing Makefile for Module::ScanDeps
     
    Microsoft (R) Program Maintenance Utility Version 10.00.30319.01
    Copyright (C) Microsoft Corporation. Tous droits réservés.
     
    cp lib/Module/ScanDeps/Cache.pm blib\lib\Module\ScanDeps\Cache.pm
    cp lib/Module/ScanDeps/DataFeed.pm blib\lib\Module\ScanDeps\DataFeed.pm
    cp lib/Module/ScanDeps.pm blib\lib\Module\ScanDeps.pm
            C:\Perl64\bin\perl.exe "-Iinc" -MExtUtils::Command -e "cp" -- script/sca
    ndeps.pl blib\script\scandeps.pl
            pl2bat.bat blib\script\scandeps.pl
      RSCHUPP/Module-ScanDeps-1.08.tar.gz
      C:\PROGRA~2\MICROS~1.0\VC\bin\nmake.exe -- OK
    Running make test
     
    Microsoft (R) Program Maintenance Utility Version 10.00.30319.01
    Copyright (C) Microsoft Corporation. Tous droits réservés.
     
            C:\Perl64\bin\perl.exe "-MExtUtils::Command::MM" "-e" "test_harness(0, '
    inc', 'blib\lib', 'blib\arch')" t/*.t
    t/0-pod.t ....................................... skipped: Test::Pod 1.00 requir
    ed for testing POD
    t/1-static_functional_interface_real.t .......... ok
    t/10-case-insensitive-keys.t .................... ok
    t/12-ScanFileRE.t ............................... ok
    t/13-static_prefork_test.t ...................... skipped: This test requires pr
    efork.pm which is not installed. Skipping.
    t/14-scan_chunk.t ............................... ok
    t/14-static_functional_cached.t ................. 1/? 0
    Couldn't retrieve data from file deps_cache.dat. Building new cache.
    t/14-static_functional_cached.t ................. ok
    t/16-scan_line.t ................................ ok
    t/17-private_methods.t .......................... ok
    t/2-static_functional_interface_fake.t .......... ok
    t/3-static_oo_interface_real.t .................. ok
    t/4-static_functional_interface_options_fake.t .. ok
    t/5-pluggable_fake.t ............................ ok
    t/6-file-glob.t ................................. ok
    t/7-check-dynaloader.t .......................... # dynamic modules used for tes
    t: Cwd File::Glob Data::Dumper List::Util Time::HiRes Compress::Raw::Zlib
    t/7-check-dynaloader.t .......................... 1/36 C:\Users\MOI\AppData\Lo
    cal\Temp\5NKaotltcu syntax OK
    t/7-check-dynaloader.t .......................... 3/36 C:\Users\MOI\AppData\Lo
    cal\Temp\sdfD5NEacL syntax OK
    C:\Users\MOI\AppData\Local\Temp\81dVIUN5pi syntax OK
    C:\Users\MOI\AppData\Local\Temp\vK9p7v4ab3 syntax OK
    t/7-check-dynaloader.t .......................... 23/36 C:\Users\MOI\AppData\L
    ocal\Temp\EQWdMfbibn syntax OK
    C:\Users\MOI\AppData\Local\Temp\5n6aEfQ3sZ syntax OK
    t/7-check-dynaloader.t .......................... ok
    t/8-check_duplicated_entries.t .................. ok
    t/9-check_path_to_inc_name.t .................... ok
    All tests successful.
    Files=17, Tests=31299, 60 wallclock secs ( 3.54 usr +  0.20 sys =  3.74 CPU)
    Result: PASS
      RSCHUPP/Module-ScanDeps-1.08.tar.gz
      C:\PROGRA~2\MICROS~1.0\VC\bin\nmake.exe test -- OK
    Running make install
    Prepending C:\Perl64\cpan\build\Module-ScanDeps-1.08-qObA1q/blib/arch C:\Perl64\
    cpan\build\Module-ScanDeps-1.08-qObA1q/blib/lib to PERL5LIB for 'install'
     
    Microsoft (R) Program Maintenance Utility Version 10.00.30319.01
    Copyright (C) Microsoft Corporation. Tous droits réservés.
     
    Installing C:\Perl64\html\bin\scandeps.html
    Installing C:\Perl64\html\site\lib\Module\ScanDeps.html
    Installing C:\Perl64\site\lib\Module\ScanDeps.pm
    Installing C:\Perl64\site\lib\Module\ScanDeps\DataFeed.pm
    Appending installation info to C:\Perl64\lib/perllocal.pod
      RSCHUPP/Module-ScanDeps-1.08.tar.gz
      C:\PROGRA~2\MICROS~1.0\VC\bin\nmake.exe install  -- OK
    Running make for R/RS/RSCHUPP/PAR-Packer-1.013.tar.gz
      Has already been unwrapped into directory C:\Perl64\cpan\build\PAR-Packer-1.01
    3-LrQwi5
     
      CPAN.pm: Going to build R/RS/RSCHUPP/PAR-Packer-1.013.tar.gz
     
     
    Microsoft (R) Program Maintenance Utility Version 10.00.30319.01
    Copyright (C) Microsoft Corporation. Tous droits réservés.
     
             C:\Perl64\bin\perl.exe "-Minc::Module::Install" -e "extract_par(q(PAR-P
    acker-1.013-MSWin32-x64-multi-thread-5.12.4.par))"
    cp lib/App/Packer/PAR.pm blib\lib\App\Packer\PAR.pm
    cp lib/PAR/Packer.pm blib\lib\PAR\Packer.pm
    cp lib/PAR/Filter/Obfuscate.pm blib\lib\PAR\Filter\Obfuscate.pm
    cp lib/PAR/Filter/PodStrip.pm blib\lib\PAR\Filter\PodStrip.pm
    cp lib/PAR/StrippedPARL/Base.pm blib\lib\PAR\StrippedPARL\Base.pm
    cp lib/PAR/Filter.pm blib\lib\PAR\Filter.pm
    cp lib/PAR/Filter/PatchContent.pm blib\lib\PAR\Filter\PatchContent.pm
    cp lib/PAR/Filter/Bytecode.pm blib\lib\PAR\Filter\Bytecode.pm
    cp lib/pp.pm blib\lib\pp.pm
    cp lib/PAR/Filter/Bleach.pm blib\lib\PAR\Filter\Bleach.pm
            C:\PROGRA~2\MICROS~1.0\VC\bin\nmake.exe -f Makefile all -nologo
            C:\Perl64\bin\perl.exe file2c.pl -s ..\script\par.pl my_par_pl.c load_my
    _par_pl
            C:\Perl64\bin\perl.exe sha1.c.PL
            cl -c -Zm1000  -nologo -GF -W3 -MD -Zi -DNDEBUG -Ox -GL -fp:precise -DWI
    N32 -D_CONSOLE -DNO_STRICT -DHAVE_DES_FCRYPT -DWIN64 -DCONSERVATIVE -DUSE_SITECU
    STOMIZE -DPERL_IMPLICIT_CONTEXT -DPERL_IMPLICIT_SYS -DUSE_PERLIO  -I"C:\Perl64\l
    ib\CORE"  -DPARL_EXE=\"parl.exe\" -MD -Zi -DNDEBUG -Ox -GL -fp:precise main.c
    NMAKE : fatal error U1077: '"C:\Program Files (x86)\Microsoft Visual Studio 10.0
    \VC\bin\cl.EXE"'*: code retour '0xc0000135'
    Stop.
    NMAKE : fatal error U1077: 'C:\PROGRA~2\MICROS~1.0\VC\bin\nmake.exe'*: code reto
    ur '0x2'
    Stop.
      RSCHUPP/PAR-Packer-1.013.tar.gz
      C:\PROGRA~2\MICROS~1.0\VC\bin\nmake.exe -- NOT OK
    Running make test
      Can't test without successful make
    Running make install
      Make had returned bad status, install seems impossible
     
    C:\Users\MOI\Desktop\Script PERL>
    Un dernier conseil ou info ?
    Windows 7, 64 bit
    Perl 5.12, ActivePerl
    Python 3.2, ActivePython ( NOVICE ! )

  12. #12
    Responsable Perl et Outils

    Avatar de djibril
    Homme Profil pro
    Inscrit en
    avril 2004
    Messages
    16 570
    Détails du profil
    Informations personnelles :
    Sexe : Homme
    Localisation : France

    Informations forums :
    Inscription : avril 2004
    Messages : 16 570
    Points : 465 317
    Points
    465 317

    Par défaut

    Tu as installé quoi et désinstallé quoi ?

    Pas de questions technique par messagerie privée (lisez les règles du forum Perl) et pour les nouveaux !

  13. #13
    Membre habitué Avatar de PadawanInPerl
    Profil pro
    Inscrit en
    juillet 2009
    Messages
    410
    Détails du profil
    Informations personnelles :
    Localisation : Suisse

    Informations forums :
    Inscription : juillet 2009
    Messages : 410
    Points : 120
    Points
    120

    Par défaut

    J'ai juste essayé d'installer nmake15.exe qui n'a pas fonctionner
    et j'ai installé : Microsoft Visual C++ 2010 Express

    Puis relancer le script d'instal qu'il y a dans le tutoriel.
    Windows 7, 64 bit
    Perl 5.12, ActivePerl
    Python 3.2, ActivePython ( NOVICE ! )

  14. #14
    Responsable Perl et Outils

    Avatar de djibril
    Homme Profil pro
    Inscrit en
    avril 2004
    Messages
    16 570
    Détails du profil
    Informations personnelles :
    Sexe : Homme
    Localisation : France

    Informations forums :
    Inscription : avril 2004
    Messages : 16 570
    Points : 465 317
    Points
    465 317

    Par défaut

    Tu as viré le nmake que tu avais installé ?
    Dans ton path, tu as mis C:\Program Files (x86)\Microsoft Visual Studio 10.0\VC\bin ?
    Ensuite, dans une nouvelle console DOS, tu as lancé le programme de cet article.

    Pas de questions technique par messagerie privée (lisez les règles du forum Perl) et pour les nouveaux !

  15. #15
    Membre habitué Avatar de PadawanInPerl
    Profil pro
    Inscrit en
    juillet 2009
    Messages
    410
    Détails du profil
    Informations personnelles :
    Localisation : Suisse

    Informations forums :
    Inscription : juillet 2009
    Messages : 410
    Points : 120
    Points
    120

    Par défaut

    Djibril a encore frappé

    Je suis donc repassé en 32bits et tous fonctionne correctement

    Merci Djibril
    Windows 7, 64 bit
    Perl 5.12, ActivePerl
    Python 3.2, ActivePython ( NOVICE ! )

+ Répondre à la discussion
Cette discussion est résolue.

Liens sociaux

Règles de messages

  • Vous ne pouvez pas créer de nouvelles discussions
  • Vous ne pouvez pas envoyer des réponses
  • Vous ne pouvez pas envoyer des pièces jointes
  • Vous ne pouvez pas modifier vos messages
  •